{"text_format":"1","workbook":"xlsx","n_sheets":13,"sheets":["Micro canal","cal","NL","EN","DE","FR","NR","SP","SW","TS","ExtraTaal1","ExtraTaal2","ExtraTaal3"],"not_rendered":{"charts":0,"images":5,"macros":1,"external_links":0,"defined_names":16,"comments":1,"pivot_tables":0},"unopened":[],"bounds":{"document_bytes":16777216,"sheet_cells":100000,"rows_first":2000,"rows_last":500,"rows_between":2000,"halvings":0,"cell_chars":16384,"cell_head_chars":4096},"cells_cut":0,"cells_raw":0,"read":"whole","date_system":"1900"}

{"sheet":"Micro canal","index":0,"n_rows":73,"n_cols":16,"rows_kept":73,"cut":false,"hidden":false,"merged":[[0,12,0,16],[1,12,1,16],[2,12,2,16],[1,1,1,11],[11,1,11,3],[9,12,9,13],[5,10,5,13],[4,6,4,9],[3,10,4,11],[10,1,10,3],[9,1,9,3],[3,12,3,13],[4,12,4,13],[10,12,13,13],[4,1,4,3],[3,6,3,9],[5,6,5,9],[29,6,33,6],[29,7,33,7],[29,8,33,8],[29,9,33,9],[46,1,46,15],[52,1,52,15],[58,1,58,15],[35,6,39,6],[35,7,39,7],[41,9,45,9],[41,8,45,8],[41,7,45,7],[41,6,45,6],[64,1,64,15],[16,1,16,15],[22,1,22,15],[28,1,28,15],[34,1,34,15],[40,1,40,15],[17,6,21,6],[17,7,21,7],[17,8,21,8],[17,9,21,9],[35,8,39,8],[35,9,39,9],[23,6,27,6],[23,7,27,7],[23,8,27,8],[23,9,27,9]]}
[]
[null,"Selectiontool Micro Canal"]
[]
[null,null,null,null,null,null,"Taal/Language/Sprache",0,0,0,"English"]
[null,null,null,null,null,null,"Langue/Språk/Lengua/Jazyk"]
[null,null,null,null,null,null,{"$f":"IF(cal!$S$7=1,\"Uitvoering\",IF(cal!$S$7=2,\"Version\",IF(cal!$S$7=3,\"Ausfürhung\",IF(cal!$S$7=4,\"Version\",IF(cal!$S$7=5,\"Modell\",IF(cal!$S$7=6,\"Version\",IF(cal!$S$7=7,\"Modell\",IF(cal!$S$7=8,\"Verze\",IF(cal!$S$7=9,\"Version\",IF(cal!$S$7=10,\"Version\",IF(cal!$S$7=11,\"Version\",)))))))))))","v":"Version"},null,null,null,"Micro H6 B14"]
[]
[null,{"$f":"cal!B7","v":"Temperatures"}]
[null,{"$f":"cal!B8","v":"Heating:"},null,null,null,null,null,null,null,null,null,null,0,0]
[null,{"$f":"cal!B9","v":"Inlet temp."},null,null,75,null,null,null,null,null,null,null,{"$f":"cal!M9","v":"Unit conversion"}]
[null,{"$f":"cal!B10","v":"Return temp."},{"$f":"cal!C10","v":0},{"$f":"cal!D10","v":0},65]
[null,{"$f":"cal!B11","v":"Room temp."},{"$f":"cal!C11","v":0},{"$f":"cal!D11","v":0},20]
[]
[]
[null,null,null,{"$f":"cal!D14","v":0},{"$f":"cal!E14","v":1},{"$f":"cal!F14","v":1},3.4121416331000001,{"$f":"cal!H14","v":1},{"$f":"cal!I14","v":1},{"$f":"cal!J14","v":1},{"$f":"cal!K14","v":0},{"$f":"cal!L14","v":0},{"$f":"cal!M14","v":0},{"$f":"cal!N14","v":1}]
[null,{"$f":"cal!B15","v":"Speed level:"},{"$f":"cal!C15","v":"Control voltage [V]"},{"$f":"cal!D15","v":"Heat output * 75/65/20 [W]"},{"$f":"cal!E15","v":"Water flowrate, heating [l/h]"},{"$f":"cal!F15","v":"Watersided pressure loss [kPa]"},null,null,null,null,{"$f":"cal!K15","v":"Sound pressure *** [dB(A)]"},{"$f":"cal!L15","v":"Sound power ** [dB(A)]"},{"$f":"cal!M15","v":"Electrical power [W]"},{"$f":"cal!N15","v":"Air flowrate [m³/h]"},{"$f":"cal!O15","v":"Air exhaust temp. heating [°C]"},{"$f":"cal!P15","v":"Air exhaust temp. cooling [°C]"}]
[null,{"$f":"cal!B16","v":"Micro Canal height 6 cm width 14 cm length 60 cm (Type 1)"}]
[null,{"$f":"cal!B17","v":0.2},{"$f":"cal!C17","v":2},{"$f":"IF($E$10<=$E$11,cal!$AC$3,cal!D17)","v":59.699999999999996},{"$f":"IF($E$10<=$E$11,\"\",cal!E17)","v":5},{"$f":"IF($E$10<=$E$11,\"\",cal!F17)","v":1.1425873686146527E-3},null,null,null,null,{"$f":"cal!K17","v":13.8},{"$f":"cal!L17","v":21.8},{"$f":"cal!M17","v":0.51},{"$f":"cal!N17","v":11}]
[null,{"$f":"cal!B18","v":0.4},{"$f":"cal!C18","v":4},{"$f":"IF($E$10<=$E$11,cal!$AC$4,cal!D18)","v":156.9},{"$f":"IF($E$10<=$E$11,\"\",cal!E18)","v":13},{"$f":"IF($E$10<=$E$11,\"\",cal!F18)","v":6.7175217997448257E-3},null,null,null,null,{"$f":"cal!K18","v":14.899999999999999},{"$f":"cal!L18","v":22.9},{"$f":"cal!M18","v":0.75},{"$f":"cal!N18","v":19}]
[null,{"$f":"cal!B19","v":0.6},{"$f":"cal!C19","v":6},{"$f":"IF($E$10<=$E$11,\"\",cal!D19)","v":315.89999999999998},{"$f":"IF($E$10<=$E$11,\"\",cal!E19)","v":27},{"$f":"IF($E$10<=$E$11,\"\",cal!F19)","v":2.4300253860054872E-2},null,null,null,null,{"$f":"cal!K19","v":18.8},{"$f":"cal!L19","v":26.8},{"$f":"cal!M19","v":1.17},{"$f":"cal!N19","v":29}]
[null,{"$f":"cal!B20","v":0.8},{"$f":"cal!C20","v":8},{"$f":"IF($E$10<=$E$11,\"\",cal!D20)","v":420.9},{"$f":"IF($E$10<=$E$11,\"\",cal!E20)","v":36},{"$f":"IF($E$10<=$E$11,\"\",cal!F20)","v":4.1201808913652688E-2},null,null,null,null,{"$f":"cal!K20","v":31.6},{"$f":"cal!L20","v":39.6},{"$f":"cal!M20","v":1.79},{"$f":"cal!N20","v":40}]
[null,{"$f":"cal!B21","v":1},{"$f":"cal!C21","v":10},{"$f":"IF($E$10<=$E$11,\"\",cal!D21)","v":494.7},{"$f":"IF($E$10<=$E$11,\"\",cal!E21)","v":43},{"$f":"IF($E$10<=$E$11,\"\",cal!F21)","v":5.5474898550123948E-2},null,null,null,null,{"$f":"cal!K21","v":39.200000000000003},{"$f":"cal!L21","v":47.2},{"$f":"cal!M21","v":2.67},{"$f":"cal!N21","v":65}]
[null,{"$f":"cal!B22","v":"Micro Canal height 6 cm width 14 cm length 95 cm (Type 2)"}]
[null,{"$f":"cal!B23","v":0.2},{"$f":"cal!C23","v":2},{"$f":"IF($E$10<=$E$11,cal!$AC$3,cal!D23)","v":129.35},{"$f":"IF($E$10<=$E$11,\"\",cal!E23)","v":11},{"$f":"IF($E$10<=$E$11,\"\",cal!F23)","v":8.1804988909735012E-3},null,null,null,null,{"$f":"cal!K23","v":14.3},{"$f":"cal!L23","v":22.3},{"$f":"cal!M23","v":0.52},{"$f":"cal!N23","v":18}]
[null,{"$f":"cal!B24","v":0.4},{"$f":"cal!C24","v":4},{"$f":"IF($E$10<=$E$11,cal!$AC$4,cal!D24)","v":339.95},{"$f":"IF($E$10<=$E$11,\"\",cal!E24)","v":29},{"$f":"IF($E$10<=$E$11,\"\",cal!F24)","v":4.7659438328917308E-2},null,null,null,null,{"$f":"cal!K24","v":17.399999999999999},{"$f":"cal!L24","v":25.4},{"$f":"cal!M24","v":0.87},{"$f":"cal!N24","v":30}]
[null,{"$f":"cal!B25","v":0.6},{"$f":"cal!C25","v":6},{"$f":"IF($E$10<=$E$11,\"\",cal!D25)","v":684.45},{"$f":"IF($E$10<=$E$11,\"\",cal!E25)","v":59},{"$f":"IF($E$10<=$E$11,\"\",cal!F25)","v":0.17112857897053232},null,null,null,null,{"$f":"cal!K25","v":25.5},{"$f":"cal!L25","v":33.5},{"$f":"cal!M25","v":1.53},{"$f":"cal!N25","v":50}]
[null,{"$f":"cal!B26","v":0.8},{"$f":"cal!C26","v":8},{"$f":"IF($E$10<=$E$11,\"\",cal!D26)","v":911.95},{"$f":"IF($E$10<=$E$11,\"\",cal!E26)","v":78},{"$f":"IF($E$10<=$E$11,\"\",cal!F26)","v":0.28920796013227545},null,null,null,null,{"$f":"cal!K26","v":36.1},{"$f":"cal!L26","v":44.1},{"$f":"cal!M26","v":2.46},{"$f":"cal!N26","v":74}]
[null,{"$f":"cal!B27","v":1},{"$f":"cal!C27","v":10},{"$f":"IF($E$10<=$E$11,\"\",cal!D27)","v":1071.8500000000001},{"$f":"IF($E$10<=$E$11,\"\",cal!E27)","v":92},{"$f":"IF($E$10<=$E$11,\"\",cal!F27)","v":0.38865796493862237},null,null,null,null,{"$f":"cal!K27","v":42.5},{"$f":"cal!L27","v":50.5},{"$f":"cal!M27","v":3.84},{"$f":"cal!N27","v":98}]
[null,{"$f":"cal!B28","v":"Micro Canal height 6 cm width 14 cm length 130 cm (Type 3)"}]
[null,{"$f":"cal!B29","v":0.2},{"$f":"cal!C29","v":2},{"$f":"IF($E$10<=$E$11,cal!$AC$3,cal!D29)","v":199},{"$f":"IF($E$10<=$E$11,\"\",cal!E29)","v":17},{"$f":"IF($E$10<=$E$11,\"\",cal!F29)","v":2.5487791512859199E-2},null,null,null,null,{"$f":"cal!K29","v":13.899999999999999},{"$f":"cal!L29","v":21.9},{"$f":"cal!M29","v":0.54},{"$f":"cal!N29","v":26}]
[null,{"$f":"cal!B30","v":0.4},{"$f":"cal!C30","v":4},{"$f":"IF($E$10<=$E$11,cal!$AC$4,cal!D30)","v":523},{"$f":"IF($E$10<=$E$11,\"\",cal!E30)","v":45},{"$f":"IF($E$10<=$E$11,\"\",cal!F30)","v":0.14787039100998542},null,null,null,null,{"$f":"cal!K30","v":15.2},{"$f":"cal!L30","v":23.2},{"$f":"cal!M30","v":0.95},{"$f":"cal!N30","v":41}]
[null,{"$f":"cal!B31","v":0.6},{"$f":"cal!C31","v":6},{"$f":"IF($E$10<=$E$11,\"\",cal!D31)","v":1053},{"$f":"IF($E$10<=$E$11,\"\",cal!E31)","v":91},{"$f":"IF($E$10<=$E$11,\"\",cal!F31)","v":0.52911427842315595},null,null,null,null,{"$f":"cal!K31","v":26.4},{"$f":"cal!L31","v":34.4},{"$f":"cal!M31","v":1.62},{"$f":"cal!N31","v":67}]
[null,{"$f":"cal!B32","v":0.8},{"$f":"cal!C32","v":8},{"$f":"IF($E$10<=$E$11,\"\",cal!D32)","v":1403},{"$f":"IF($E$10<=$E$11,\"\",cal!E32)","v":121},{"$f":"IF($E$10<=$E$11,\"\",cal!F32)","v":0.89283420159553806},null,null,null,null,{"$f":"cal!K32","v":37.200000000000003},{"$f":"cal!L32","v":45.2},{"$f":"cal!M32","v":2.65},{"$f":"cal!N32","v":99}]
[null,{"$f":"cal!B33","v":1},{"$f":"cal!C33","v":10},{"$f":"IF($E$10<=$E$11,\"\",cal!D33)","v":1649},{"$f":"IF($E$10<=$E$11,\"\",cal!E33)","v":142},{"$f":"IF($E$10<=$E$11,\"\",cal!F33)","v":1.1987811623016493},null,null,null,null,{"$f":"cal!K33","v":41.8},{"$f":"cal!L33","v":49.8},{"$f":"cal!M33","v":4.1399999999999997},{"$f":"cal!N33","v":130}]
[null,{"$f":"cal!B34","v":"Micro Canal height 6 cm width 14 cm length 165 cm (Type 4)"}]
[null,{"$f":"cal!B35","v":0.2},{"$f":"cal!C35","v":2},{"$f":"IF($E$10<=$E$11,cal!$AC$3,cal!D35)","v":268.65000000000003},{"$f":"IF($E$10<=$E$11,\"\",cal!E35)","v":23},{"$f":"IF($E$10<=$E$11,\"\",cal!F35)","v":5.6966963176685495E-2},null,null,null,null,{"$f":"cal!K35","v":17.3},{"$f":"cal!L35","v":25.3},{"$f":"cal!M35","v":1.04},{"$f":"cal!N35","v":36}]
[null,{"$f":"cal!B36","v":0.4},{"$f":"cal!C36","v":4},{"$f":"IF($E$10<=$E$11,cal!$AC$4,cal!D36)","v":706.05000000000007},{"$f":"IF($E$10<=$E$11,\"\",cal!E36)","v":61},{"$f":"IF($E$10<=$E$11,\"\",cal!F36)","v":0.32969062642810371},null,null,null,null,{"$f":"cal!K36","v":20.399999999999999},{"$f":"cal!L36","v":28.4},{"$f":"cal!M36","v":1.74},{"$f":"cal!N36","v":60}]
[null,{"$f":"cal!B37","v":0.6},{"$f":"cal!C37","v":6},{"$f":"IF($E$10<=$E$11,\"\",cal!D37)","v":1421.5500000000002},{"$f":"IF($E$10<=$E$11,\"\",cal!E37)","v":122},{"$f":"IF($E$10<=$E$11,\"\",cal!F37)","v":1.1773030202437731},null,null,null,null,{"$f":"cal!K37","v":28.5},{"$f":"cal!L37","v":36.5},{"$f":"cal!M37","v":3.06},{"$f":"cal!N37","v":100}]
[null,{"$f":"cal!B38","v":0.8},{"$f":"cal!C38","v":8},{"$f":"IF($E$10<=$E$11,\"\",cal!D38)","v":1894.0500000000002},{"$f":"IF($E$10<=$E$11,\"\",cal!E38)","v":163},{"$f":"IF($E$10<=$E$11,\"\",cal!F38)","v":1.9847946062562469},null,null,null,null,{"$f":"cal!K38","v":39.1},{"$f":"cal!L38","v":47.1},{"$f":"cal!M38","v":4.92},{"$f":"cal!N38","v":148}]
[null,{"$f":"cal!B39","v":1},{"$f":"cal!C39","v":10},{"$f":"IF($E$10<=$E$11,\"\",cal!D39)","v":2226.15},{"$f":"IF($E$10<=$E$11,\"\",cal!E39)","v":191},{"$f":"IF($E$10<=$E$11,\"\",cal!F39)","v":2.6635119539217489},null,null,null,null,{"$f":"cal!K39","v":45.5},{"$f":"cal!L39","v":53.5},{"$f":"cal!M39","v":7.68},{"$f":"cal!N39","v":196}]
[null,{"$f":"cal!B40","v":"Micro Canal height 6 cm width 14 cm length 200 cm (Type 5)"}]
[null,{"$f":"cal!B41","v":0.2},{"$f":"cal!C41","v":2},{"$f":"IF($E$10<=$E$11,cal!$AC$3,cal!D41)","v":338.3},{"$f":"IF($E$10<=$E$11,\"\",cal!E41)","v":29},{"$f":"IF($E$10<=$E$11,\"\",cal!F41)","v":0.10626158757102755},null,null,null,null,{"$f":"IF(cal!K41=-8,\"\",cal!K41)","v":17.100000000000001},{"$f":"IF(cal!L41=0,\"\",cal!L41)","v":25.1},{"$f":"IF(cal!M41=0,\"\",cal!M41)","v":1.06},{"$f":"IF(cal!N41=0,\"\",cal!N41)","v":44}]
[null,{"$f":"cal!B42","v":0.4},{"$f":"cal!C42","v":4},{"$f":"IF($E$10<=$E$11,cal!$AC$4,cal!D42)","v":889.1},{"$f":"IF($E$10<=$E$11,\"\",cal!E42)","v":76},{"$f":"IF($E$10<=$E$11,\"\",cal!F42)","v":0.61397815292948499},null,null,null,null,{"$f":"IF(cal!K42=-8,\"\",cal!K42)","v":19.399999999999999},{"$f":"IF(cal!L42=0,\"\",cal!L42)","v":27.4},{"$f":"IF(cal!M42=0,\"\",cal!M42)","v":1.82},{"$f":"IF(cal!N42=0,\"\",cal!N42)","v":71}]
[null,{"$f":"cal!B43","v":0.6},{"$f":"cal!C43","v":6},{"$f":"IF($E$10<=$E$11,\"\",cal!D43)","v":1790.1},{"$f":"IF($E$10<=$E$11,\"\",cal!E43)","v":154},{"$f":"IF($E$10<=$E$11,\"\",cal!F43)","v":2.1894959237320637},null,null,null,null,{"$f":"IF(cal!K43=-8,\"\",cal!K43)","v":29},{"$f":"IF(cal!L43=0,\"\",cal!L43)","v":37},{"$f":"IF(cal!M43=0,\"\",cal!M43)","v":3.15},{"$f":"IF(cal!N43=0,\"\",cal!N43)","v":117}]
[null,{"$f":"cal!B44","v":0.8},{"$f":"cal!C44","v":8},{"$f":"IF($E$10<=$E$11,\"\",cal!D44)","v":2385.1},{"$f":"IF($E$10<=$E$11,\"\",cal!E44)","v":205},{"$f":"IF($E$10<=$E$11,\"\",cal!F44)","v":3.6889978888529815},null,null,null,null,{"$f":"IF(cal!K44=-8,\"\",cal!K44)","v":39.700000000000003},{"$f":"IF(cal!L44=0,\"\",cal!L44)","v":47.7},{"$f":"IF(cal!M44=0,\"\",cal!M44)","v":5.1100000000000003},{"$f":"IF(cal!N44=0,\"\",cal!N44)","v":173}]
[null,{"$f":"cal!B45","v":1},{"$f":"cal!C45","v":10},{"$f":"IF($E$10<=$E$11,\"\",cal!D45)","v":2803.2999999999997},{"$f":"IF($E$10<=$E$11,\"\",cal!E45)","v":241},{"$f":"IF($E$10<=$E$11,\"\",cal!F45)","v":4.9487298621162958},null,null,null,null,{"$f":"IF(cal!K45=-8,\"\",cal!K45)","v":45.2},{"$f":"IF(cal!L45=0,\"\",cal!L45)","v":53.2},{"$f":"IF(cal!M45=0,\"\",cal!M45)","v":7.98},{"$f":"IF(cal!N45=0,\"\",cal!N45)","v":228}]
[null,{"$f":"IF(cal!$X$16=1,\"\",IF(cal!$X$16=2,\"\",cal!B46))","v":""}]
[null,{"$f":"cal!#REF!","v":{"$error":"#REF!"}},{"$f":"cal!C47","v":0},{"$f":"IF($E$10<=$E$11,cal!$AC$3,cal!D47)","v":0},{"$f":"IF($E$10<=$E$11,\"\",cal!E47)","v":0},{"$f":"IF($E$10<=$E$11,\"\",cal!F47)","v":0},{"$f":"IF($I$11>=$K$11,cal!$AC$3,cal!G47)","v":"Temp."},{"$f":"IF($I$11>=$K$11,\"\",cal!H47)","v":""},{"$f":"IF($I$11>=$K$11,\"\",cal!I47)","v":""},{"$f":"IF($I$11>=$K$11,\"\",cal!J47)","v":""},{"$f":"IF(cal!K47=-8,\"\",cal!K47)","v":0},{"$f":"IF(cal!L47=0,\"\",cal!L47)","v":""},{"$f":"IF(cal!M47=0,\"\",cal!M47)","v":""},{"$f":"IF(cal!N47=0,\"\",cal!N47)","v":""}]
[null,{"$f":"cal!#REF!","v":{"$error":"#REF!"}},{"$f":"cal!C48","v":0},{"$f":"IF($E$10<=$E$11,cal!$AC$4,cal!D48)","v":0},{"$f":"IF($E$10<=$E$11,\"\",cal!E48)","v":0},{"$f":"IF($E$10<=$E$11,\"\",cal!F48)","v":0},{"$f":"IF($I$11>=$K$11,cal!$AC$5,cal!G48)","v":"cooling!"},{"$f":"IF($I$11>=$K$11,\"\",cal!H48)","v":""},{"$f":"IF($I$11>=$K$11,\"\",cal!I48)","v":""},{"$f":"IF($I$11>=$K$11,\"\",cal!J48)","v":""},{"$f":"IF(cal!K48=-8,\"\",cal!K48)","v":0},{"$f":"IF(cal!L48=0,\"\",cal!L48)","v":""},{"$f":"IF(cal!M48=0,\"\",cal!M48)","v":""},{"$f":"IF(cal!N48=0,\"\",cal!N48)","v":""}]
[null,{"$f":"cal!#REF!","v":{"$error":"#REF!"}},{"$f":"cal!C49","v":0},{"$f":"IF($E$10<=$E$11,\"\",cal!D49)","v":0},{"$f":"IF($E$10<=$E$11,\"\",cal!E49)","v":0},{"$f":"IF($E$10<=$E$11,\"\",cal!F49)","v":0},{"$f":"IF($I$11>=$K$11,\"\",cal!G49)","v":""},{"$f":"IF($I$11>=$K$11,\"\",cal!H49)","v":""},{"$f":"IF($I$11>=$K$11,\"\",cal!I49)","v":""},{"$f":"IF($I$11>=$K$11,\"\",cal!J49)","v":""},{"$f":"IF(cal!K49=-8,\"\",cal!K49)","v":0},{"$f":"IF(cal!L49=0,\"\",cal!L49)","v":""},{"$f":"IF(cal!M49=0,\"\",cal!M49)","v":""},{"$f":"IF(cal!N49=0,\"\",cal!N49)","v":""}]
[null,{"$f":"cal!B50","v":0},{"$f":"cal!C50","v":0},{"$f":"IF($E$10<=$E$11,\"\",cal!D50)","v":0},{"$f":"IF($E$10<=$E$11,\"\",cal!E50)","v":0},{"$f":"IF($E$10<=$E$11,\"\",cal!F50)","v":0},{"$f":"IF($I$11>=$K$11,\"\",cal!G50)","v":""},{"$f":"IF($I$11>=$K$11,\"\",cal!H50)","v":""},{"$f":"IF($I$11>=$K$11,\"\",cal!I50)","v":""},{"$f":"IF($I$11>=$K$11,\"\",cal!J50)","v":""},{"$f":"IF(cal!K50=-8,\"\",cal!K50)","v":0},{"$f":"IF(cal!L50=0,\"\",cal!L50)","v":""},{"$f":"IF(cal!M50=0,\"\",cal!M50)","v":""},{"$f":"IF(cal!N50=0,\"\",cal!N50)","v":""}]
[null,{"$f":"cal!B51","v":0},{"$f":"cal!C51","v":0},{"$f":"IF($E$10<=$E$11,\"\",cal!D51)","v":0},{"$f":"IF($E$10<=$E$11,\"\",cal!E51)","v":0},{"$f":"IF($E$10<=$E$11,\"\",cal!F51)","v":0},{"$f":"IF($I$11>=$K$11,\"\",cal!G51)","v":""},{"$f":"IF($I$11>=$K$11,\"\",cal!H51)","v":""},{"$f":"IF($I$11>=$K$11,\"\",cal!I51)","v":""},{"$f":"IF($I$11>=$K$11,\"\",cal!J51)","v":""},{"$f":"IF(cal!K51=-8,\"\",cal!K51)","v":0},{"$f":"IF(cal!L51=0,\"\",cal!L51)","v":""},{"$f":"IF(cal!M51=0,\"\",cal!M51)","v":""},{"$f":"IF(cal!N51=0,\"\",cal!N51)","v":""}]
[null,{"$f":"IF(cal!$X$16=1,\"\",IF(cal!$X$16=2,\"\",cal!B52))","v":""}]
[null,{"$f":"cal!B53","v":0},{"$f":"cal!C53","v":0},{"$f":"IF($E$10<=$E$11,cal!$AC$3,cal!D53)","v":0},{"$f":"IF($E$10<=$E$11,\"\",cal!E53)","v":0},{"$f":"IF($E$10<=$E$11,\"\",cal!F53)","v":0},{"$f":"IF($I$11>=$K$11,cal!$AC$3,cal!G53)","v":"Temp."},{"$f":"IF($I$11>=$K$11,\"\",cal!H53)","v":""},{"$f":"IF($I$11>=$K$11,\"\",cal!I53)","v":""},{"$f":"IF($I$11>=$K$11,\"\",cal!J53)","v":""},{"$f":"IF(cal!K53=-8,\"\",cal!K53)","v":0},{"$f":"IF(cal!L53=0,\"\",cal!L53)","v":""},{"$f":"IF(cal!M53=0,\"\",cal!M53)","v":""},{"$f":"IF(cal!N53=0,\"\",cal!N53)","v":""}]
[null,{"$f":"cal!B54","v":0},{"$f":"cal!C54","v":0},{"$f":"IF($E$10<=$E$11,cal!$AC$4,cal!D54)","v":0},{"$f":"IF($E$10<=$E$11,\"\",cal!E54)","v":0},{"$f":"IF($E$10<=$E$11,\"\",cal!F54)","v":0},{"$f":"IF($I$11>=$K$11,cal!$AC$5,cal!G54)","v":"cooling!"},{"$f":"IF($I$11>=$K$11,\"\",cal!H54)","v":""},{"$f":"IF($I$11>=$K$11,\"\",cal!I54)","v":""},{"$f":"IF($I$11>=$K$11,\"\",cal!J54)","v":""},{"$f":"IF(cal!K54=-8,\"\",cal!K54)","v":0},{"$f":"IF(cal!L54=0,\"\",cal!L54)","v":""},{"$f":"IF(cal!M54=0,\"\",cal!M54)","v":""},{"$f":"IF(cal!N54=0,\"\",cal!N54)","v":""}]
[null,{"$f":"cal!B55","v":0},{"$f":"cal!C55","v":0},{"$f":"IF($E$10<=$E$11,\"\",cal!D55)","v":0},{"$f":"IF($E$10<=$E$11,\"\",cal!E55)","v":0},{"$f":"IF($E$10<=$E$11,\"\",cal!F55)","v":0},{"$f":"IF($I$11>=$K$11,\"\",cal!G55)","v":""},{"$f":"IF($I$11>=$K$11,\"\",cal!H55)","v":""},{"$f":"IF($I$11>=$K$11,\"\",cal!I55)","v":""},{"$f":"IF($I$11>=$K$11,\"\",cal!J55)","v":""},{"$f":"IF(cal!K55=-8,\"\",cal!K55)","v":0},{"$f":"IF(cal!L55=0,\"\",cal!L55)","v":""},{"$f":"IF(cal!M55=0,\"\",cal!M55)","v":""},{"$f":"IF(cal!N55=0,\"\",cal!N55)","v":""}]
[null,{"$f":"cal!B56","v":0},{"$f":"cal!C56","v":0},{"$f":"IF($E$10<=$E$11,\"\",cal!D56)","v":0},{"$f":"IF($E$10<=$E$11,\"\",cal!E56)","v":0},{"$f":"IF($E$10<=$E$11,\"\",cal!F56)","v":0},{"$f":"IF($I$11>=$K$11,\"\",cal!G56)","v":""},{"$f":"IF($I$11>=$K$11,\"\",cal!H56)","v":""},{"$f":"IF($I$11>=$K$11,\"\",cal!I56)","v":""},{"$f":"IF($I$11>=$K$11,\"\",cal!J56)","v":""},{"$f":"IF(cal!K56=-8,\"\",cal!K56)","v":0},{"$f":"IF(cal!L56=0,\"\",cal!L56)","v":""},{"$f":"IF(cal!M56=0,\"\",cal!M56)","v":""},{"$f":"IF(cal!N56=0,\"\",cal!N56)","v":""}]
[null,{"$f":"cal!B57","v":0},{"$f":"cal!C57","v":0},{"$f":"IF($E$10<=$E$11,\"\",cal!D57)","v":0},{"$f":"IF($E$10<=$E$11,\"\",cal!E57)","v":0},{"$f":"IF($E$10<=$E$11,\"\",cal!F57)","v":0},{"$f":"IF($I$11>=$K$11,\"\",cal!G57)","v":""},{"$f":"IF($I$11>=$K$11,\"\",cal!H57)","v":""},{"$f":"IF($I$11>=$K$11,\"\",cal!I57)","v":""},{"$f":"IF($I$11>=$K$11,\"\",cal!J57)","v":""},{"$f":"IF(cal!K57=-8,\"\",cal!K57)","v":0},{"$f":"IF(cal!L57=0,\"\",cal!L57)","v":""},{"$f":"IF(cal!M57=0,\"\",cal!M57)","v":""},{"$f":"IF(cal!N57=0,\"\",cal!N57)","v":""}]
[null,{"$f":"IF(cal!$X$16=1,\"\",IF(cal!$X$16=2,\"\",cal!B58))","v":""}]
[null,{"$f":"cal!B59","v":0},{"$f":"cal!C59","v":0},{"$f":"IF($E$10<=$E$11,cal!$AC$3,cal!D59)","v":0},{"$f":"IF($E$10<=$E$11,\"\",cal!E59)","v":0},{"$f":"IF($E$10<=$E$11,\"\",cal!F59)","v":0},{"$f":"IF($I$11>=$K$11,cal!$AC$3,cal!G59)","v":"Temp."},{"$f":"IF($I$11>=$K$11,\"\",cal!H59)","v":""},{"$f":"IF($I$11>=$K$11,\"\",cal!I59)","v":""},{"$f":"IF($I$11>=$K$11,\"\",cal!J59)","v":""},{"$f":"IF(cal!K59=-8,\"\",cal!K59)","v":0},{"$f":"IF(cal!L59=0,\"\",cal!L59)","v":""},{"$f":"IF(cal!M59=0,\"\",cal!M59)","v":""},{"$f":"IF(cal!N59=0,\"\",cal!N59)","v":""}]
[null,{"$f":"cal!B60","v":0},{"$f":"cal!C60","v":0},{"$f":"IF($E$10<=$E$11,cal!$AC$4,cal!D60)","v":0},{"$f":"IF($E$10<=$E$11,\"\",cal!E60)","v":0},{"$f":"IF($E$10<=$E$11,\"\",cal!F60)","v":0},{"$f":"IF($I$11>=$K$11,cal!$AC$5,cal!G60)","v":"cooling!"},{"$f":"IF($I$11>=$K$11,\"\",cal!H60)","v":""},{"$f":"IF($I$11>=$K$11,\"\",cal!I60)","v":""},{"$f":"IF($I$11>=$K$11,\"\",cal!J60)","v":""},{"$f":"IF(cal!K60=-8,\"\",cal!K60)","v":0},{"$f":"IF(cal!L60=0,\"\",cal!L60)","v":""},{"$f":"IF(cal!M60=0,\"\",cal!M60)","v":""},{"$f":"IF(cal!N60=0,\"\",cal!N60)","v":""}]
[null,{"$f":"cal!B61","v":0},{"$f":"cal!C61","v":0},{"$f":"IF($E$10<=$E$11,\"\",cal!D61)","v":0},{"$f":"IF($E$10<=$E$11,\"\",cal!E61)","v":0},{"$f":"IF($E$10<=$E$11,\"\",cal!F61)","v":0},{"$f":"IF($I$11>=$K$11,\"\",cal!G61)","v":""},{"$f":"IF($I$11>=$K$11,\"\",cal!H61)","v":""},{"$f":"IF($I$11>=$K$11,\"\",cal!I61)","v":""},{"$f":"IF($I$11>=$K$11,\"\",cal!J61)","v":""},{"$f":"IF(cal!K61=-8,\"\",cal!K61)","v":0},{"$f":"IF(cal!L61=0,\"\",cal!L61)","v":""},{"$f":"IF(cal!M61=0,\"\",cal!M61)","v":""},{"$f":"IF(cal!N61=0,\"\",cal!N61)","v":""}]
[null,{"$f":"cal!B62","v":0},{"$f":"cal!C62","v":0},{"$f":"IF($E$10<=$E$11,\"\",cal!D62)","v":0},{"$f":"IF($E$10<=$E$11,\"\",cal!E62)","v":0},{"$f":"IF($E$10<=$E$11,\"\",cal!F62)","v":0},{"$f":"IF($I$11>=$K$11,\"\",cal!G62)","v":""},{"$f":"IF($I$11>=$K$11,\"\",cal!H62)","v":""},{"$f":"IF($I$11>=$K$11,\"\",cal!I62)","v":""},{"$f":"IF($I$11>=$K$11,\"\",cal!J62)","v":""},{"$f":"IF(cal!K62=-8,\"\",cal!K62)","v":0},{"$f":"IF(cal!L62=0,\"\",cal!L62)","v":""},{"$f":"IF(cal!M62=0,\"\",cal!M62)","v":""},{"$f":"IF(cal!N62=0,\"\",cal!N62)","v":""}]
[null,{"$f":"cal!B63","v":0},{"$f":"cal!C63","v":0},{"$f":"IF($E$10<=$E$11,\"\",cal!D63)","v":0},{"$f":"IF($E$10<=$E$11,\"\",cal!E63)","v":0},{"$f":"IF($E$10<=$E$11,\"\",cal!F63)","v":0},{"$f":"IF($I$11>=$K$11,\"\",cal!G63)","v":""},{"$f":"IF($I$11>=$K$11,\"\",cal!H63)","v":""},{"$f":"IF($I$11>=$K$11,\"\",cal!I63)","v":""},{"$f":"IF($I$11>=$K$11,\"\",cal!J63)","v":""},{"$f":"IF(cal!K63=-8,\"\",cal!K63)","v":0},{"$f":"IF(cal!L63=0,\"\",cal!L63)","v":""},{"$f":"IF(cal!M63=0,\"\",cal!M63)","v":""},{"$f":"IF(cal!N63=0,\"\",cal!N63)","v":""}]
[null,{"$f":"IF(cal!$X$16=1,\"\",IF(cal!$X$16=2,\"\",cal!B64))","v":""}]
[null,{"$f":"cal!B65","v":0},{"$f":"cal!C65","v":0},{"$f":"IF($E$10<=$E$11,cal!$AC$3,cal!D65)","v":0},{"$f":"IF($E$10<=$E$11,\"\",cal!E65)","v":0},{"$f":"IF($E$10<=$E$11,\"\",cal!F65)","v":0},{"$f":"IF($I$11>=$K$11,cal!$AC$3,cal!G65)","v":"Temp."},{"$f":"IF($I$11>=$K$11,\"\",cal!H65)","v":""},{"$f":"IF($I$11>=$K$11,\"\",cal!I65)","v":""},{"$f":"IF($I$11>=$K$11,\"\",cal!J65)","v":""},{"$f":"IF(cal!K65=-8,\"\",cal!K65)","v":0},{"$f":"IF(cal!L65=0,\"\",cal!L65)","v":""},{"$f":"IF(cal!M65=0,\"\",cal!M65)","v":""},{"$f":"IF(cal!N65=0,\"\",cal!N65)","v":""}]
[null,{"$f":"cal!B66","v":0},{"$f":"cal!C66","v":0},{"$f":"IF($E$10<=$E$11,cal!$AC$4,cal!D66)","v":0},{"$f":"IF($E$10<=$E$11,\"\",cal!E66)","v":0},{"$f":"IF($E$10<=$E$11,\"\",cal!F66)","v":0},{"$f":"IF($I$11>=$K$11,cal!$AC$5,cal!G66)","v":"cooling!"},{"$f":"IF($I$11>=$K$11,\"\",cal!H66)","v":""},{"$f":"IF($I$11>=$K$11,\"\",cal!I66)","v":""},{"$f":"IF($I$11>=$K$11,\"\",cal!J66)","v":""},{"$f":"IF(cal!K66=-8,\"\",cal!K66)","v":0},{"$f":"IF(cal!L66=0,\"\",cal!L66)","v":""},{"$f":"IF(cal!M66=0,\"\",cal!M66)","v":""},{"$f":"IF(cal!N66=0,\"\",cal!N66)","v":""}]
[null,{"$f":"cal!B67","v":0},{"$f":"cal!C67","v":0},{"$f":"IF($E$10<=$E$11,\"\",cal!D67)","v":0},{"$f":"IF($E$10<=$E$11,\"\",cal!E67)","v":0},{"$f":"IF($E$10<=$E$11,\"\",cal!F67)","v":0},{"$f":"IF($I$11>=$K$11,\"\",cal!G67)","v":""},{"$f":"IF($I$11>=$K$11,\"\",cal!H67)","v":""},{"$f":"IF($I$11>=$K$11,\"\",cal!I67)","v":""},{"$f":"IF($I$11>=$K$11,\"\",cal!J67)","v":""},{"$f":"IF(cal!K67=-8,\"\",cal!K67)","v":0},{"$f":"IF(cal!L67=0,\"\",cal!L67)","v":""},{"$f":"IF(cal!M67=0,\"\",cal!M67)","v":""},{"$f":"IF(cal!N67=0,\"\",cal!N67)","v":""}]
[null,{"$f":"cal!B68","v":0},{"$f":"cal!C68","v":0},{"$f":"IF($E$10<=$E$11,\"\",cal!D68)","v":0},{"$f":"IF($E$10<=$E$11,\"\",cal!E68)","v":0},{"$f":"IF($E$10<=$E$11,\"\",cal!F68)","v":0},{"$f":"IF($I$11>=$K$11,\"\",cal!G68)","v":""},{"$f":"IF($I$11>=$K$11,\"\",cal!H68)","v":""},{"$f":"IF($I$11>=$K$11,\"\",cal!I68)","v":""},{"$f":"IF($I$11>=$K$11,\"\",cal!J68)","v":""},{"$f":"IF(cal!K68=-8,\"\",cal!K68)","v":0},{"$f":"IF(cal!L68=0,\"\",cal!L68)","v":""},{"$f":"IF(cal!M68=0,\"\",cal!M68)","v":""},{"$f":"IF(cal!N68=0,\"\",cal!N68)","v":""}]
[null,{"$f":"cal!B69","v":0},{"$f":"cal!C69","v":0},{"$f":"IF($E$10<=$E$11,\"\",cal!D69)","v":0},{"$f":"IF($E$10<=$E$11,\"\",cal!E69)","v":0},{"$f":"IF($E$10<=$E$11,\"\",cal!F69)","v":0},{"$f":"IF($I$11>=$K$11,\"\",cal!G69)","v":""},{"$f":"IF($I$11>=$K$11,\"\",cal!H69)","v":""},{"$f":"IF($I$11>=$K$11,\"\",cal!I69)","v":""},{"$f":"IF($I$11>=$K$11,\"\",cal!J69)","v":""},{"$f":"IF(cal!K69=-8,\"\",cal!K69)","v":0},{"$f":"IF(cal!L69=0,\"\",cal!L69)","v":""},{"$f":"IF(cal!M69=0,\"\",cal!M69)","v":""},{"$f":"IF(cal!N69=0,\"\",cal!N69)","v":""}]
[null,{"$f":"cal!B47","v":"*Values according to EN 16430"},null,null,null,null,null,null,null,null,null,null,null,null,null,"v2022-06-01"]
[null,{"$f":"cal!B48","v":"**Sound power according to ISO 3741:2010"}]
[null,{"$f":"cal!B49","v":"***Sound pressure with an assumed room damping of 8dB(A)"}]

{"sheet":"cal","index":1,"n_rows":70,"n_cols":42,"rows_kept":70,"cut":false,"hidden":true,"merged":[[15,30,15,36],[15,23,15,29],[33,1,33,15],[27,1,27,15],[21,1,21,15],[15,1,15,15],[45,1,45,15],[39,1,39,15],[6,12,6,13],[7,12,7,13],[6,14,6,15],[7,14,7,15],[8,12,8,13],[8,1,8,3],[8,6,8,9],[9,1,9,3],[9,6,9,9],[10,1,10,3],[10,6,10,9]]}
[null,null,null,null,null,null,"Nederlands","English","Deutsch","Français","Norsk","Español","Svenska","Čeština","ExtraTaal1","ExtraTaal2","ExtraTaal3",null,null,null,{"$f":"IF($S$7=1,NL!Q7,IF($S$7=2,EN!Q7,IF($S$7=3,DE!Q7,IF($S$7=4,FR!Q7,IF($S$7=5,NR!Q7,IF($S$7=6,SP!Q7,IF($S$7=7,SW!Q7,IF($S$7=8,TS!Q7,IF($S$7=9,ExtraTaal1!Q7,IF($S$7=10,ExtraTaal2!Q7,IF($S$7=11,ExtraTaal3!Q7,)))))))))))","v":"Copy all data"},null,null,null,null,"Micro Canal"]
[null,null,null,null,null,null,null,null,null,null,null,null,null,null,null,null,null,null,null,null,{"$f":"IF($S$7=1,NL!Q8,IF($S$7=2,EN!Q8,IF($S$7=3,DE!Q8,IF($S$7=4,FR!Q8,IF($S$7=5,NR!Q8,IF($S$7=6,SP!Q8,IF($S$7=7,SW!Q8,IF($S$7=8,TS!Q8,IF($S$7=9,ExtraTaal1!Q8,IF($S$7=10,ExtraTaal2!Q8,IF($S$7=11,ExtraTaal3!Q8,)))))))))))","v":"SI-units"},null,null,null,"Micro H8 B18",{"$f":"AE16","v":"Micro H6 B14"}]
[null,{"$f":"IF($S$7=1,NL!A2,IF(cal!$S$7=2,EN!A2,IF(cal!$S$7=3,DE!A2,IF(cal!$S$7=4,FR!A2,))))","v":"Formulary"},null,null,null,null,null,null,null,null,null,null,null,null,null,null,null,null,null,null,{"$f":"IF($S$7=1,NL!Q9,IF($S$7=2,EN!Q9,IF($S$7=3,DE!Q9,IF($S$7=4,FR!Q9,IF($S$7=5,NR!Q9,IF($S$7=6,SP!Q9,IF($S$7=7,SW!Q9,IF($S$7=8,TS!Q9,IF($S$7=9,ExtraTaal1!Q9,IF($S$7=10,ExtraTaal2!Q9,IF($S$7=11,ExtraTaal3!Q9,)))))))))))","v":"Imperial-units"},null,null,null,"Clima H8 B19",{"$f":"AQ16","v":0},null,null,{"$f":"IF($S$7=1,NL!Q15,IF(cal!$S$7=2,EN!Q15,IF(cal!$S$7=3,DE!Q15,IF(cal!$S$7=4,FR!Q15,IF(cal!$S$7=5,NR!Q15,IF(cal!$S$7=6,SP!Q15,))))))","v":"Temp."}]
[null,null,null,null,null,null,null,null,null,null,null,null,null,null,null,null,null,null,null,null,null,null,null,1,"Clima H8 B20",{"$f":"BB16","v":0},null,null,{"$f":"IF($S$7=1,NL!Q16,IF(cal!$S$7=2,EN!Q16,IF(cal!$S$7=3,DE!Q16,IF(cal!$S$7=4,FR!Q16,IF(cal!$S$7=5,NR!Q16,IF(cal!$S$7=6,SP!Q16,))))))","v":"heating!"}]
[null,{"$f":"IF($S$7=1,NL!A4,IF(cal!$S$7=2,EN!A4,IF(cal!$S$7=3,DE!A4,IF(cal!$S$7=4,FR!A4,))))","v":"Conditions"},null,null,null,null,null,null,null,null,null,null,null,null,null,null,null,null,null,null,null,null,null,null,"Clima H8 B21",{"$f":"BP16","v":0},null,null,{"$f":"IF($S$7=1,NL!Q17,IF(cal!$S$7=2,EN!Q17,IF(cal!$S$7=3,DE!Q17,IF(cal!$S$7=4,FR!Q17,IF(cal!$S$7=5,NR!Q17,IF(cal!$S$7=6,SP!Q17,))))))","v":"cooling!"}]
[null,null,null,null,null,null,null,null,null,null,null,null,null,null,null,null,null,null,null,null,null,null,null,null,"Clima H8 B22",{"$f":"BI16","v":0}]
[null,{"$f":"IF($S$7=1,NL!A6,IF(cal!$S$7=2,EN!A6,IF(cal!$S$7=3,DE!A6,IF(cal!$S$7=4,FR!A6,IF(cal!$S$7=5,NR!A6,IF(cal!$S$7=6,SP!A6,IF(cal!$S$7=7,SW!A6,IF(cal!$S$7=8,TS!A6,IF(cal!$S$7=9,ExtraTaal1!A6,IF(cal!$S$7=10,ExtraTaal2!A6,IF(cal!$S$7=11,ExtraTaal3!A6,)))))))))))","v":"Temperatures"},null,null,null,null,null,null,null,null,null,null,{"$f":"IF($S$7=1,NL!L6,IF(cal!$S$7=2,EN!L6,IF(cal!$S$7=3,DE!L6,IF(cal!$S$7=4,FR!L6,IF(cal!$S$7=5,NR!L6,IF(cal!$S$7=6,SP!L6,IF(cal!$S$7=7,SW!L6,IF(cal!$S$7=8,TS!L6,IF(cal!$S$7=9,ExtraTaal1!L6,IF(cal!$S$7=10,ExtraTaal2!L6,IF(cal!$S$7=11,ExtraTaal3!L6,)))))))))))","v":"Altitude"},{"$f":"IF($S$7=1,NL!M6,IF(cal!$S$7=2,EN!M6,IF(cal!$S$7=3,DE!M6,IF(cal!$S$7=4,FR!M6,IF(cal!$S$7=5,NR!M6,IF(cal!$S$7=6,SP!M6,IF(cal!$S$7=7,SW!M6,IF(cal!$S$7=8,TS!M6,IF(cal!$S$7=9,ExtraTaal1!M6,IF(cal!$S$7=10,ExtraTaal2!M6,IF(cal!$S$7=11,ExtraTaal3!M6,)))))))))))","v":0},null,null,null,null,{"$f":"IF('Micro canal'!$K$4=cal!G1,1,IF('Micro canal'!$K$4=cal!H1,2,IF('Micro canal'!$K$4=cal!I1,3,IF('Micro canal'!$K$4=cal!J1,4,IF('Micro canal'!$K$4=cal!K1,5,IF('Micro canal'!$K$4=cal!L1,6,IF('Micro canal'!$K$4=cal!M1,7,IF('Micro canal'!$K$4=cal!N1,8,IF('Micro canal'!$K$4=cal!O1,9,IF('Micro canal'!$K$4=cal!P1,10,IF('Micro canal'!$K$4=cal!Q1,11,)))))))))))","v":2},null,null,null,null,null,"Clima H8 B23",{"$f":"CE16","v":0}]
[null,{"$f":"IF($S$7=1,NL!A7,IF(cal!$S$7=2,EN!A7,IF(cal!$S$7=3,DE!A7,IF(cal!$S$7=4,FR!A7,IF(cal!$S$7=5,NR!A7,IF(cal!$S$7=6,SP!A7,IF(cal!$S$7=7,SW!A7,IF(cal!$S$7=8,TS!A7,IF(cal!$S$7=9,ExtraTaal1!A7,IF(cal!$S$7=10,ExtraTaal2!A7,IF(cal!$S$7=11,ExtraTaal3!A7,)))))))))))","v":"Heating:"},null,null,null,null,{"$f":"IF($S$7=1,NL!F7,IF(cal!$S$7=2,EN!F7,IF(cal!$S$7=3,DE!F7,IF(cal!$S$7=4,FR!F7,IF(cal!$S$7=5,NR!F7,IF(cal!$S$7=6,SP!F7,IF(cal!$S$7=7,SW!F7,IF(cal!$S$7=8,TS!F7,IF(cal!$S$7=9,ExtraTaal1!F7,IF(cal!$S$7=10,ExtraTaal2!F7,IF(cal!$S$7=11,ExtraTaal3!F7,)))))))))))","v":"Cooling:"},null,null,null,null,null,{"$f":"'Micro canal'!M9:N9","v":0},0,{"$f":"IF($X$4=1,\"m\",IF($X$4=2,\"ft\"))","v":"m"},null,null,null,"Temp",null,null,null,null,"Temp","Clima H8 B24",{"$f":"BX16","v":0}]
[null,{"$f":"IF($S$7=1,NL!A8,IF(cal!$S$7=2,EN!A8,IF(cal!$S$7=3,DE!A8,IF(cal!$S$7=4,FR!A8,IF(cal!$S$7=5,NR!A8,IF(cal!$S$7=6,SP!A8,IF(cal!$S$7=7,SW!A8,IF(cal!$S$7=8,TS!A8,IF(cal!$S$7=9,ExtraTaal1!A8,IF(cal!$S$7=10,ExtraTaal2!A8,IF(cal!$S$7=11,ExtraTaal3!A8,)))))))))))","v":"Inlet temp."},{"$f":"IF($S$7=1,NL!B8,IF(cal!$S$7=2,EN!B8,IF(cal!$S$7=3,DE!B8,IF(cal!$S$7=4,FR!B8,IF(cal!$S$7=5,NR!B8,IF(cal!$S$7=6,SP!B8,IF(cal!$S$7=7,SW!B8,IF(cal!$S$7=8,TS!B8,IF(cal!$S$7=9,ExtraTaal1!B8,IF(cal!$S$7=10,ExtraTaal2!B8,IF(cal!$S$7=11,ExtraTaal3!B8,)))))))))))","v":0},{"$f":"IF($S$7=1,NL!C8,IF(cal!$S$7=2,EN!C8,IF(cal!$S$7=3,DE!C8,IF(cal!$S$7=4,FR!C8,IF(cal!$S$7=5,NR!C8,IF(cal!$S$7=6,SP!C8,IF(cal!$S$7=7,SW!C8,IF(cal!$S$7=8,TS!C8,IF(cal!$S$7=9,ExtraTaal1!C8,IF(cal!$S$7=10,ExtraTaal2!C8,IF(cal!$S$7=11,ExtraTaal3!C8,)))))))))))","v":0},{"$f":"'Micro canal'!E10","v":75},null,{"$f":"B9","v":"Inlet temp."},{"$f":"IF($S$7=1,NL!G8,IF(cal!$S$7=2,EN!G8,IF(cal!$S$7=3,DE!G8,IF(cal!$S$7=4,FR!G8,))))","v":0},{"$f":"IF($S$7=1,NL!H8,IF(cal!$S$7=2,EN!H8,IF(cal!$S$7=3,DE!H8,IF(cal!$S$7=4,FR!H8,))))","v":0},{"$f":"IF($S$7=1,NL!I8,IF(cal!$S$7=2,EN!I8,IF(cal!$S$7=3,DE!I8,IF(cal!$S$7=4,FR!I8,))))","v":0},{"$f":"'Micro canal'!I11","v":0},null,{"$f":"IF($S$7=1,NL!L8,IF(cal!$S$7=2,EN!L8,IF(cal!$S$7=3,DE!L8,IF(cal!$S$7=4,FR!L8,IF(cal!$S$7=5,NR!L8,IF(cal!$S$7=6,SP!L8,IF(cal!$S$7=7,SW!L8,IF(cal!$S$7=8,TS!L8,IF(cal!$S$7=9,ExtraTaal1!L8,IF(cal!$S$7=10,ExtraTaal2!L8,IF(cal!$S$7=11,ExtraTaal3!L8,)))))))))))","v":"Unit conversion"},{"$f":"IF($S$7=1,NL!M8,IF(cal!$S$7=2,EN!M8,IF(cal!$S$7=3,DE!M8,IF(cal!$S$7=4,FR!M8,IF(cal!$S$7=5,NR!M8,IF(cal!$S$7=6,SP!M8,IF(cal!$S$7=7,SW!M8,IF(cal!$S$7=8,TS!M8,IF(cal!$S$7=9,ExtraTaal1!M8,IF(cal!$S$7=10,ExtraTaal2!M8,IF(cal!$S$7=11,ExtraTaal3!M8,)))))))))))","v":0},null,null,null,null,{"$f":"IF($X$4=1,E9,IF($X$4=2,(E9-32)/1.8))","v":75},null,null,null,null,{"$f":"IF($X$4=1,K9,IF($X$4=2,(K9-32)/1.8))","v":0}]
[null,{"$f":"IF($S$7=1,NL!A9,IF(cal!$S$7=2,EN!A9,IF(cal!$S$7=3,DE!A9,IF(cal!$S$7=4,FR!A9,IF(cal!$S$7=5,NR!A9,IF(cal!$S$7=6,SP!A9,IF(cal!$S$7=7,SW!A9,IF(cal!$S$7=8,TS!A9,IF(cal!$S$7=9,ExtraTaal1!A9,IF(cal!$S$7=10,ExtraTaal2!A9,IF(cal!$S$7=11,ExtraTaal3!A9,)))))))))))","v":"Return temp."},{"$f":"IF($S$7=1,NL!B9,IF(cal!$S$7=2,EN!B9,IF(cal!$S$7=3,DE!B9,IF(cal!$S$7=4,FR!B9,IF(cal!$S$7=5,NR!B9,IF(cal!$S$7=6,SP!B9,IF(cal!$S$7=7,SW!B9,IF(cal!$S$7=8,TS!B9,IF(cal!$S$7=9,ExtraTaal1!B9,IF(cal!$S$7=10,ExtraTaal2!B9,IF(cal!$S$7=11,ExtraTaal3!B9,)))))))))))","v":0},{"$f":"IF($S$7=1,NL!C9,IF(cal!$S$7=2,EN!C9,IF(cal!$S$7=3,DE!C9,IF(cal!$S$7=4,FR!C9,IF(cal!$S$7=5,NR!C9,IF(cal!$S$7=6,SP!C9,IF(cal!$S$7=7,SW!C9,IF(cal!$S$7=8,TS!C9,IF(cal!$S$7=9,ExtraTaal1!C9,IF(cal!$S$7=10,ExtraTaal2!C9,IF(cal!$S$7=11,ExtraTaal3!C9,)))))))))))","v":0},{"$f":"'Micro canal'!E11","v":65},null,{"$f":"B10","v":"Return temp."},{"$f":"IF($S$7=1,NL!G9,IF(cal!$S$7=2,EN!G9,IF(cal!$S$7=3,DE!G9,IF(cal!$S$7=4,FR!G9,))))","v":0},{"$f":"IF($S$7=1,NL!H9,IF(cal!$S$7=2,EN!H9,IF(cal!$S$7=3,DE!H9,IF(cal!$S$7=4,FR!H9,))))","v":0},{"$f":"IF($S$7=1,NL!I9,IF(cal!$S$7=2,EN!I9,IF(cal!$S$7=3,DE!I9,IF(cal!$S$7=4,FR!I9,))))","v":0},{"$f":"'Micro canal'!K11","v":0},null,null,null,null,null,null,null,{"$f":"IF($X$4=1,E10,IF($X$4=2,(E10-32)/1.8))","v":65},"CF,h",null,null,"CF,c",{"$f":"IF($X$4=1,K10,IF($X$4=2,(K10-32)/1.8))","v":0},null,"p_atm","h[mm]","cf_h"]
[null,{"$f":"IF($S$7=1,NL!A10,IF(cal!$S$7=2,EN!A10,IF(cal!$S$7=3,DE!A10,IF(cal!$S$7=4,FR!A10,IF(cal!$S$7=5,NR!A10,IF(cal!$S$7=6,SP!A10,IF(cal!$S$7=7,SW!A10,IF(cal!$S$7=8,TS!A10,IF(cal!$S$7=9,ExtraTaal1!A10,IF(cal!$S$7=10,ExtraTaal2!A10,IF(cal!$S$7=11,ExtraTaal3!A10,)))))))))))","v":"Room temp."},{"$f":"IF($S$7=1,NL!B10,IF(cal!$S$7=2,EN!B10,IF(cal!$S$7=3,DE!B10,IF(cal!$S$7=4,FR!B10,IF(cal!$S$7=5,NR!B10,IF(cal!$S$7=6,SP!B10,IF(cal!$S$7=7,SW!B10,IF(cal!$S$7=8,TS!B10,IF(cal!$S$7=9,ExtraTaal1!B10,IF(cal!$S$7=10,ExtraTaal2!B10,IF(cal!$S$7=11,ExtraTaal3!B10,)))))))))))","v":0},{"$f":"IF($S$7=1,NL!C10,IF(cal!$S$7=2,EN!C10,IF(cal!$S$7=3,DE!C10,IF(cal!$S$7=4,FR!C10,IF(cal!$S$7=5,NR!C10,IF(cal!$S$7=6,SP!C10,IF(cal!$S$7=7,SW!C10,IF(cal!$S$7=8,TS!C10,IF(cal!$S$7=9,ExtraTaal1!C10,IF(cal!$S$7=10,ExtraTaal2!C10,IF(cal!$S$7=11,ExtraTaal3!C10,)))))))))))","v":0},{"$f":"'Micro canal'!E12","v":20},null,{"$f":"B11","v":"Room temp."},{"$f":"IF($S$7=1,NL!G10,IF(cal!$S$7=2,EN!G10,IF(cal!$S$7=3,DE!G10,IF(cal!$S$7=4,FR!G10,))))","v":0},null,null,{"$f":"'Micro canal'!K12","v":0},null,null,null,null,null,null,null,{"$f":"IF($X$4=1,E11,IF($X$4=2,(E11-32)/1.8))","v":20},{"$f":"(($S$9-$S$10)/LN(($S$9-$S$11)/($S$10-$S$11)))/((75-65)/LN((75-20)/(65-20)))","v":1},null,null,{"$f":"(($X$9-$X$10)/LN(($X$9-$X$11)/($X$10-$X$11)))/((16-18)/LN((16-27)/(18-27)))","v":{"$error":"#DIV/0!"}},{"$f":"IF($X$4=1,K11,IF($X$4=2,(K11-32)/1.8))","v":0},null,{"$f":"IF($X$4=1,(101325*(1-((0.0065*M8)/(288.15)))^((9.81*0.028964)/(8.31447*0.0065))),IF($X$4=2,(101325*(1-((0.0065*(M8*0.3048))/(288.15)))^((9.81*0.028964)/(8.31447*0.0065)))))","v":101325},{"$f":"IF($X$4=1,M8/1000,IF($X$4=2,M8*0.0003048))","v":0},{"$f":"-(0.000265264729874266*AA11^6)+(0.000957582908802335*AA11^5)+(0.00470250661483425*AA11^4)-(0.0298716926548353*AA11^3)+(0.0557086806557086*AA11^2)-(0.0484008125693582*AA11)+1","v":1}]
[null,{"$f":"G12","v":"Relative humidity"},null,null,0.5,null,{"$f":"IF($S$7=1,NL!F11,IF(cal!$S$7=2,EN!F11,IF(cal!$S$7=3,DE!F11,IF(cal!$S$7=4,FR!F11,IF(cal!$S$7=5,NR!F11,IF(cal!$S$7=6,SP!F11,IF(cal!$S$7=7,SW!F11,IF(cal!$S$7=8,TS!F11,IF(cal!$S$7=9,ExtraTaal1!F11,IF(cal!$S$7=10,ExtraTaal2!F11,IF(cal!$S$7=11,ExtraTaal3!F11,)))))))))))","v":"Relative humidity"},null,null,null,{"$f":"'Micro canal'!K13","v":0}]
[]
[null,null,null,null,{"$f":"IF($X$4=1,1,IF($X$4=2,0.004403))","v":1},{"$f":"IF($X$4=1,1,IF($X$4=2,4.0147))","v":1},{"$f":"IF($X$4=1,0.000334444444444444,IF($X$4=2,0.000568224721372))","v":3.3444444444444401E-4},{"$f":"IF($X$4=1,1,IF($X$4=2,3.4121416331))","v":1},{"$f":"IF($X$4=1,1,IF($X$4=2,0.004403))","v":1},{"$f":"IF($X$4=1,1,IF($X$4=2,4.0147))","v":1},null,null,null,{"$f":"IF($X$4=1,1,IF($X$4=2,0.588575))","v":1},{"$f":"IF($X$4=1,1,1.8)","v":1},{"$f":"IF($X$4=1,0,32)","v":0},null,null,"8 & 10","13/27","13/32",19]
[null,{"$f":"IF($S$7=1,NL!A14,IF(cal!$S$7=2,EN!A14,IF(cal!$S$7=3,DE!A14,IF(cal!$S$7=4,FR!A14,IF(cal!$S$7=5,NR!A14,IF(cal!$S$7=6,SP!A14,IF(cal!$S$7=7,SW!A14,IF(cal!$S$7=8,TS!A14,IF(cal!$S$7=9,ExtraTaal1!A14,IF(cal!$S$7=10,ExtraTaal2!A14,IF(cal!$S$7=11,ExtraTaal3!A14,)))))))))))","v":"Speed level:"},{"$f":"IF($S$7=1,NL!B14,IF(cal!$S$7=2,EN!B14,IF(cal!$S$7=3,DE!B14,IF(cal!$S$7=4,FR!B14,IF(cal!$S$7=5,NR!B14,IF(cal!$S$7=6,SP!B14,IF(cal!$S$7=7,SW!B14,IF(cal!$S$7=8,TS!B14,IF(cal!$S$7=9,ExtraTaal1!B14,IF(cal!$S$7=10,ExtraTaal2!B14,IF(cal!$S$7=11,ExtraTaal3!B14,)))))))))))","v":"Control voltage [V]"},{"$f":"IF($S$7=1,NL!C14,IF(cal!$S$7=2,EN!C14,IF(cal!$S$7=3,DE!C14,IF(cal!$S$7=4,FR!C14,IF(cal!$S$7=5,NR!C14,IF(cal!$S$7=6,SP!C14,IF(cal!$S$7=7,SW!C14,IF(cal!$S$7=8,TS!C14,IF(cal!$S$7=9,ExtraTaal1!C14,IF(cal!$S$7=10,ExtraTaal2!C14,IF(cal!$S$7=11,ExtraTaal3!C14,)))))))))))","v":"Heat output * 75/65/20 [W]"},{"$f":"IF($S$7=1,NL!D14,IF(cal!$S$7=2,EN!D14,IF(cal!$S$7=3,DE!D14,IF(cal!$S$7=4,FR!D14,IF(cal!$S$7=5,NR!D14,IF(cal!$S$7=6,SP!D14,IF(cal!$S$7=7,SW!D14,IF(cal!$S$7=8,TS!D14,IF(cal!$S$7=9,ExtraTaal1!D14,IF(cal!$S$7=10,ExtraTaal2!D14,IF(cal!$S$7=11,ExtraTaal3!D14,)))))))))))","v":"Water flowrate, heating [l/h]"},{"$f":"IF($S$7=1,NL!E14,IF(cal!$S$7=2,EN!E14,IF(cal!$S$7=3,DE!E14,IF(cal!$S$7=4,FR!E14,IF(cal!$S$7=5,NR!E14,IF(cal!$S$7=6,SP!E14,IF(cal!$S$7=7,SW!E14,IF(cal!$S$7=8,TS!E14,IF(cal!$S$7=9,ExtraTaal1!E14,IF(cal!$S$7=10,ExtraTaal2!E14,IF(cal!$S$7=11,ExtraTaal3!E14,)))))))))))","v":"Watersided pressure loss [kPa]"},null,null,null,null,{"$f":"IF($S$7=1,NL!J14,IF(cal!$S$7=2,EN!J14,IF(cal!$S$7=3,DE!J14,IF(cal!$S$7=4,FR!J14,IF(cal!$S$7=5,NR!J14,IF(cal!$S$7=6,SP!J14,IF(cal!$S$7=7,SW!J14,IF(cal!$S$7=8,TS!J14,IF(cal!$S$7=9,ExtraTaal1!J14,IF(cal!$S$7=10,ExtraTaal2!J14,IF(cal!$S$7=11,ExtraTaal3!J14,)))))))))))","v":"Sound pressure *** [dB(A)]"},{"$f":"IF($S$7=1,NL!K14,IF(cal!$S$7=2,EN!K14,IF(cal!$S$7=3,DE!K14,IF(cal!$S$7=4,FR!K14,IF(cal!$S$7=5,NR!K14,IF(cal!$S$7=6,SP!K14,IF(cal!$S$7=7,SW!K14,IF(cal!$S$7=8,TS!K14,IF(cal!$S$7=9,ExtraTaal1!K14,IF(cal!$S$7=10,ExtraTaal2!K14,IF(cal!$S$7=11,ExtraTaal3!K14,)))))))))))","v":"Sound power ** [dB(A)]"},{"$f":"IF($S$7=1,NL!L14,IF(cal!$S$7=2,EN!L14,IF(cal!$S$7=3,DE!L14,IF(cal!$S$7=4,FR!L14,IF(cal!$S$7=5,NR!L14,IF(cal!$S$7=6,SP!L14,IF(cal!$S$7=7,SW!L14,IF(cal!$S$7=8,TS!L14,IF(cal!$S$7=9,ExtraTaal1!L14,IF(cal!$S$7=10,ExtraTaal2!L14,IF(cal!$S$7=11,ExtraTaal3!L14,)))))))))))","v":"Electrical power [W]"},{"$f":"IF($S$7=1,NL!M14,IF(cal!$S$7=2,EN!M14,IF(cal!$S$7=3,DE!M14,IF(cal!$S$7=4,FR!M14,IF(cal!$S$7=5,NR!M14,IF(cal!$S$7=6,SP!M14,IF(cal!$S$7=7,SW!M14,IF(cal!$S$7=8,TS!M14,IF(cal!$S$7=9,ExtraTaal1!M14,IF(cal!$S$7=10,ExtraTaal2!M14,IF(cal!$S$7=11,ExtraTaal3!M14,)))))))))))","v":"Air flowrate [m³/h]"},{"$f":"IF($S$7=1,NL!N14,IF(cal!$S$7=2,EN!N14,IF(cal!$S$7=3,DE!N14,IF(cal!$S$7=4,FR!N14,IF(cal!$S$7=5,NR!N14,IF(cal!$S$7=6,SP!N14,IF(cal!$S$7=7,SW!N14,IF(cal!$S$7=8,TS!N14,IF(cal!$S$7=9,ExtraTaal1!N14,IF(cal!$S$7=10,ExtraTaal2!N14,IF(cal!$S$7=11,ExtraTaal3!N14,)))))))))))","v":"Air exhaust temp. heating [°C]"},{"$f":"IF($S$7=1,NL!O14,IF(cal!$S$7=2,EN!O14,IF(cal!$S$7=3,DE!O14,IF(cal!$S$7=4,FR!O14,IF(cal!$S$7=5,NR!O14,IF(cal!$S$7=6,SP!O14,IF(cal!$S$7=7,SW!O14,IF(cal!$S$7=8,TS!O14,IF(cal!$S$7=9,ExtraTaal1!O14,IF(cal!$S$7=10,ExtraTaal2!O14,IF(cal!$S$7=11,ExtraTaal3!O14,)))))))))))","v":"Air exhaust temp. cooling [°C]"},"n- heating","n- cooling","n- cooling","n- cooling","n- cooling","n- cooling",null,"Q_verw","dP_verw","Q_voelb_c","dP_cool","Geluid_P","P_elek","V_air","Q_verw","dP_verw","Q_voelb_c","dP_cool","Geluid_P","P_elek","V_air","Flow l/h","deltap","k1","k2","n"]
[null,{"$f":"IF($S$7=1,NL!A15,IF(cal!$S$7=2,EN!A15,IF(cal!$S$7=3,DE!A15,IF(cal!$S$7=4,FR!A15,IF(cal!$S$7=5,NR!A15,IF(cal!$S$7=6,SP!A15,IF(cal!$S$7=7,SW!A15,IF(cal!$S$7=8,TS!A15,IF(cal!$S$7=9,ExtraTaal1!A15,IF(cal!$S$7=10,ExtraTaal2!A15,IF(cal!$S$7=11,ExtraTaal3!A15,)))))))))))","v":"Micro Canal height 6 cm width 14 cm length 60 cm (Type 1)"},{"$f":"IF($S$7=1,NL!B15,IF(cal!$S$7=2,EN!B15,IF(cal!$S$7=3,DE!B15,IF(cal!$S$7=4,FR!B15,IF(cal!$S$7=5,NR!B15,IF(cal!$S$7=6,SP!B15,IF(cal!$S$7=7,SW!B15,IF(cal!$S$7=8,TS!B15,IF(cal!$S$7=9,ExtraTaal1!B15,IF(cal!$S$7=10,ExtraTaal2!B15,IF(cal!$S$7=11,ExtraTaal3!B15,)))))))))))","v":0},{"$f":"IF($S$7=1,NL!C15,IF(cal!$S$7=2,EN!C15,IF(cal!$S$7=3,DE!C15,IF(cal!$S$7=4,FR!C15,IF(cal!$S$7=5,NR!C15,IF(cal!$S$7=6,SP!C15,IF(cal!$S$7=7,SW!C15,IF(cal!$S$7=8,TS!C15,IF(cal!$S$7=9,ExtraTaal1!C15,IF(cal!$S$7=10,ExtraTaal2!C15,IF(cal!$S$7=11,ExtraTaal3!C15,)))))))))))","v":0},{"$f":"IF($S$7=1,NL!D15,IF(cal!$S$7=2,EN!D15,IF(cal!$S$7=3,DE!D15,IF(cal!$S$7=4,FR!D15,IF(cal!$S$7=5,NR!D15,IF(cal!$S$7=6,SP!D15,IF(cal!$S$7=7,SW!D15,IF(cal!$S$7=8,TS!D15,IF(cal!$S$7=9,ExtraTaal1!D15,IF(cal!$S$7=10,ExtraTaal2!D15,IF(cal!$S$7=11,ExtraTaal3!D15,)))))))))))","v":0},{"$f":"IF($S$7=1,NL!E15,IF(cal!$S$7=2,EN!E15,IF(cal!$S$7=3,DE!E15,IF(cal!$S$7=4,FR!E15,IF(cal!$S$7=5,NR!E15,IF(cal!$S$7=6,SP!E15,IF(cal!$S$7=7,SW!E15,IF(cal!$S$7=8,TS!E15,IF(cal!$S$7=9,ExtraTaal1!E15,IF(cal!$S$7=10,ExtraTaal2!E15,IF(cal!$S$7=11,ExtraTaal3!E15,)))))))))))","v":0},{"$f":"IF($S$7=1,NL!F15,IF(cal!$S$7=2,EN!F15,IF(cal!$S$7=3,DE!F15,IF(cal!$S$7=4,FR!F15,IF(cal!$S$7=5,NR!F15,IF(cal!$S$7=6,SP!F15,IF(cal!$S$7=7,SW!F15,IF(cal!$S$7=8,TS!F15,IF(cal!$S$7=9,ExtraTaal1!F15,IF(cal!$S$7=10,ExtraTaal2!F15,IF(cal!$S$7=11,ExtraTaal3!F15,)))))))))))","v":0},{"$f":"IF($S$7=1,NL!G15,IF(cal!$S$7=2,EN!G15,IF(cal!$S$7=3,DE!G15,IF(cal!$S$7=4,FR!G15,IF(cal!$S$7=5,NR!G15,IF(cal!$S$7=6,SP!G15,IF(cal!$S$7=7,SW!G15,IF(cal!$S$7=8,TS!G15,IF(cal!$S$7=9,ExtraTaal1!G15,IF(cal!$S$7=10,ExtraTaal2!G15,IF(cal!$S$7=11,ExtraTaal3!G15,)))))))))))","v":0},{"$f":"IF($S$7=1,NL!H15,IF(cal!$S$7=2,EN!H15,IF(cal!$S$7=3,DE!H15,IF(cal!$S$7=4,FR!H15,IF(cal!$S$7=5,NR!H15,IF(cal!$S$7=6,SP!H15,IF(cal!$S$7=7,SW!H15,IF(cal!$S$7=8,TS!H15,IF(cal!$S$7=9,ExtraTaal1!H15,IF(cal!$S$7=10,ExtraTaal2!H15,IF(cal!$S$7=11,ExtraTaal3!H15,)))))))))))","v":0},{"$f":"IF($S$7=1,NL!I15,IF(cal!$S$7=2,EN!I15,IF(cal!$S$7=3,DE!I15,IF(cal!$S$7=4,FR!I15,IF(cal!$S$7=5,NR!I15,IF(cal!$S$7=6,SP!I15,IF(cal!$S$7=7,SW!I15,IF(cal!$S$7=8,TS!I15,IF(cal!$S$7=9,ExtraTaal1!I15,IF(cal!$S$7=10,ExtraTaal2!I15,IF(cal!$S$7=11,ExtraTaal3!I15,)))))))))))","v":0},{"$f":"IF($S$7=1,NL!J15,IF(cal!$S$7=2,EN!J15,IF(cal!$S$7=3,DE!J15,IF(cal!$S$7=4,FR!J15,IF(cal!$S$7=5,NR!J15,IF(cal!$S$7=6,SP!J15,IF(cal!$S$7=7,SW!J15,IF(cal!$S$7=8,TS!J15,IF(cal!$S$7=9,ExtraTaal1!J15,IF(cal!$S$7=10,ExtraTaal2!J15,IF(cal!$S$7=11,ExtraTaal3!J15,)))))))))))","v":0},{"$f":"IF($S$7=1,NL!K15,IF(cal!$S$7=2,EN!K15,IF(cal!$S$7=3,DE!K15,IF(cal!$S$7=4,FR!K15,IF(cal!$S$7=5,NR!K15,IF(cal!$S$7=6,SP!K15,IF(cal!$S$7=7,SW!K15,IF(cal!$S$7=8,TS!K15,IF(cal!$S$7=9,ExtraTaal1!K15,IF(cal!$S$7=10,ExtraTaal2!K15,IF(cal!$S$7=11,ExtraTaal3!K15,)))))))))))","v":0},{"$f":"IF($S$7=1,NL!L15,IF(cal!$S$7=2,EN!L15,IF(cal!$S$7=3,DE!L15,IF(cal!$S$7=4,FR!L15,IF(cal!$S$7=5,NR!L15,IF(cal!$S$7=6,SP!L15,IF(cal!$S$7=7,SW!L15,IF(cal!$S$7=8,TS!L15,IF(cal!$S$7=9,ExtraTaal1!L15,IF(cal!$S$7=10,ExtraTaal2!L15,IF(cal!$S$7=11,ExtraTaal3!L15,)))))))))))","v":0},{"$f":"IF($S$7=1,NL!M15,IF(cal!$S$7=2,EN!M15,IF(cal!$S$7=3,DE!M15,IF(cal!$S$7=4,FR!M15,IF(cal!$S$7=5,NR!M15,IF(cal!$S$7=6,SP!M15,IF(cal!$S$7=7,SW!M15,IF(cal!$S$7=8,TS!M15,IF(cal!$S$7=9,ExtraTaal1!M15,IF(cal!$S$7=10,ExtraTaal2!M15,IF(cal!$S$7=11,ExtraTaal3!M15,)))))))))))","v":0},{"$f":"IF($S$7=1,NL!N15,IF(cal!$S$7=2,EN!N15,IF(cal!$S$7=3,DE!N15,IF(cal!$S$7=4,FR!N15,IF(cal!$S$7=5,NR!N15,IF(cal!$S$7=6,SP!N15,IF(cal!$S$7=7,SW!N15,IF(cal!$S$7=8,TS!N15,IF(cal!$S$7=9,ExtraTaal1!N15,IF(cal!$S$7=10,ExtraTaal2!N15,IF(cal!$S$7=11,ExtraTaal3!N15,)))))))))))","v":0},{"$f":"IF($S$7=1,NL!O15,IF(cal!$S$7=2,EN!O15,IF(cal!$S$7=3,DE!O15,IF(cal!$S$7=4,FR!O15,IF(cal!$S$7=5,NR!O15,IF(cal!$S$7=6,SP!O15,IF(cal!$S$7=7,SW!O15,IF(cal!$S$7=8,TS!O15,IF(cal!$S$7=9,ExtraTaal1!O15,IF(cal!$S$7=10,ExtraTaal2!O15,IF(cal!$S$7=11,ExtraTaal3!O15,)))))))))))","v":0},"n-value","n-value","n-value","n-value","n-value","n-value",null,1,null,null,null,null,null,null,{"$f":"CONCATENATE(\"Micro H\",ROUND(AF22,1),\" B\",AH22)","v":"Micro H6 B14"}]
[null,0.2,2,{"$f":"(X17*($T$11^$Q17))*Watts*CF_Altit","v":59.699999999999996},{"$f":"ROUND(((D17/Watts)/(($S$9-$S$10)*1.163))*$E$14,IF($X$4=1,0,IF($X$4=2,2)))","v":5},{"$f":"(IF($X$4=1,AM17,IF($X$4=2,AM17*0.334552563)))","v":1.1425873686146527E-3},null,null,null,null,{"$f":"L17-8","v":13.8},{"$f":"AB17","v":21.8},{"$f":"AC17","v":0.51},{"$f":"AD17*Cubics","v":11},{"$f":"((($D17/Watts)/(((p_atm*0.028964)/(8.31447*(20+273.15)))*(($N17/3600)/Cubics)*(1005+1870*((0.622)/(((p_atm)/($E$12*Pvs_Heat_in))-1)))))+Tl_heat)*Celc1+Celc2","v":35.930794450762484},{"$f":"(Tl_cool-(($G17/Watts)/(1006*$N17*kgss)))*Celc1+Celc2","v":0},1,{"$f":"IF($X$16=1,S17,IF($X$16=2,S17,IF($X$16=3,U17,IF($X$16=4,U17,IF($X$16=5,V17,IF($X$16=6,V17,IF($X$16=7,T17,)))))))","v":0.6},0.6,1.1599999999999999,0.78069999999999995,0.87660000000000005,{"$f":"(H17-G17)/H17","v":{"$error":"#DIV/0!"}},{"$f":"IF($X$16=1,AE17,IF($X$16=2,AQ17,IF($X$16=3,BP17,IF($X$16=4,BI17,IF($X$16=5,CE17,IF($X$16=6,BX17,IF($X$16=7,BB17,)))))))","v":59.699999999999996},{"$f":"IF($X$16=1,AF17,IF($X$16=2,AR17,IF($X$16=3,BQ17,IF($X$16=4,BJ17,IF($X$16=5,CF17,IF($X$16=6,BY17,IF($X$16=7,BC17,)))))))","v":"a"},30,"a",21.8,0.51,11,{"$f":"AE29*($AK$22/$AK$34)","v":59.699999999999996},"a",30,"a",21.8,0.51,11,{"$f":"((D17/Watts)/(($S$9-$S$10)*1.163))","v":5.1332760103181423},{"$f":"((AN17*(AL17^AP17)*(($AL$22-19.5)/100)*2)+AO17*(AL17^2))*0.0098","v":1.1425873686146527E-3},6.5250871001174002E-3,5.7852740858429998E-4,1.8056661148752]
[null,0.4,4,{"$f":"(X18*($T$11^$Q18))*Watts*CF_Altit","v":156.9},{"$f":"ROUND(((D18/Watts)/(($S$9-$S$10)*1.163))*$E$14,IF($X$4=1,0,IF($X$4=2,2)))","v":13},{"$f":"(IF($X$4=1,AM18,IF($X$4=2,AM18*0.334552563)))","v":6.7175217997448257E-3},null,null,null,null,{"$f":"L18-8","v":14.899999999999999},22.9,0.75,{"$f":"AD18*Cubics","v":19},{"$f":"((($D18/Watts)/(((p_atm*0.028964)/(8.31447*(20+273.15)))*(($N18/3600)/Cubics)*(1005+1870*((0.622)/(((p_atm)/($E$12*Pvs_Heat_in))-1)))))+Tl_heat)*Celc1+Celc2","v":44.239582246822685},{"$f":"(Tl_cool-(($G18/Watts)/(1006*$N18*kgss)))*Celc1+Celc2","v":0},1,{"$f":"IF($X$16=1,S18,IF($X$16=2,S18,IF($X$16=3,U18,IF($X$16=4,U18,IF($X$16=5,V18,IF($X$16=6,V18,IF($X$16=7,T18,)))))))","v":0.68},0.68,1.04,0.85870000000000002,0.87749999999999995,{"$f":"(H18-G18)/H18","v":{"$error":"#DIV/0!"}},{"$f":"IF($X$16=1,AE18,IF($X$16=2,AQ18,IF($X$16=3,BP18,IF($X$16=4,BI18,IF($X$16=5,CE18,IF($X$16=6,BX18,IF($X$16=7,BB18,)))))))","v":156.9},6.5300000000000002E-3,{"$f":"IF($X$16=1,AG18,IF($X$16=2,AS18,IF($X$16=3,BR18,IF($X$16=4,BK18,IF($X$16=5,CG18,IF($X$16=6,BZ18,IF($X$16=7,BD18,)))))))","v":66},2.5649818987149301E-4,22.9,0.75,19,{"$f":"AE30*($AK$22/$AK$34)","v":156.9},2.5649818987149301E-4,66,{"$f":"AF18","v":2.5649818987149301E-4},22.9,0.75,19,{"$f":"((D18/Watts)/(($S$9-$S$10)*1.163))","v":13.49097162510748},{"$f":"((AN18*(AL18^AP18)*(($AL$22-19.5)/100)*2)+AO18*(AL18^2))*0.0098","v":6.7175217997448257E-3},6.5250871001174002E-3,5.7852740858429998E-4,1.8056661148752]
[null,0.6,6,{"$f":"(X19*($T$11^$Q19))*Watts*CF_Altit","v":315.89999999999998},{"$f":"ROUND(((D19/Watts)/(($S$9-$S$10)*1.163))*$E$14,IF($X$4=1,0,IF($X$4=2,2)))","v":27},{"$f":"(IF($X$4=1,AM19,IF($X$4=2,AM19*0.334552563)))","v":2.4300253860054872E-2},null,null,null,null,{"$f":"L19-8","v":18.8},26.8,1.17,{"$f":"AD19*Cubics","v":29},{"$f":"((($D19/Watts)/(((p_atm*0.028964)/(8.31447*(20+273.15)))*(($N19/3600)/Cubics)*(1005+1870*((0.622)/(((p_atm)/($E$12*Pvs_Heat_in))-1)))))+Tl_heat)*Celc1+Celc2","v":51.974769038846269},{"$f":"(Tl_cool-(($G19/Watts)/(1006*$N19*kgss)))*Celc1+Celc2","v":0},1,0.79,0.79,0.95,0.8831,0.88200000000000001,{"$f":"(H19-G19)/H19","v":{"$error":"#DIV/0!"}},{"$f":"IF($X$16=1,AE19,IF($X$16=2,AQ19,IF($X$16=3,BP19,IF($X$16=4,BI19,IF($X$16=5,CE19,IF($X$16=6,BX19,IF($X$16=7,BB19,)))))))","v":315.89999999999998},{"$f":"IF($X$16=1,AF19,IF($X$16=2,AR19,IF($X$16=3,BQ19,IF($X$16=4,BJ19,IF($X$16=5,CF19,IF($X$16=6,BY19,IF($X$16=7,BC19,)))))))","v":"b"},104,"b",26.8,1.17,29,{"$f":"AE31*($AK$22/$AK$34)","v":315.89999999999998},"b",104,"b",26.8,1.17,29,{"$f":"((D19/Watts)/(($S$9-$S$10)*1.163))","v":27.162510748065344},2.4300253860054872E-2,6.5250871001174002E-3,5.7852740858429998E-4,1.8056661148752]
[null,0.8,8,{"$f":"(X20*($T$11^$Q20))*Watts*CF_Altit","v":420.9},{"$f":"ROUND(((D20/Watts)/(($S$9-$S$10)*1.163))*$E$14,IF($X$4=1,0,IF($X$4=2,2)))","v":36},4.1201808913652688E-2,null,null,null,null,{"$f":"L20-8","v":31.6},39.6,1.79,{"$f":"AD20*Cubics","v":40},{"$f":"((($D20/Watts)/(((p_atm*0.028964)/(8.31447*(20+273.15)))*(($N20/3600)/Cubics)*(1005+1870*((0.622)/(((p_atm)/($E$12*Pvs_Heat_in))-1)))))+Tl_heat)*Celc1+Celc2","v":50.886928487263489},{"$f":"(Tl_cool-(($G20/Watts)/(1006*$N20*kgss)))*Celc1+Celc2","v":0},1,0.87,0.87,0.95,0.85389999999999999,0.89500000000000002,{"$f":"(H20-G20)/H20","v":{"$error":"#DIV/0!"}},{"$f":"IF($X$16=1,AE20,IF($X$16=2,AQ20,IF($X$16=3,BP20,IF($X$16=4,BI20,IF($X$16=5,CE20,IF($X$16=6,BX20,IF($X$16=7,BB20,)))))))","v":420.9},1.8056700000000001,144,1.8235155847906248,39.6,1.79,40,{"$f":"AE32*($AK$22/$AK$34)","v":420.9},1.8235155847906248,144,{"$f":"AF20","v":1.8235155847906248},39.6,1.79,40,{"$f":"((D20/Watts)/(($S$9-$S$10)*1.163))","v":36.190885640584689},4.1201808913652688E-2,6.5250871001174002E-3,5.7852740858429998E-4,1.8056661148752]
[null,1,10,{"$f":"(X21*($T$11^$Q21))*Watts*CF_Altit","v":494.7},{"$f":"ROUND(((D21/Watts)/(($S$9-$S$10)*1.163))*$E$14,IF($X$4=1,0,IF($X$4=2,2)))","v":43},5.5474898550123948E-2,null,null,null,null,{"$f":"L21-8","v":39.200000000000003},47.2,2.67,{"$f":"AD21*Cubics","v":65},{"$f":"((($D21/Watts)/(((p_atm*0.028964)/(8.31447*(20+273.15)))*(($N21/3600)/Cubics)*(1005+1870*((0.622)/(((p_atm)/($E$12*Pvs_Heat_in))-1)))))+Tl_heat)*Celc1+Celc2","v":42.340060343438786},{"$f":"(Tl_cool-(($G21/Watts)/(1006*$N21*kgss)))*Celc1+Celc2","v":0},1,0.91,0.91,0.98,0.77110000000000001,0.91110000000000002,{"$f":"(H21-G21)/H21","v":{"$error":"#DIV/0!"}},{"$f":"IF($X$16=1,AE21,IF($X$16=2,AQ21,IF($X$16=3,BP21,IF($X$16=4,BI21,IF($X$16=5,CE21,IF($X$16=6,BX21,IF($X$16=7,BB21,)))))))","v":494.7},{"$f":"IF($X$16=1,AF21,IF($X$16=2,AR21,IF($X$16=3,BQ21,IF($X$16=4,BJ21,IF($X$16=5,CF21,IF($X$16=6,BY21,IF($X$16=7,BC21,)))))))","v":0},185,0,47.2,2.67,65,{"$f":"AE33*($AK$22/$AK$34)","v":494.7},null,185,null,47.2,2.67,65,{"$f":"((D21/Watts)/(($S$9-$S$10)*1.163))","v":42.536543422184003},5.5474898550123948E-2,6.5250871001174002E-3,5.7852740858429998E-4,1.8056661148752]
[null,{"$f":"IF($S$7=1,NL!A21,IF(cal!$S$7=2,EN!A21,IF(cal!$S$7=3,DE!A21,IF(cal!$S$7=4,FR!A21,IF(cal!$S$7=5,NR!A21,IF(cal!$S$7=6,SP!A21,IF(cal!$S$7=7,SW!A21,IF(cal!$S$7=8,TS!A21,IF(cal!$S$7=9,ExtraTaal1!A21,IF(cal!$S$7=10,ExtraTaal2!A21,IF(cal!$S$7=11,ExtraTaal3!A21,)))))))))))","v":"Micro Canal height 6 cm width 14 cm length 95 cm (Type 2)"},{"$f":"IF($S$7=1,NL!B21,IF(cal!$S$7=2,EN!B21,IF(cal!$S$7=3,DE!B21,IF(cal!$S$7=4,FR!B21,IF(cal!$S$7=5,NR!B21,IF(cal!$S$7=6,SP!B21,IF(cal!$S$7=7,SW!B21,IF(cal!$S$7=8,TS!B21,IF(cal!$S$7=9,ExtraTaal1!B21,IF(cal!$S$7=10,ExtraTaal2!B21,IF(cal!$S$7=11,ExtraTaal3!B21,)))))))))))","v":0},{"$f":"IF($S$7=1,NL!C21,IF(cal!$S$7=2,EN!C21,IF(cal!$S$7=3,DE!C21,IF(cal!$S$7=4,FR!C21,IF(cal!$S$7=5,NR!C21,IF(cal!$S$7=6,SP!C21,IF(cal!$S$7=7,SW!C21,IF(cal!$S$7=8,TS!C21,IF(cal!$S$7=9,ExtraTaal1!C21,IF(cal!$S$7=10,ExtraTaal2!C21,IF(cal!$S$7=11,ExtraTaal3!C21,)))))))))))","v":0},{"$f":"IF($S$7=1,NL!D21,IF(cal!$S$7=2,EN!D21,IF(cal!$S$7=3,DE!D21,IF(cal!$S$7=4,FR!D21,IF(cal!$S$7=5,NR!D21,IF(cal!$S$7=6,SP!D21,IF(cal!$S$7=7,SW!D21,IF(cal!$S$7=8,TS!D21,IF(cal!$S$7=9,ExtraTaal1!D21,IF(cal!$S$7=10,ExtraTaal2!D21,IF(cal!$S$7=11,ExtraTaal3!D21,)))))))))))","v":0},{"$f":"IF($S$7=1,NL!E21,IF(cal!$S$7=2,EN!E21,IF(cal!$S$7=3,DE!E21,IF(cal!$S$7=4,FR!E21,IF(cal!$S$7=5,NR!E21,IF(cal!$S$7=6,SP!E21,IF(cal!$S$7=7,SW!E21,IF(cal!$S$7=8,TS!E21,IF(cal!$S$7=9,ExtraTaal1!E21,IF(cal!$S$7=10,ExtraTaal2!E21,IF(cal!$S$7=11,ExtraTaal3!E21,)))))))))))","v":0},{"$f":"IF($S$7=1,NL!F21,IF(cal!$S$7=2,EN!F21,IF(cal!$S$7=3,DE!F21,IF(cal!$S$7=4,FR!F21,IF(cal!$S$7=5,NR!F21,IF(cal!$S$7=6,SP!F21,IF(cal!$S$7=7,SW!F21,IF(cal!$S$7=8,TS!F21,IF(cal!$S$7=9,ExtraTaal1!F21,IF(cal!$S$7=10,ExtraTaal2!F21,IF(cal!$S$7=11,ExtraTaal3!F21,)))))))))))","v":0},{"$f":"IF($S$7=1,NL!G21,IF(cal!$S$7=2,EN!G21,IF(cal!$S$7=3,DE!G21,IF(cal!$S$7=4,FR!G21,IF(cal!$S$7=5,NR!G21,IF(cal!$S$7=6,SP!G21,IF(cal!$S$7=7,SW!G21,IF(cal!$S$7=8,TS!G21,IF(cal!$S$7=9,ExtraTaal1!G21,IF(cal!$S$7=10,ExtraTaal2!G21,IF(cal!$S$7=11,ExtraTaal3!G21,)))))))))))","v":0},{"$f":"IF($S$7=1,NL!H21,IF(cal!$S$7=2,EN!H21,IF(cal!$S$7=3,DE!H21,IF(cal!$S$7=4,FR!H21,IF(cal!$S$7=5,NR!H21,IF(cal!$S$7=6,SP!H21,IF(cal!$S$7=7,SW!H21,IF(cal!$S$7=8,TS!H21,IF(cal!$S$7=9,ExtraTaal1!H21,IF(cal!$S$7=10,ExtraTaal2!H21,IF(cal!$S$7=11,ExtraTaal3!H21,)))))))))))","v":0},{"$f":"IF($S$7=1,NL!I21,IF(cal!$S$7=2,EN!I21,IF(cal!$S$7=3,DE!I21,IF(cal!$S$7=4,FR!I21,IF(cal!$S$7=5,NR!I21,IF(cal!$S$7=6,SP!I21,IF(cal!$S$7=7,SW!I21,IF(cal!$S$7=8,TS!I21,IF(cal!$S$7=9,ExtraTaal1!I21,IF(cal!$S$7=10,ExtraTaal2!I21,IF(cal!$S$7=11,ExtraTaal3!I21,)))))))))))","v":0},{"$f":"IF($S$7=1,NL!J21,IF(cal!$S$7=2,EN!J21,IF(cal!$S$7=3,DE!J21,IF(cal!$S$7=4,FR!J21,IF(cal!$S$7=5,NR!J21,IF(cal!$S$7=6,SP!J21,IF(cal!$S$7=7,SW!J21,IF(cal!$S$7=8,TS!J21,IF(cal!$S$7=9,ExtraTaal1!J21,IF(cal!$S$7=10,ExtraTaal2!J21,IF(cal!$S$7=11,ExtraTaal3!J21,)))))))))))","v":0},{"$f":"IF($S$7=1,NL!K21,IF(cal!$S$7=2,EN!K21,IF(cal!$S$7=3,DE!K21,IF(cal!$S$7=4,FR!K21,IF(cal!$S$7=5,NR!K21,IF(cal!$S$7=6,SP!K21,IF(cal!$S$7=7,SW!K21,IF(cal!$S$7=8,TS!K21,IF(cal!$S$7=9,ExtraTaal1!K21,IF(cal!$S$7=10,ExtraTaal2!K21,IF(cal!$S$7=11,ExtraTaal3!K21,)))))))))))","v":0},{"$f":"IF($S$7=1,NL!L21,IF(cal!$S$7=2,EN!L21,IF(cal!$S$7=3,DE!L21,IF(cal!$S$7=4,FR!L21,IF(cal!$S$7=5,NR!L21,IF(cal!$S$7=6,SP!L21,IF(cal!$S$7=7,SW!L21,IF(cal!$S$7=8,TS!L21,IF(cal!$S$7=9,ExtraTaal1!L21,IF(cal!$S$7=10,ExtraTaal2!L21,IF(cal!$S$7=11,ExtraTaal3!L21,)))))))))))","v":0},{"$f":"IF($S$7=1,NL!M21,IF(cal!$S$7=2,EN!M21,IF(cal!$S$7=3,DE!M21,IF(cal!$S$7=4,FR!M21,IF(cal!$S$7=5,NR!M21,IF(cal!$S$7=6,SP!M21,IF(cal!$S$7=7,SW!M21,IF(cal!$S$7=8,TS!M21,IF(cal!$S$7=9,ExtraTaal1!M21,IF(cal!$S$7=10,ExtraTaal2!M21,IF(cal!$S$7=11,ExtraTaal3!M21,)))))))))))","v":0},{"$f":"IF($S$7=1,NL!N21,IF(cal!$S$7=2,EN!N21,IF(cal!$S$7=3,DE!N21,IF(cal!$S$7=4,FR!N21,IF(cal!$S$7=5,NR!N21,IF(cal!$S$7=6,SP!N21,IF(cal!$S$7=7,SW!N21,IF(cal!$S$7=8,TS!N21,IF(cal!$S$7=9,ExtraTaal1!N21,IF(cal!$S$7=10,ExtraTaal2!N21,IF(cal!$S$7=11,ExtraTaal3!N21,)))))))))))","v":0},{"$f":"IF($S$7=1,NL!O21,IF(cal!$S$7=2,EN!O21,IF(cal!$S$7=3,DE!O21,IF(cal!$S$7=4,FR!O21,IF(cal!$S$7=5,NR!O21,IF(cal!$S$7=6,SP!O21,IF(cal!$S$7=7,SW!O21,IF(cal!$S$7=8,TS!O21,IF(cal!$S$7=9,ExtraTaal1!O21,IF(cal!$S$7=10,ExtraTaal2!O21,IF(cal!$S$7=11,ExtraTaal3!O21,)))))))))))","v":0},"n-value","n-value","n-value","n-value","n-value","n-value",null,{"$f":"IF($X$16=1,AE22,IF($X$16=2,AQ22,IF($X$16=3,BP22,IF($X$16=4,BI22,IF($X$16=5,CE22,IF($X$16=6,BX22,IF($X$16=7,BB22,)))))))","v":"H"},6,{"$f":"IF($X$16=1,AG22,IF($X$16=2,AS22,IF($X$16=3,BR22,IF($X$16=4,BK22,IF($X$16=5,CG22,IF($X$16=6,BZ22,IF($X$16=7,BD22,)))))))","v":"B"},{"$f":"IF($X$16=1,AH22,IF($X$16=2,AT22,IF($X$16=3,BS22,IF($X$16=4,BL22,IF($X$16=5,CH22,IF($X$16=6,CA22,IF($X$16=7,BE22,)))))))","v":14},{"$f":"IF($X$16=1,AI22,IF($X$16=2,AU22,IF($X$16=3,BT22,IF($X$16=4,BM22,IF($X$16=5,CI22,IF($X$16=6,CB22,IF($X$16=7,BF22,)))))))","v":"L"},{"$f":"IF($X$16=1,AJ22,IF($X$16=2,AV22,IF($X$16=3,BU22,IF($X$16=4,BN22,IF($X$16=5,CJ22,IF($X$16=6,CC22,IF($X$16=7,BG22,)))))))","v":60},{"$f":"IF($X$16=1,AK22,IF($X$16=2,AW22,IF($X$16=3,BV22,IF($X$16=4,BO22,IF($X$16=5,CK22,IF($X$16=6,CD22,IF($X$16=7,BH22,)))))))","v":30},"H",{"$f":"6*IF($X$4=1,1,IF($X$4=2,1/2.54))","v":6},"B",{"$f":"ROUND(14*IF($X$4=1,1,IF($X$4=2,1/2.54)),1)","v":14},"L",{"$f":"60*IF($X$4=1,1,IF($X$4=2,1/2.54))","v":60},30,60,{"$f":"((AN22*(AL22^AP22)*(($AJ$22-19.5)/100)*2)+AO22*(AL22^2))*0.0098","v":0}]
[null,0.2,2,{"$f":"(X23*($T$11^$Q23))*Watts*CF_Altit","v":129.35},{"$f":"ROUND(((D23/Watts)/(($S$9-$S$10)*1.163))*$E$14,IF($X$4=1,0,IF($X$4=2,2)))","v":11},{"$f":"(IF($X$4=1,AM23,IF($X$4=2,AM23*0.334552563)))","v":8.1804988909735012E-3},null,null,null,null,{"$f":"L23-8","v":14.3},{"$f":"AB23","v":22.3},0.52,{"$f":"AD23*Cubics","v":18},{"$f":"((($D23/Watts)/(((p_atm*0.028964)/(8.31447*(20+273.15)))*(($N23/3600)/Cubics)*(1005+1870*((0.622)/(((p_atm)/($E$12*Pvs_Heat_in))-1)))))+Tl_heat)*Celc1+Celc2","v":41.093551911657727},{"$f":"(Tl_cool-(($G23/Watts)/(1006*$N23*kgss)))*Celc1+Celc2","v":0},1,0.6,0.6,1.1599999999999999,0.78069999999999995,0.87660000000000005,{"$f":"(H23-G23)/H23","v":{"$error":"#DIV/0!"}},129.35,{"$f":"IF($X$16=1,AF23,IF($X$16=2,AR23,IF($X$16=3,BQ23,IF($X$16=4,BJ23,IF($X$16=5,CF23,IF($X$16=6,BY23,IF($X$16=7,BC23,)))))))","v":"a"},62,"a",22.3,0.52,18,{"$f":"AE29*($AK$28/$AK$34)","v":129.35},"a",62,"a",22.3,0.52,18,{"$f":"((D23/Watts)/(($S$9-$S$10)*1.163))","v":11.122098022355974},{"$f":"((AN23*(AL23^AP23)*(($AL$28-19.5)/100)*2)+AO23*(AL23^2))*0.0098","v":8.1804988909735012E-3},6.5250871001174002E-3,5.7852740858429998E-4,1.8056661148752]
[null,0.4,4,{"$f":"(X24*($T$11^$Q24))*Watts*CF_Altit","v":339.95},{"$f":"ROUND(((D24/Watts)/(($S$9-$S$10)*1.163))*$E$14,IF($X$4=1,0,IF($X$4=2,2)))","v":29},{"$f":"(IF($X$4=1,AM24,IF($X$4=2,AM24*0.334552563)))","v":4.7659438328917308E-2},null,null,null,null,{"$f":"L24-8","v":17.399999999999999},25.4,0.87,{"$f":"AD24*Cubics","v":30},{"$f":"((($D24/Watts)/(((p_atm*0.028964)/(8.31447*(20+273.15)))*(($N24/3600)/Cubics)*(1005+1870*((0.622)/(((p_atm)/($E$12*Pvs_Heat_in))-1)))))+Tl_heat)*Celc1+Celc2","v":53.262093416473348},{"$f":"(Tl_cool-(($G24/Watts)/(1006*$N24*kgss)))*Celc1+Celc2","v":0},1,0.68,0.68,1.04,0.85870000000000002,0.87749999999999995,{"$f":"(H24-G24)/H24","v":{"$error":"#DIV/0!"}},339.95,{"$f":"IF($X$16=1,AF24,IF($X$16=2,AR24,IF($X$16=3,BQ24,IF($X$16=4,BJ24,IF($X$16=5,CF24,IF($X$16=6,BY24,IF($X$16=7,BC24,)))))))","v":4.0202009009986008E-4},135,4.0202009009986008E-4,25.4,0.87,30,{"$f":"AE30*($AK$28/$AK$34)","v":339.95},4.0202009009986008E-4,135,{"$f":"AF24","v":4.0202009009986008E-4},25.4,0.87,30,{"$f":"((D24/Watts)/(($S$9-$S$10)*1.163))","v":29.230438521066205},{"$f":"((AN24*(AL24^AP24)*(($AL$28-19.5)/100)*2)+AO24*(AL24^2))*0.0098","v":4.7659438328917308E-2},6.5250871001174002E-3,5.7852740858429998E-4,1.8056661148752]
[null,0.6,6,{"$f":"(X25*($T$11^$Q25))*Watts*CF_Altit","v":684.45},{"$f":"ROUND(((D25/Watts)/(($S$9-$S$10)*1.163))*$E$14,IF($X$4=1,0,IF($X$4=2,2)))","v":59},0.17112857897053232,null,null,null,null,{"$f":"L25-8","v":25.5},33.5,1.53,{"$f":"AD25*Cubics","v":50},{"$f":"((($D25/Watts)/(((p_atm*0.028964)/(8.31447*(20+273.15)))*(($N25/3600)/Cubics)*(1005+1870*((0.622)/(((p_atm)/($E$12*Pvs_Heat_in))-1)))))+Tl_heat)*Celc1+Celc2","v":60.181626425483486},{"$f":"(Tl_cool-(($G25/Watts)/(1006*$N25*kgss)))*Celc1+Celc2","v":0},1,0.79,0.79,0.95,0.8831,0.88200000000000001,{"$f":"(H25-G25)/H25","v":{"$error":"#DIV/0!"}},684.45,{"$f":"IF($X$16=1,AF25,IF($X$16=2,AR25,IF($X$16=3,BQ25,IF($X$16=4,BJ25,IF($X$16=5,CF25,IF($X$16=6,BY25,IF($X$16=7,BC25,)))))))","v":"b"},214,"b",33.5,1.53,50,{"$f":"AE31*($AK$28/$AK$34)","v":684.45},"b",214,"b",33.5,1.53,50,{"$f":"((D25/Watts)/(($S$9-$S$10)*1.163))","v":58.852106620808257},0.17112857897053232,6.5250871001174002E-3,5.7852740858429998E-4,1.8056661148752]
[null,0.8,8,{"$f":"(X26*($T$11^$Q26))*Watts*CF_Altit","v":911.95},{"$f":"ROUND(((D26/Watts)/(($S$9-$S$10)*1.163))*$E$14,IF($X$4=1,0,IF($X$4=2,2)))","v":78},0.28920796013227545,null,null,null,null,{"$f":"L26-8","v":36.1},44.1,2.46,{"$f":"AD26*Cubics","v":74},{"$f":"((($D26/Watts)/(((p_atm*0.028964)/(8.31447*(20+273.15)))*(($N26/3600)/Cubics)*(1005+1870*((0.622)/(((p_atm)/($E$12*Pvs_Heat_in))-1)))))+Tl_heat)*Celc1+Celc2","v":56.173880210308596},{"$f":"(Tl_cool-(($G26/Watts)/(1006*$N26*kgss)))*Celc1+Celc2","v":0},1,0.87,0.87,0.95,0.85389999999999999,0.89500000000000002,{"$f":"(H26-G26)/H26","v":{"$error":"#DIV/0!"}},911.95,{"$f":"IF($X$16=1,AF26,IF($X$16=2,AR26,IF($X$16=3,BQ26,IF($X$16=4,BJ26,IF($X$16=5,CF26,IF($X$16=6,BY26,IF($X$16=7,BC26,)))))))","v":1.8235155847906248},296,1.8235155847906248,44.1,2.46,74,{"$f":"AE32*($AK$28/$AK$34)","v":911.95},1.8235155847906248,296,{"$f":"AF26","v":1.8235155847906248},44.1,2.46,74,{"$f":"((D26/Watts)/(($S$9-$S$10)*1.163))","v":78.413585554600175},0.28920796013227545,6.5250871001174002E-3,5.7852740858429998E-4,1.8056661148752]
[null,1,10,{"$f":"(X27*($T$11^$Q27))*Watts*CF_Altit","v":1071.8500000000001},{"$f":"ROUND(((D27/Watts)/(($S$9-$S$10)*1.163))*$E$14,IF($X$4=1,0,IF($X$4=2,2)))","v":92},0.38865796493862237,null,null,null,null,{"$f":"L27-8","v":42.5},50.5,3.84,{"$f":"AD27*Cubics","v":98},{"$f":"((($D27/Watts)/(((p_atm*0.028964)/(8.31447*(20+273.15)))*(($N27/3600)/Cubics)*(1005+1870*((0.622)/(((p_atm)/($E$12*Pvs_Heat_in))-1)))))+Tl_heat)*Celc1+Celc2","v":52.104338418717312},{"$f":"(Tl_cool-(($G27/Watts)/(1006*$N27*kgss)))*Celc1+Celc2","v":0},1,0.91,0.91,0.98,0.77110000000000001,0.91110000000000002,{"$f":"(H27-G27)/H27","v":{"$error":"#DIV/0!"}},1071.8500000000001,{"$f":"IF($X$16=1,AF27,IF($X$16=2,AR27,IF($X$16=3,BQ27,IF($X$16=4,BJ27,IF($X$16=5,CF27,IF($X$16=6,BY27,IF($X$16=7,BC27,)))))))","v":0},381,0,50.5,3.84,98,{"$f":"AE33*($AK$28/$AK$34)","v":1071.8500000000001},null,381,null,50.5,3.84,98,{"$f":"((D27/Watts)/(($S$9-$S$10)*1.163))","v":92.162510748065358},0.38865796493862237,6.5250871001174002E-3,5.7852740858429998E-4,1.8056661148752]
[null,{"$f":"IF($S$7=1,NL!A27,IF(cal!$S$7=2,EN!A27,IF(cal!$S$7=3,DE!A27,IF(cal!$S$7=4,FR!A27,IF(cal!$S$7=5,NR!A27,IF(cal!$S$7=6,SP!A27,IF(cal!$S$7=7,SW!A27,IF(cal!$S$7=8,TS!A27,IF(cal!$S$7=9,ExtraTaal1!A27,IF(cal!$S$7=10,ExtraTaal2!A27,IF(cal!$S$7=11,ExtraTaal3!A27,)))))))))))","v":"Micro Canal height 6 cm width 14 cm length 130 cm (Type 3)"},{"$f":"IF($S$7=1,NL!B27,IF(cal!$S$7=2,EN!B27,IF(cal!$S$7=3,DE!B27,IF(cal!$S$7=4,FR!B27,IF(cal!$S$7=5,NR!B27,IF(cal!$S$7=6,SP!B27,IF(cal!$S$7=7,SW!B27,IF(cal!$S$7=8,TS!B27,IF(cal!$S$7=9,ExtraTaal1!B27,IF(cal!$S$7=10,ExtraTaal2!B27,IF(cal!$S$7=11,ExtraTaal3!B27,)))))))))))","v":0},{"$f":"IF($S$7=1,NL!C27,IF(cal!$S$7=2,EN!C27,IF(cal!$S$7=3,DE!C27,IF(cal!$S$7=4,FR!C27,IF(cal!$S$7=5,NR!C27,IF(cal!$S$7=6,SP!C27,IF(cal!$S$7=7,SW!C27,IF(cal!$S$7=8,TS!C27,IF(cal!$S$7=9,ExtraTaal1!C27,IF(cal!$S$7=10,ExtraTaal2!C27,IF(cal!$S$7=11,ExtraTaal3!C27,)))))))))))","v":0},{"$f":"IF($S$7=1,NL!D27,IF(cal!$S$7=2,EN!D27,IF(cal!$S$7=3,DE!D27,IF(cal!$S$7=4,FR!D27,IF(cal!$S$7=5,NR!D27,IF(cal!$S$7=6,SP!D27,IF(cal!$S$7=7,SW!D27,IF(cal!$S$7=8,TS!D27,IF(cal!$S$7=9,ExtraTaal1!D27,IF(cal!$S$7=10,ExtraTaal2!D27,IF(cal!$S$7=11,ExtraTaal3!D27,)))))))))))","v":0},{"$f":"IF($S$7=1,NL!E27,IF(cal!$S$7=2,EN!E27,IF(cal!$S$7=3,DE!E27,IF(cal!$S$7=4,FR!E27,IF(cal!$S$7=5,NR!E27,IF(cal!$S$7=6,SP!E27,IF(cal!$S$7=7,SW!E27,IF(cal!$S$7=8,TS!E27,IF(cal!$S$7=9,ExtraTaal1!E27,IF(cal!$S$7=10,ExtraTaal2!E27,IF(cal!$S$7=11,ExtraTaal3!E27,)))))))))))","v":0},{"$f":"IF($S$7=1,NL!F27,IF(cal!$S$7=2,EN!F27,IF(cal!$S$7=3,DE!F27,IF(cal!$S$7=4,FR!F27,IF(cal!$S$7=5,NR!F27,IF(cal!$S$7=6,SP!F27,IF(cal!$S$7=7,SW!F27,IF(cal!$S$7=8,TS!F27,IF(cal!$S$7=9,ExtraTaal1!F27,IF(cal!$S$7=10,ExtraTaal2!F27,IF(cal!$S$7=11,ExtraTaal3!F27,)))))))))))","v":0},{"$f":"IF($S$7=1,NL!G27,IF(cal!$S$7=2,EN!G27,IF(cal!$S$7=3,DE!G27,IF(cal!$S$7=4,FR!G27,IF(cal!$S$7=5,NR!G27,IF(cal!$S$7=6,SP!G27,IF(cal!$S$7=7,SW!G27,IF(cal!$S$7=8,TS!G27,IF(cal!$S$7=9,ExtraTaal1!G27,IF(cal!$S$7=10,ExtraTaal2!G27,IF(cal!$S$7=11,ExtraTaal3!G27,)))))))))))","v":0},{"$f":"IF($S$7=1,NL!H27,IF(cal!$S$7=2,EN!H27,IF(cal!$S$7=3,DE!H27,IF(cal!$S$7=4,FR!H27,IF(cal!$S$7=5,NR!H27,IF(cal!$S$7=6,SP!H27,IF(cal!$S$7=7,SW!H27,IF(cal!$S$7=8,TS!H27,IF(cal!$S$7=9,ExtraTaal1!H27,IF(cal!$S$7=10,ExtraTaal2!H27,IF(cal!$S$7=11,ExtraTaal3!H27,)))))))))))","v":0},{"$f":"IF($S$7=1,NL!I27,IF(cal!$S$7=2,EN!I27,IF(cal!$S$7=3,DE!I27,IF(cal!$S$7=4,FR!I27,IF(cal!$S$7=5,NR!I27,IF(cal!$S$7=6,SP!I27,IF(cal!$S$7=7,SW!I27,IF(cal!$S$7=8,TS!I27,IF(cal!$S$7=9,ExtraTaal1!I27,IF(cal!$S$7=10,ExtraTaal2!I27,IF(cal!$S$7=11,ExtraTaal3!I27,)))))))))))","v":0},{"$f":"IF($S$7=1,NL!J27,IF(cal!$S$7=2,EN!J27,IF(cal!$S$7=3,DE!J27,IF(cal!$S$7=4,FR!J27,IF(cal!$S$7=5,NR!J27,IF(cal!$S$7=6,SP!J27,IF(cal!$S$7=7,SW!J27,IF(cal!$S$7=8,TS!J27,IF(cal!$S$7=9,ExtraTaal1!J27,IF(cal!$S$7=10,ExtraTaal2!J27,IF(cal!$S$7=11,ExtraTaal3!J27,)))))))))))","v":0},{"$f":"IF($S$7=1,NL!K27,IF(cal!$S$7=2,EN!K27,IF(cal!$S$7=3,DE!K27,IF(cal!$S$7=4,FR!K27,IF(cal!$S$7=5,NR!K27,IF(cal!$S$7=6,SP!K27,IF(cal!$S$7=7,SW!K27,IF(cal!$S$7=8,TS!K27,IF(cal!$S$7=9,ExtraTaal1!K27,IF(cal!$S$7=10,ExtraTaal2!K27,IF(cal!$S$7=11,ExtraTaal3!K27,)))))))))))","v":0},{"$f":"IF($S$7=1,NL!L27,IF(cal!$S$7=2,EN!L27,IF(cal!$S$7=3,DE!L27,IF(cal!$S$7=4,FR!L27,IF(cal!$S$7=5,NR!L27,IF(cal!$S$7=6,SP!L27,IF(cal!$S$7=7,SW!L27,IF(cal!$S$7=8,TS!L27,IF(cal!$S$7=9,ExtraTaal1!L27,IF(cal!$S$7=10,ExtraTaal2!L27,IF(cal!$S$7=11,ExtraTaal3!L27,)))))))))))","v":0},{"$f":"IF($S$7=1,NL!M27,IF(cal!$S$7=2,EN!M27,IF(cal!$S$7=3,DE!M27,IF(cal!$S$7=4,FR!M27,IF(cal!$S$7=5,NR!M27,IF(cal!$S$7=6,SP!M27,IF(cal!$S$7=7,SW!M27,IF(cal!$S$7=8,TS!M27,IF(cal!$S$7=9,ExtraTaal1!M27,IF(cal!$S$7=10,ExtraTaal2!M27,IF(cal!$S$7=11,ExtraTaal3!M27,)))))))))))","v":0},{"$f":"IF($S$7=1,NL!N27,IF(cal!$S$7=2,EN!N27,IF(cal!$S$7=3,DE!N27,IF(cal!$S$7=4,FR!N27,IF(cal!$S$7=5,NR!N27,IF(cal!$S$7=6,SP!N27,IF(cal!$S$7=7,SW!N27,IF(cal!$S$7=8,TS!N27,IF(cal!$S$7=9,ExtraTaal1!N27,IF(cal!$S$7=10,ExtraTaal2!N27,IF(cal!$S$7=11,ExtraTaal3!N27,)))))))))))","v":0},{"$f":"IF($S$7=1,NL!O27,IF(cal!$S$7=2,EN!O27,IF(cal!$S$7=3,DE!O27,IF(cal!$S$7=4,FR!O27,IF(cal!$S$7=5,NR!O27,IF(cal!$S$7=6,SP!O27,IF(cal!$S$7=7,SW!O27,IF(cal!$S$7=8,TS!O27,IF(cal!$S$7=9,ExtraTaal1!O27,IF(cal!$S$7=10,ExtraTaal2!O27,IF(cal!$S$7=11,ExtraTaal3!O27,)))))))))))","v":0},"n-value","n-value","n-value","n-value","n-value","n-value",null,"H",6,"B",{"$f":"IF($X$16=1,AH28,IF($X$16=2,AT28,IF($X$16=3,BS28,IF($X$16=4,BL28,IF($X$16=5,CH28,IF($X$16=6,CA28,IF($X$16=7,BE28,)))))))","v":14},"L",95,65,"H",{"$f":"AF22","v":6},"B",{"$f":"AH22","v":14},"L",{"$f":"95*IF($X$4=1,1,IF($X$4=2,1/2.54))","v":95},65,95,{"$f":"((AN28*(AL28^AP28)*(($AJ$28-19.5)/100)*2)+AO28*(AL28^2))*0.0098","v":0.41083257292528919},6.5250871001174002E-3,5.7852740858429998E-4,1.8056661148752]
[null,0.2,2,{"$f":"(X29*($T$11^$Q29))*Watts*CF_Altit","v":199},{"$f":"ROUND(((D29/Watts)/(($S$9-$S$10)*1.163))*$E$14,IF($X$4=1,0,IF($X$4=2,2)))","v":17},{"$f":"(IF($X$4=1,AM29,IF($X$4=2,AM29*0.334552563)))","v":2.5487791512859199E-2},null,null,null,null,{"$f":"L29-8","v":13.899999999999999},{"$f":"AB29","v":21.9},0.54,{"$f":"AD29*Cubics","v":26},{"$f":"((($D29/Watts)/(((p_atm*0.028964)/(8.31447*(20+273.15)))*(($N29/3600)/Cubics)*(1005+1870*((0.622)/(((p_atm)/($E$12*Pvs_Heat_in))-1)))))+Tl_heat)*Celc1+Celc2","v":42.466504994665044},{"$f":"(Tl_cool-(($G29/Watts)/(1006*$N29*kgss)))*Celc1+Celc2","v":0},1,0.6,0.6,1.1599999999999999,0.78069999999999995,0.87660000000000005,{"$f":"(H29-G29)/H29","v":{"$error":"#DIV/0!"}},199,{"$f":"IF($X$16=1,AF29,IF($X$16=2,AR29,IF($X$16=3,BQ29,IF($X$16=4,BJ29,IF($X$16=5,CF29,IF($X$16=6,BY29,IF($X$16=7,BC29,)))))))","v":"a"},97,"a",21.9,0.54,26,199,"a",97,"a",21.9,0.54,26,{"$f":"((D29/Watts)/(($S$9-$S$10)*1.163))","v":17.110920034393807},{"$f":"((AN29*(AL29^AP29)*(($AL$34-19.5)/100)*2)+AO29*(AL29^2))*0.0098","v":2.5487791512859199E-2},6.5250871001174002E-3,5.7852740858429998E-4,1.8056661148752]
[null,0.4,4,{"$f":"(X30*($T$11^$Q30))*Watts*CF_Altit","v":523},{"$f":"ROUND(((D30/Watts)/(($S$9-$S$10)*1.163))*$E$14,IF($X$4=1,0,IF($X$4=2,2)))","v":45},{"$f":"(IF($X$4=1,AM30,IF($X$4=2,AM30*0.334552563)))","v":0.14787039100998542},null,null,null,null,{"$f":"L30-8","v":15.2},23.2,0.95,{"$f":"AD30*Cubics","v":41},{"$f":"((($D30/Watts)/(((p_atm*0.028964)/(8.31447*(20+273.15)))*(($N30/3600)/Cubics)*(1005+1870*((0.622)/(((p_atm)/($E$12*Pvs_Heat_in))-1)))))+Tl_heat)*Celc1+Celc2","v":57.44325712923829},{"$f":"(Tl_cool-(($G30/Watts)/(1006*$N30*kgss)))*Celc1+Celc2","v":0},1,0.68,0.68,1.04,0.85870000000000002,0.87749999999999995,{"$f":"(H30-G30)/H30","v":{"$error":"#DIV/0!"}},523,{"$f":"IF($X$16=1,AF30,IF($X$16=2,AR30,IF($X$16=3,BQ30,IF($X$16=4,BJ30,IF($X$16=5,CF30,IF($X$16=6,BY30,IF($X$16=7,BC30,)))))))","v":5.6054747775989447E-4},212,5.6054747775989447E-4,23.2,0.95,41,523,5.6054747775989447E-4,212,{"$f":"AF30","v":5.6054747775989447E-4},23.2,0.95,41,{"$f":"((D30/Watts)/(($S$9-$S$10)*1.163))","v":44.969905417024933},{"$f":"((AN30*(AL30^AP30)*(($AL$34-19.5)/100)*2)+AO30*(AL30^2))*0.0098","v":0.14787039100998542},6.5250871001174002E-3,5.7852740858429998E-4,1.8056661148752]
[null,0.6,6,{"$f":"(X31*($T$11^$Q31))*Watts*CF_Altit","v":1053},{"$f":"ROUND(((D31/Watts)/(($S$9-$S$10)*1.163))*$E$14,IF($X$4=1,0,IF($X$4=2,2)))","v":91},0.52911427842315595,null,null,null,null,{"$f":"L31-8","v":26.4},34.4,1.62,{"$f":"AD31*Cubics","v":67},{"$f":"((($D31/Watts)/(((p_atm*0.028964)/(8.31447*(20+273.15)))*(($N31/3600)/Cubics)*(1005+1870*((0.622)/(((p_atm)/($E$12*Pvs_Heat_in))-1)))))+Tl_heat)*Celc1+Celc2","v":66.132751349579209},{"$f":"(Tl_cool-(($G31/Watts)/(1006*$N31*kgss)))*Celc1+Celc2","v":0},1,0.79,0.79,0.95,0.8831,0.88200000000000001,{"$f":"(H31-G31)/H31","v":{"$error":"#DIV/0!"}},1053,{"$f":"IF($X$16=1,AF31,IF($X$16=2,AR31,IF($X$16=3,BQ31,IF($X$16=4,BJ31,IF($X$16=5,CF31,IF($X$16=6,BY31,IF($X$16=7,BC31,)))))))","v":"b"},336,"b",34.4,1.62,67,1053,"b",336,"b",34.4,1.62,67,{"$f":"((D31/Watts)/(($S$9-$S$10)*1.163))","v":90.541702493551156},0.52911427842315595,6.5250871001174002E-3,5.7852740858429998E-4,1.8056661148752]
[null,0.8,8,{"$f":"(X32*($T$11^$Q32))*Watts*CF_Altit","v":1403},{"$f":"ROUND(((D32/Watts)/(($S$9-$S$10)*1.163))*$E$14,IF($X$4=1,0,IF($X$4=2,2)))","v":121},0.89283420159553806,null,null,null,null,{"$f":"L32-8","v":37.200000000000003},45.2,2.65,{"$f":"AD32*Cubics","v":99},{"$f":"((($D32/Watts)/(((p_atm*0.028964)/(8.31447*(20+273.15)))*(($N32/3600)/Cubics)*(1005+1870*((0.622)/(((p_atm)/($E$12*Pvs_Heat_in))-1)))))+Tl_heat)*Celc1+Celc2","v":61.598556885203358},{"$f":"(Tl_cool-(($G32/Watts)/(1006*$N32*kgss)))*Celc1+Celc2","v":0},1,0.87,0.87,0.95,0.85389999999999999,0.89500000000000002,{"$f":"(H32-G32)/H32","v":{"$error":"#DIV/0!"}},1403,{"$f":"IF($X$16=1,AF32,IF($X$16=2,AR32,IF($X$16=3,BQ32,IF($X$16=4,BJ32,IF($X$16=5,CF32,IF($X$16=6,BY32,IF($X$16=7,BC32,)))))))","v":1.8235155847906248},465,1.8235155847906248,45.2,2.65,99,1403,1.8235155847906248,465,{"$f":"AF32","v":1.8235155847906248},45.2,2.65,99,{"$f":"((D32/Watts)/(($S$9-$S$10)*1.163))","v":120.63628546861564},0.89283420159553806,6.5250871001174002E-3,5.7852740858429998E-4,1.8056661148752]
[null,1,10,{"$f":"(X33*($T$11^$Q33))*Watts*CF_Altit","v":1649},{"$f":"ROUND(((D33/Watts)/(($S$9-$S$10)*1.163))*$E$14,IF($X$4=1,0,IF($X$4=2,2)))","v":142},1.1987811623016493,null,null,null,null,{"$f":"L33-8","v":41.8},49.8,4.1399999999999997,{"$f":"AD33*Cubics","v":130},{"$f":"((($D33/Watts)/(((p_atm*0.028964)/(8.31447*(20+273.15)))*(($N33/3600)/Cubics)*(1005+1870*((0.622)/(((p_atm)/($E$12*Pvs_Heat_in))-1)))))+Tl_heat)*Celc1+Celc2","v":57.23343390573131},{"$f":"(Tl_cool-(($G33/Watts)/(1006*$N33*kgss)))*Celc1+Celc2","v":0},1,0.91,0.91,0.98,0.77110000000000001,0.91110000000000002,{"$f":"(H33-G33)/H33","v":{"$error":"#DIV/0!"}},1649,{"$f":"IF($X$16=1,AF33,IF($X$16=2,AR33,IF($X$16=3,BQ33,IF($X$16=4,BJ33,IF($X$16=5,CF33,IF($X$16=6,BY33,IF($X$16=7,BC33,)))))))","v":0},598,0,49.8,4.1399999999999997,130,1649,null,598,null,49.8,4.1399999999999997,130,{"$f":"((D33/Watts)/(($S$9-$S$10)*1.163))","v":141.78847807394669},1.1987811623016493,6.5250871001174002E-3,5.7852740858429998E-4,1.8056661148752]
[null,{"$f":"IF($S$7=1,NL!A33,IF(cal!$S$7=2,EN!A33,IF(cal!$S$7=3,DE!A33,IF(cal!$S$7=4,FR!A33,IF(cal!$S$7=5,NR!A33,IF(cal!$S$7=6,SP!A33,IF(cal!$S$7=7,SW!A33,IF(cal!$S$7=8,TS!A33,IF(cal!$S$7=9,ExtraTaal1!A33,IF(cal!$S$7=10,ExtraTaal2!A33,IF(cal!$S$7=11,ExtraTaal3!A33,)))))))))))","v":"Micro Canal height 6 cm width 14 cm length 165 cm (Type 4)"},{"$f":"IF($S$7=1,NL!B33,IF(cal!$S$7=2,EN!B33,IF(cal!$S$7=3,DE!B33,IF(cal!$S$7=4,FR!B33,IF(cal!$S$7=5,NR!B33,IF(cal!$S$7=6,SP!B33,IF(cal!$S$7=7,SW!B33,IF(cal!$S$7=8,TS!B33,IF(cal!$S$7=9,ExtraTaal1!B33,IF(cal!$S$7=10,ExtraTaal2!B33,IF(cal!$S$7=11,ExtraTaal3!B33,)))))))))))","v":0},{"$f":"IF($S$7=1,NL!C33,IF(cal!$S$7=2,EN!C33,IF(cal!$S$7=3,DE!C33,IF(cal!$S$7=4,FR!C33,IF(cal!$S$7=5,NR!C33,IF(cal!$S$7=6,SP!C33,IF(cal!$S$7=7,SW!C33,IF(cal!$S$7=8,TS!C33,IF(cal!$S$7=9,ExtraTaal1!C33,IF(cal!$S$7=10,ExtraTaal2!C33,IF(cal!$S$7=11,ExtraTaal3!C33,)))))))))))","v":0},{"$f":"IF($S$7=1,NL!D33,IF(cal!$S$7=2,EN!D33,IF(cal!$S$7=3,DE!D33,IF(cal!$S$7=4,FR!D33,IF(cal!$S$7=5,NR!D33,IF(cal!$S$7=6,SP!D33,IF(cal!$S$7=7,SW!D33,IF(cal!$S$7=8,TS!D33,IF(cal!$S$7=9,ExtraTaal1!D33,IF(cal!$S$7=10,ExtraTaal2!D33,IF(cal!$S$7=11,ExtraTaal3!D33,)))))))))))","v":0},{"$f":"IF($S$7=1,NL!E33,IF(cal!$S$7=2,EN!E33,IF(cal!$S$7=3,DE!E33,IF(cal!$S$7=4,FR!E33,IF(cal!$S$7=5,NR!E33,IF(cal!$S$7=6,SP!E33,IF(cal!$S$7=7,SW!E33,IF(cal!$S$7=8,TS!E33,IF(cal!$S$7=9,ExtraTaal1!E33,IF(cal!$S$7=10,ExtraTaal2!E33,IF(cal!$S$7=11,ExtraTaal3!E33,)))))))))))","v":0},{"$f":"IF($S$7=1,NL!F33,IF(cal!$S$7=2,EN!F33,IF(cal!$S$7=3,DE!F33,IF(cal!$S$7=4,FR!F33,IF(cal!$S$7=5,NR!F33,IF(cal!$S$7=6,SP!F33,IF(cal!$S$7=7,SW!F33,IF(cal!$S$7=8,TS!F33,IF(cal!$S$7=9,ExtraTaal1!F33,IF(cal!$S$7=10,ExtraTaal2!F33,IF(cal!$S$7=11,ExtraTaal3!F33,)))))))))))","v":0},{"$f":"IF($S$7=1,NL!G33,IF(cal!$S$7=2,EN!G33,IF(cal!$S$7=3,DE!G33,IF(cal!$S$7=4,FR!G33,IF(cal!$S$7=5,NR!G33,IF(cal!$S$7=6,SP!G33,IF(cal!$S$7=7,SW!G33,IF(cal!$S$7=8,TS!G33,IF(cal!$S$7=9,ExtraTaal1!G33,IF(cal!$S$7=10,ExtraTaal2!G33,IF(cal!$S$7=11,ExtraTaal3!G33,)))))))))))","v":0},{"$f":"IF($S$7=1,NL!H33,IF(cal!$S$7=2,EN!H33,IF(cal!$S$7=3,DE!H33,IF(cal!$S$7=4,FR!H33,IF(cal!$S$7=5,NR!H33,IF(cal!$S$7=6,SP!H33,IF(cal!$S$7=7,SW!H33,IF(cal!$S$7=8,TS!H33,IF(cal!$S$7=9,ExtraTaal1!H33,IF(cal!$S$7=10,ExtraTaal2!H33,IF(cal!$S$7=11,ExtraTaal3!H33,)))))))))))","v":0},{"$f":"IF($S$7=1,NL!I33,IF(cal!$S$7=2,EN!I33,IF(cal!$S$7=3,DE!I33,IF(cal!$S$7=4,FR!I33,IF(cal!$S$7=5,NR!I33,IF(cal!$S$7=6,SP!I33,IF(cal!$S$7=7,SW!I33,IF(cal!$S$7=8,TS!I33,IF(cal!$S$7=9,ExtraTaal1!I33,IF(cal!$S$7=10,ExtraTaal2!I33,IF(cal!$S$7=11,ExtraTaal3!I33,)))))))))))","v":0},{"$f":"IF($S$7=1,NL!J33,IF(cal!$S$7=2,EN!J33,IF(cal!$S$7=3,DE!J33,IF(cal!$S$7=4,FR!J33,IF(cal!$S$7=5,NR!J33,IF(cal!$S$7=6,SP!J33,IF(cal!$S$7=7,SW!J33,IF(cal!$S$7=8,TS!J33,IF(cal!$S$7=9,ExtraTaal1!J33,IF(cal!$S$7=10,ExtraTaal2!J33,IF(cal!$S$7=11,ExtraTaal3!J33,)))))))))))","v":0},{"$f":"IF($S$7=1,NL!K33,IF(cal!$S$7=2,EN!K33,IF(cal!$S$7=3,DE!K33,IF(cal!$S$7=4,FR!K33,IF(cal!$S$7=5,NR!K33,IF(cal!$S$7=6,SP!K33,IF(cal!$S$7=7,SW!K33,IF(cal!$S$7=8,TS!K33,IF(cal!$S$7=9,ExtraTaal1!K33,IF(cal!$S$7=10,ExtraTaal2!K33,IF(cal!$S$7=11,ExtraTaal3!K33,)))))))))))","v":0},{"$f":"IF($S$7=1,NL!L33,IF(cal!$S$7=2,EN!L33,IF(cal!$S$7=3,DE!L33,IF(cal!$S$7=4,FR!L33,IF(cal!$S$7=5,NR!L33,IF(cal!$S$7=6,SP!L33,IF(cal!$S$7=7,SW!L33,IF(cal!$S$7=8,TS!L33,IF(cal!$S$7=9,ExtraTaal1!L33,IF(cal!$S$7=10,ExtraTaal2!L33,IF(cal!$S$7=11,ExtraTaal3!L33,)))))))))))","v":0},{"$f":"IF($S$7=1,NL!M33,IF(cal!$S$7=2,EN!M33,IF(cal!$S$7=3,DE!M33,IF(cal!$S$7=4,FR!M33,IF(cal!$S$7=5,NR!M33,IF(cal!$S$7=6,SP!M33,IF(cal!$S$7=7,SW!M33,IF(cal!$S$7=8,TS!M33,IF(cal!$S$7=9,ExtraTaal1!M33,IF(cal!$S$7=10,ExtraTaal2!M33,IF(cal!$S$7=11,ExtraTaal3!M33,)))))))))))","v":0},{"$f":"IF($S$7=1,NL!N33,IF(cal!$S$7=2,EN!N33,IF(cal!$S$7=3,DE!N33,IF(cal!$S$7=4,FR!N33,IF(cal!$S$7=5,NR!N33,IF(cal!$S$7=6,SP!N33,IF(cal!$S$7=7,SW!N33,IF(cal!$S$7=8,TS!N33,IF(cal!$S$7=9,ExtraTaal1!N33,IF(cal!$S$7=10,ExtraTaal2!N33,IF(cal!$S$7=11,ExtraTaal3!N33,)))))))))))","v":0},{"$f":"IF($S$7=1,NL!O33,IF(cal!$S$7=2,EN!O33,IF(cal!$S$7=3,DE!O33,IF(cal!$S$7=4,FR!O33,IF(cal!$S$7=5,NR!O33,IF(cal!$S$7=6,SP!O33,IF(cal!$S$7=7,SW!O33,IF(cal!$S$7=8,TS!O33,IF(cal!$S$7=9,ExtraTaal1!O33,IF(cal!$S$7=10,ExtraTaal2!O33,IF(cal!$S$7=11,ExtraTaal3!O33,)))))))))))","v":0},"n-value","n-value","n-value","n-value","n-value","n-value",null,"H",6,"B",14,"L",130,100,"H",{"$f":"AF28","v":6},"B",{"$f":"AH28","v":14},"L",{"$f":"130*IF($X$4=1,1,IF($X$4=2,1/2.54))","v":130},100,130,{"$f":"((AN34*(AL34^AP34)*(($AJ$34-19.5)/100)*2)+AO34*(AL34^2))*0.0098","v":1.0232444335087001},6.5250871001174002E-3,5.7852740858429998E-4,1.8056661148752]
[null,0.2,2,{"$f":"(X35*($T$11^$Q35))*Watts*CF_Altit","v":268.65000000000003},{"$f":"ROUND(((D35/Watts)/(($S$9-$S$10)*1.163))*$E$14,IF($X$4=1,0,IF($X$4=2,2)))","v":23},{"$f":"(IF($X$4=1,AM35,IF($X$4=2,AM35*0.334552563)))","v":5.6966963176685495E-2},null,null,null,null,{"$f":"L35-8","v":17.3},{"$f":"AB35","v":25.3},1.04,{"$f":"AD35*Cubics","v":36},{"$f":"((($D35/Watts)/(((p_atm*0.028964)/(8.31447*(20+273.15)))*(($N35/3600)/Cubics)*(1005+1870*((0.622)/(((p_atm)/($E$12*Pvs_Heat_in))-1)))))+Tl_heat)*Celc1+Celc2","v":41.904842369798416},{"$f":"(Tl_cool-(($G35/Watts)/(1006*$N35*kgss)))*Celc1+Celc2","v":0},1,0.6,0.6,1.1599999999999999,0.78069999999999995,0.87660000000000005,{"$f":"(H35-G35)/H35","v":{"$error":"#DIV/0!"}},268.65000000000003,{"$f":"IF($X$16=1,AF35,IF($X$16=2,AR35,IF($X$16=3,BQ35,IF($X$16=4,BJ35,IF($X$16=5,CF35,IF($X$16=6,BY35,IF($X$16=7,BC35,)))))))","v":"a"},132,"a",25.3,1.04,36,{"$f":"AE29*($AK$40/$AK$34)","v":268.65000000000003},"a",132,"a",25.3,1.04,36,{"$f":"((D35/Watts)/(($S$9-$S$10)*1.163))","v":23.099742046431643},{"$f":"((AN35*(AL35^AP35)*(($AL$40-19.5)/100)*2)+AO35*(AL35^2))*0.0098","v":5.6966963176685495E-2},6.5250871001174002E-3,5.7852740858429998E-4,1.8056661148752]
[null,0.4,4,{"$f":"(X36*($T$11^$Q36))*Watts*CF_Altit","v":706.05000000000007},{"$f":"ROUND(((D36/Watts)/(($S$9-$S$10)*1.163))*$E$14,IF($X$4=1,0,IF($X$4=2,2)))","v":61},{"$f":"(IF($X$4=1,AM36,IF($X$4=2,AM36*0.334552563)))","v":0.32969062642810371},null,null,null,null,{"$f":"L36-8","v":20.399999999999999},28.4,1.74,{"$f":"AD36*Cubics","v":60},{"$f":"((($D36/Watts)/(((p_atm*0.028964)/(8.31447*(20+273.15)))*(($N36/3600)/Cubics)*(1005+1870*((0.622)/(((p_atm)/($E$12*Pvs_Heat_in))-1)))))+Tl_heat)*Celc1+Celc2","v":54.541404701722328},{"$f":"(Tl_cool-(($G36/Watts)/(1006*$N36*kgss)))*Celc1+Celc2","v":0},1,0.68,0.68,1.04,0.85870000000000002,0.87749999999999995,{"$f":"(H36-G36)/H36","v":{"$error":"#DIV/0!"}},706.05000000000007,{"$f":"IF($X$16=1,AF36,IF($X$16=2,AR36,IF($X$16=3,BQ36,IF($X$16=4,BJ36,IF($X$16=5,CF36,IF($X$16=6,BY36,IF($X$16=7,BC36,)))))))","v":7.3989525167788965E-4},290,7.3989525167788965E-4,28.4,1.74,60,{"$f":"AE30*($AK$40/$AK$34)","v":706.05000000000007},7.3989525167788965E-4,290,{"$f":"AF36","v":7.3989525167788965E-4},28.4,1.74,60,{"$f":"((D36/Watts)/(($S$9-$S$10)*1.163))","v":60.709372312983668},{"$f":"((AN36*(AL36^AP36)*(($AL$40-19.5)/100)*2)+AO36*(AL36^2))*0.0098","v":0.32969062642810371},6.5250871001174002E-3,5.7852740858429998E-4,1.8056661148752]
[null,0.6,6,{"$f":"(X37*($T$11^$Q37))*Watts*CF_Altit","v":1421.5500000000002},{"$f":"ROUND(((D37/Watts)/(($S$9-$S$10)*1.163))*$E$14,IF($X$4=1,0,IF($X$4=2,2)))","v":122},1.1773030202437731,null,null,null,null,{"$f":"L37-8","v":28.5},36.5,3.06,{"$f":"AD37*Cubics","v":100},{"$f":"((($D37/Watts)/(((p_atm*0.028964)/(8.31447*(20+273.15)))*(($N37/3600)/Cubics)*(1005+1870*((0.622)/(((p_atm)/($E$12*Pvs_Heat_in))-1)))))+Tl_heat)*Celc1+Celc2","v":61.727073595694392},{"$f":"(Tl_cool-(($G37/Watts)/(1006*$N37*kgss)))*Celc1+Celc2","v":0},1,0.79,0.79,0.95,0.8831,0.88200000000000001,{"$f":"(H37-G37)/H37","v":{"$error":"#DIV/0!"}},1421.5500000000002,{"$f":"IF($X$16=1,AF37,IF($X$16=2,AR37,IF($X$16=3,BQ37,IF($X$16=4,BJ37,IF($X$16=5,CF37,IF($X$16=6,BY37,IF($X$16=7,BC37,)))))))","v":"b"},458,"b",36.5,3.06,100,{"$f":"AE31*($AK$40/$AK$34)","v":1421.5500000000002},"b",458,"b",36.5,3.06,100,{"$f":"((D37/Watts)/(($S$9-$S$10)*1.163))","v":122.23129836629407},1.1773030202437731,6.5250871001174002E-3,5.7852740858429998E-4,1.8056661148752]
[null,0.8,8,{"$f":"(X38*($T$11^$Q38))*Watts*CF_Altit","v":1894.0500000000002},{"$f":"ROUND(((D38/Watts)/(($S$9-$S$10)*1.163))*$E$14,IF($X$4=1,0,IF($X$4=2,2)))","v":163},1.9847946062562469,null,null,null,null,{"$f":"L38-8","v":39.1},47.1,4.92,{"$f":"AD38*Cubics","v":148},{"$f":"((($D38/Watts)/(((p_atm*0.028964)/(8.31447*(20+273.15)))*(($N38/3600)/Cubics)*(1005+1870*((0.622)/(((p_atm)/($E$12*Pvs_Heat_in))-1)))))+Tl_heat)*Celc1+Celc2","v":57.565183295320466},{"$f":"(Tl_cool-(($G38/Watts)/(1006*$N38*kgss)))*Celc1+Celc2","v":0},1,0.87,0.87,0.95,0.85389999999999999,0.89500000000000002,{"$f":"(H38-G38)/H38","v":{"$error":"#DIV/0!"}},1894.0500000000002,{"$f":"IF($X$16=1,AF38,IF($X$16=2,AR38,IF($X$16=3,BQ38,IF($X$16=4,BJ38,IF($X$16=5,CF38,IF($X$16=6,BY38,IF($X$16=7,BC38,)))))))","v":1.8235155847906199},634,1.8235155847906199,47.1,4.92,148,{"$f":"AE32*($AK$40/$AK$34)","v":1894.0500000000002},1.8235155847906199,634,{"$f":"AF38","v":1.8235155847906199},47.1,4.92,148,{"$f":"((D38/Watts)/(($S$9-$S$10)*1.163))","v":162.85898538263112},1.9847946062562469,6.5250871001174002E-3,5.7852740858429998E-4,1.8056661148752]
[null,1,10,{"$f":"(X39*($T$11^$Q39))*Watts*CF_Altit","v":2226.15},{"$f":"ROUND(((D39/Watts)/(($S$9-$S$10)*1.163))*$E$14,IF($X$4=1,0,IF($X$4=2,2)))","v":191},2.6635119539217489,null,null,null,null,{"$f":"L39-8","v":45.5},53.5,7.68,{"$f":"AD39*Cubics","v":196},{"$f":"((($D39/Watts)/(((p_atm*0.028964)/(8.31447*(20+273.15)))*(($N39/3600)/Cubics)*(1005+1870*((0.622)/(((p_atm)/($E$12*Pvs_Heat_in))-1)))))+Tl_heat)*Celc1+Celc2","v":53.339120665591047},{"$f":"(Tl_cool-(($G39/Watts)/(1006*$N39*kgss)))*Celc1+Celc2","v":0},1,0.91,0.91,0.98,0.77110000000000001,0.91110000000000002,{"$f":"(H39-G39)/H39","v":{"$error":"#DIV/0!"}},2226.15,{"$f":"IF($X$16=1,AF39,IF($X$16=2,AR39,IF($X$16=3,BQ39,IF($X$16=4,BJ39,IF($X$16=5,CF39,IF($X$16=6,BY39,IF($X$16=7,BC39,)))))))","v":0},816,0,53.5,7.68,196,{"$f":"AE33*($AK$40/$AK$34)","v":2226.15},null,816,null,53.5,7.68,196,{"$f":"((D39/Watts)/(($S$9-$S$10)*1.163))","v":191.41444539982803},2.6635119539217489,6.5250871001174002E-3,5.7852740858429998E-4,1.8056661148752]
[null,{"$f":"IF($S$7=1,NL!A39,IF(cal!$S$7=2,EN!A39,IF(cal!$S$7=3,DE!A39,IF(cal!$S$7=4,FR!A39,IF(cal!$S$7=5,NR!A39,IF(cal!$S$7=6,SP!A39,IF(cal!$S$7=7,SW!A39,IF(cal!$S$7=8,TS!A39,IF(cal!$S$7=9,ExtraTaal1!A39,IF(cal!$S$7=10,ExtraTaal2!A39,IF(cal!$S$7=11,ExtraTaal3!A39,)))))))))))","v":"Micro Canal height 6 cm width 14 cm length 200 cm (Type 5)"},{"$f":"IF($S$7=1,NL!B39,IF(cal!$S$7=2,EN!B39,IF(cal!$S$7=3,DE!B39,IF(cal!$S$7=4,FR!B39,IF(cal!$S$7=5,NR!B39,IF(cal!$S$7=6,SP!B39,IF(cal!$S$7=7,SW!B39,IF(cal!$S$7=8,TS!B39,IF(cal!$S$7=9,ExtraTaal1!B39,IF(cal!$S$7=10,ExtraTaal2!B39,IF(cal!$S$7=11,ExtraTaal3!B39,)))))))))))","v":0},{"$f":"IF($S$7=1,NL!C39,IF(cal!$S$7=2,EN!C39,IF(cal!$S$7=3,DE!C39,IF(cal!$S$7=4,FR!C39,IF(cal!$S$7=5,NR!C39,IF(cal!$S$7=6,SP!C39,IF(cal!$S$7=7,SW!C39,IF(cal!$S$7=8,TS!C39,IF(cal!$S$7=9,ExtraTaal1!C39,IF(cal!$S$7=10,ExtraTaal2!C39,IF(cal!$S$7=11,ExtraTaal3!C39,)))))))))))","v":0},{"$f":"IF($S$7=1,NL!D39,IF(cal!$S$7=2,EN!D39,IF(cal!$S$7=3,DE!D39,IF(cal!$S$7=4,FR!D39,IF(cal!$S$7=5,NR!D39,IF(cal!$S$7=6,SP!D39,IF(cal!$S$7=7,SW!D39,IF(cal!$S$7=8,TS!D39,IF(cal!$S$7=9,ExtraTaal1!D39,IF(cal!$S$7=10,ExtraTaal2!D39,IF(cal!$S$7=11,ExtraTaal3!D39,)))))))))))","v":0},{"$f":"IF($S$7=1,NL!E39,IF(cal!$S$7=2,EN!E39,IF(cal!$S$7=3,DE!E39,IF(cal!$S$7=4,FR!E39,IF(cal!$S$7=5,NR!E39,IF(cal!$S$7=6,SP!E39,IF(cal!$S$7=7,SW!E39,IF(cal!$S$7=8,TS!E39,IF(cal!$S$7=9,ExtraTaal1!E39,IF(cal!$S$7=10,ExtraTaal2!E39,IF(cal!$S$7=11,ExtraTaal3!E39,)))))))))))","v":0},{"$f":"IF($S$7=1,NL!F39,IF(cal!$S$7=2,EN!F39,IF(cal!$S$7=3,DE!F39,IF(cal!$S$7=4,FR!F39,IF(cal!$S$7=5,NR!F39,IF(cal!$S$7=6,SP!F39,IF(cal!$S$7=7,SW!F39,IF(cal!$S$7=8,TS!F39,IF(cal!$S$7=9,ExtraTaal1!F39,IF(cal!$S$7=10,ExtraTaal2!F39,IF(cal!$S$7=11,ExtraTaal3!F39,)))))))))))","v":0},{"$f":"IF($S$7=1,NL!G39,IF(cal!$S$7=2,EN!G39,IF(cal!$S$7=3,DE!G39,IF(cal!$S$7=4,FR!G39,IF(cal!$S$7=5,NR!G39,IF(cal!$S$7=6,SP!G39,IF(cal!$S$7=7,SW!G39,IF(cal!$S$7=8,TS!G39,IF(cal!$S$7=9,ExtraTaal1!G39,IF(cal!$S$7=10,ExtraTaal2!G39,IF(cal!$S$7=11,ExtraTaal3!G39,)))))))))))","v":0},{"$f":"IF($S$7=1,NL!H39,IF(cal!$S$7=2,EN!H39,IF(cal!$S$7=3,DE!H39,IF(cal!$S$7=4,FR!H39,IF(cal!$S$7=5,NR!H39,IF(cal!$S$7=6,SP!H39,IF(cal!$S$7=7,SW!H39,IF(cal!$S$7=8,TS!H39,IF(cal!$S$7=9,ExtraTaal1!H39,IF(cal!$S$7=10,ExtraTaal2!H39,IF(cal!$S$7=11,ExtraTaal3!H39,)))))))))))","v":0},{"$f":"IF($S$7=1,NL!I39,IF(cal!$S$7=2,EN!I39,IF(cal!$S$7=3,DE!I39,IF(cal!$S$7=4,FR!I39,IF(cal!$S$7=5,NR!I39,IF(cal!$S$7=6,SP!I39,IF(cal!$S$7=7,SW!I39,IF(cal!$S$7=8,TS!I39,IF(cal!$S$7=9,ExtraTaal1!I39,IF(cal!$S$7=10,ExtraTaal2!I39,IF(cal!$S$7=11,ExtraTaal3!I39,)))))))))))","v":0},{"$f":"IF($S$7=1,NL!J39,IF(cal!$S$7=2,EN!J39,IF(cal!$S$7=3,DE!J39,IF(cal!$S$7=4,FR!J39,IF(cal!$S$7=5,NR!J39,IF(cal!$S$7=6,SP!J39,IF(cal!$S$7=7,SW!J39,IF(cal!$S$7=8,TS!J39,IF(cal!$S$7=9,ExtraTaal1!J39,IF(cal!$S$7=10,ExtraTaal2!J39,IF(cal!$S$7=11,ExtraTaal3!J39,)))))))))))","v":0},{"$f":"IF($S$7=1,NL!K39,IF(cal!$S$7=2,EN!K39,IF(cal!$S$7=3,DE!K39,IF(cal!$S$7=4,FR!K39,IF(cal!$S$7=5,NR!K39,IF(cal!$S$7=6,SP!K39,IF(cal!$S$7=7,SW!K39,IF(cal!$S$7=8,TS!K39,IF(cal!$S$7=9,ExtraTaal1!K39,IF(cal!$S$7=10,ExtraTaal2!K39,IF(cal!$S$7=11,ExtraTaal3!K39,)))))))))))","v":0},{"$f":"IF($S$7=1,NL!L39,IF(cal!$S$7=2,EN!L39,IF(cal!$S$7=3,DE!L39,IF(cal!$S$7=4,FR!L39,IF(cal!$S$7=5,NR!L39,IF(cal!$S$7=6,SP!L39,IF(cal!$S$7=7,SW!L39,IF(cal!$S$7=8,TS!L39,IF(cal!$S$7=9,ExtraTaal1!L39,IF(cal!$S$7=10,ExtraTaal2!L39,IF(cal!$S$7=11,ExtraTaal3!L39,)))))))))))","v":0},{"$f":"IF($S$7=1,NL!M39,IF(cal!$S$7=2,EN!M39,IF(cal!$S$7=3,DE!M39,IF(cal!$S$7=4,FR!M39,IF(cal!$S$7=5,NR!M39,IF(cal!$S$7=6,SP!M39,IF(cal!$S$7=7,SW!M39,IF(cal!$S$7=8,TS!M39,IF(cal!$S$7=9,ExtraTaal1!M39,IF(cal!$S$7=10,ExtraTaal2!M39,IF(cal!$S$7=11,ExtraTaal3!M39,)))))))))))","v":0},{"$f":"IF($S$7=1,NL!N39,IF(cal!$S$7=2,EN!N39,IF(cal!$S$7=3,DE!N39,IF(cal!$S$7=4,FR!N39,IF(cal!$S$7=5,NR!N39,IF(cal!$S$7=6,SP!N39,IF(cal!$S$7=7,SW!N39,IF(cal!$S$7=8,TS!N39,IF(cal!$S$7=9,ExtraTaal1!N39,IF(cal!$S$7=10,ExtraTaal2!N39,IF(cal!$S$7=11,ExtraTaal3!N39,)))))))))))","v":0},{"$f":"IF($S$7=1,NL!O39,IF(cal!$S$7=2,EN!O39,IF(cal!$S$7=3,DE!O39,IF(cal!$S$7=4,FR!O39,IF(cal!$S$7=5,NR!O39,IF(cal!$S$7=6,SP!O39,IF(cal!$S$7=7,SW!O39,IF(cal!$S$7=8,TS!O39,IF(cal!$S$7=9,ExtraTaal1!O39,IF(cal!$S$7=10,ExtraTaal2!O39,IF(cal!$S$7=11,ExtraTaal3!O39,)))))))))))","v":0},"n-value","n-value","n-value","n-value","n-value","n-value",null,"H",6,"B",14,"L",165,135,"H",{"$f":"AF34","v":6},"B",{"$f":"AH34","v":14},"L",{"$f":"165*IF($X$4=1,1,IF($X$4=2,1/2.54))","v":165},135,165,{"$f":"((AN40*(AL40^AP40)*(($AJ$40-19.5)/100)*2)+AO40*(AL40^2))*0.0098","v":2.0325503726742054},6.5250871001174002E-3,5.7852740858429998E-4,1.8056661148752]
[null,0.2,2,{"$f":"(X41*($T$11^$Q41))*Watts*CF_Altit","v":338.3},{"$f":"ROUND(((D41/Watts)/(($S$9-$S$10)*1.163))*$E$14,IF($X$4=1,0,IF($X$4=2,2)))","v":29},{"$f":"(IF($X$4=1,AM41,IF($X$4=2,AM41*0.334552563)))","v":0.10626158757102755},null,null,null,null,{"$f":"L41-8","v":17.100000000000001},{"$f":"AB41","v":25.1},1.06,{"$f":"AD41*Cubics","v":44},{"$f":"((($D41/Watts)/(((p_atm*0.028964)/(8.31447*(20+273.15)))*(($N41/3600)/Cubics)*(1005+1870*((0.622)/(((p_atm)/($E$12*Pvs_Heat_in))-1)))))+Tl_heat)*Celc1+Celc2","v":42.568625471913521},{"$f":"(Tl_cool-(($G41/Watts)/(1006*$N41*kgss)))*Celc1+Celc2","v":0},1,0,0,0,0.78069999999999995,0,{"$f":"(H41-G41)/H41","v":{"$error":"#DIV/0!"}},338.3,{"$f":"IF($X$16=1,AF41,IF($X$16=2,AR41,IF($X$16=3,BQ41,IF($X$16=4,BJ41,IF($X$16=5,CF41,IF($X$16=6,BY41,IF($X$16=7,BC41,)))))))","v":0},0,0,25.1,1.06,44,{"$f":"AE29*($AK$46/$AK$34)","v":338.3},null,null,null,25.1,1.06,44,{"$f":"((D41/Watts)/(($S$9-$S$10)*1.163))","v":29.088564058469476},{"$f":"((AN41*(AL41^AP41)*(($AL$46-19.5)/100)*2)+AO41*(AL41^2))*0.0098","v":0.10626158757102755},6.5250871001174002E-3,5.7852740858429998E-4,1.8056661148752]
[null,0.4,4,{"$f":"(X42*($T$11^$Q42))*Watts*CF_Altit","v":889.1},{"$f":"ROUND(((D42/Watts)/(($S$9-$S$10)*1.163))*$E$14,IF($X$4=1,0,IF($X$4=2,2)))","v":76},{"$f":"(IF($X$4=1,AM42,IF($X$4=2,AM42*0.334552563)))","v":0.61397815292948499},null,null,null,null,{"$f":"L42-8","v":19.399999999999999},27.4,1.82,{"$f":"AD42*Cubics","v":71},{"$f":"((($D42/Watts)/(((p_atm*0.028964)/(8.31447*(20+273.15)))*(($N42/3600)/Cubics)*(1005+1870*((0.622)/(((p_atm)/($E$12*Pvs_Heat_in))-1)))))+Tl_heat)*Celc1+Celc2","v":56.757676364900128},{"$f":"(Tl_cool-(($G42/Watts)/(1006*$N42*kgss)))*Celc1+Celc2","v":0},1,0,0,0,0.85870000000000002,0,{"$f":"(H42-G42)/H42","v":{"$error":"#DIV/0!"}},889.1,{"$f":"IF($X$16=1,AF42,IF($X$16=2,AR42,IF($X$16=3,BQ42,IF($X$16=4,BJ42,IF($X$16=5,CF42,IF($X$16=6,BY42,IF($X$16=7,BC42,)))))))","v":0},0,0,27.4,1.82,71,{"$f":"AE30*($AK$46/$AK$34)","v":889.1},null,null,null,27.4,1.82,71,{"$f":"((D42/Watts)/(($S$9-$S$10)*1.163))","v":76.448839208942388},{"$f":"((AN42*(AL42^AP42)*(($AL$46-19.5)/100)*2)+AO42*(AL42^2))*0.0098","v":0.61397815292948499},6.5250871001174002E-3,5.7852740858429998E-4,1.8056661148752]
[null,0.6,6,{"$f":"(X43*($T$11^$Q43))*Watts*CF_Altit","v":1790.1},{"$f":"ROUND(((D43/Watts)/(($S$9-$S$10)*1.163))*$E$14,IF($X$4=1,0,IF($X$4=2,2)))","v":154},2.1894959237320637,null,null,null,null,{"$f":"L43-8","v":29},37,3.15,{"$f":"AD43*Cubics","v":117},{"$f":"((($D43/Watts)/(((p_atm*0.028964)/(8.31447*(20+273.15)))*(($N43/3600)/Cubics)*(1005+1870*((0.622)/(((p_atm)/($E$12*Pvs_Heat_in))-1)))))+Tl_heat)*Celc1+Celc2","v":64.910430587325394},{"$f":"(Tl_cool-(($G43/Watts)/(1006*$N43*kgss)))*Celc1+Celc2","v":0},1,0,0,0,0.8831,0,{"$f":"(H43-G43)/H43","v":{"$error":"#DIV/0!"}},1790.1,{"$f":"IF($X$16=1,AF43,IF($X$16=2,AR43,IF($X$16=3,BQ43,IF($X$16=4,BJ43,IF($X$16=5,CF43,IF($X$16=6,BY43,IF($X$16=7,BC43,)))))))","v":0},0,0,37,3.15,117,{"$f":"AE31*($AK$46/$AK$34)","v":1790.1},null,null,null,37,3.15,117,{"$f":"((D43/Watts)/(($S$9-$S$10)*1.163))","v":153.92089423903695},2.1894959237320637,6.5250871001174002E-3,5.7852740858429998E-4,1.8056661148752]
[null,0.8,8,{"$f":"(X44*($T$11^$Q44))*Watts*CF_Altit","v":2385.1},{"$f":"ROUND(((D44/Watts)/(($S$9-$S$10)*1.163))*$E$14,IF($X$4=1,0,IF($X$4=2,2)))","v":205},3.6889978888529815,null,null,null,null,{"$f":"L44-8","v":39.700000000000003},47.7,5.1100000000000003,{"$f":"AD44*Cubics","v":173},{"$f":"((($D44/Watts)/(((p_atm*0.028964)/(8.31447*(20+273.15)))*(($N44/3600)/Cubics)*(1005+1870*((0.622)/(((p_atm)/($E$12*Pvs_Heat_in))-1)))))+Tl_heat)*Celc1+Celc2","v":60.468422680807663},{"$f":"(Tl_cool-(($G44/Watts)/(1006*$N44*kgss)))*Celc1+Celc2","v":0},1,0,0,0,0.85389999999999999,0,{"$f":"(H44-G44)/H44","v":{"$error":"#DIV/0!"}},2385.1,{"$f":"IF($X$16=1,AF44,IF($X$16=2,AR44,IF($X$16=3,BQ44,IF($X$16=4,BJ44,IF($X$16=5,CF44,IF($X$16=6,BY44,IF($X$16=7,BC44,)))))))","v":0},0,0,47.7,5.1100000000000003,173,{"$f":"AE32*($AK$46/$AK$34)","v":2385.1},null,null,null,47.7,5.1100000000000003,173,{"$f":"((D44/Watts)/(($S$9-$S$10)*1.163))","v":205.08168529664658},3.6889978888529815,6.5250871001174002E-3,5.7852740858429998E-4,1.8056661148752]
[null,1,10,{"$f":"(X45*($T$11^$Q45))*Watts*CF_Altit","v":2803.2999999999997},{"$f":"ROUND(((D45/Watts)/(($S$9-$S$10)*1.163))*$E$14,IF($X$4=1,0,IF($X$4=2,2)))","v":241},4.9487298621162958,null,null,null,null,{"$f":"L45-8","v":45.2},53.2,7.98,{"$f":"AD45*Cubics","v":228},{"$f":"((($D45/Watts)/(((p_atm*0.028964)/(8.31447*(20+273.15)))*(($N45/3600)/Cubics)*(1005+1870*((0.622)/(((p_atm)/($E$12*Pvs_Heat_in))-1)))))+Tl_heat)*Celc1+Celc2","v":56.090302163011486},{"$f":"(Tl_cool-(($G45/Watts)/(1006*$N45*kgss)))*Celc1+Celc2","v":0},1,0,0,0,0.77110000000000001,0,{"$f":"(H45-G45)/H45","v":{"$error":"#DIV/0!"}},2803.2999999999997,{"$f":"IF($X$16=1,AF45,IF($X$16=2,AR45,IF($X$16=3,BQ45,IF($X$16=4,BJ45,IF($X$16=5,CF45,IF($X$16=6,BY45,IF($X$16=7,BC45,)))))))","v":0},0,0,53.2,7.98,228,{"$f":"AE33*($AK$46/$AK$34)","v":2803.2999999999997},null,null,null,53.2,7.98,228,{"$f":"((D45/Watts)/(($S$9-$S$10)*1.163))","v":241.04041272570933},4.9487298621162958,6.5250871001174002E-3,5.7852740858429998E-4,1.8056661148752]
[null,{"$f":"IF($S$7=1,NL!A45,IF(cal!$S$7=2,EN!A45,IF(cal!$S$7=3,DE!A45,IF(cal!$S$7=4,FR!A45,IF(cal!$S$7=5,NR!A45,IF(cal!$S$7=6,SP!A45,IF(cal!$S$7=7,SW!A45,IF(cal!$S$7=8,TS!A45,IF(cal!$S$7=9,ExtraTaal1!A45,IF(cal!$S$7=10,ExtraTaal2!A45,IF(cal!$S$7=11,ExtraTaal3!A45,)))))))))))","v":"Micro Canal height 0 cm width 0 cm length 0 cm (Type 6)"},{"$f":"IF($S$7=1,NL!B45,IF(cal!$S$7=2,EN!B45,IF(cal!$S$7=3,DE!B45,IF(cal!$S$7=4,FR!B45,IF(cal!$S$7=5,NR!B45,IF(cal!$S$7=6,SP!B45,IF(cal!$S$7=7,SW!B45,IF(cal!$S$7=8,TS!B45,IF(cal!$S$7=9,ExtraTaal1!B45,IF(cal!$S$7=10,ExtraTaal2!B45,IF(cal!$S$7=11,ExtraTaal3!B45,)))))))))))","v":0},{"$f":"IF($S$7=1,NL!C45,IF(cal!$S$7=2,EN!C45,IF(cal!$S$7=3,DE!C45,IF(cal!$S$7=4,FR!C45,IF(cal!$S$7=5,NR!C45,IF(cal!$S$7=6,SP!C45,IF(cal!$S$7=7,SW!C45,IF(cal!$S$7=8,TS!C45,IF(cal!$S$7=9,ExtraTaal1!C45,IF(cal!$S$7=10,ExtraTaal2!C45,IF(cal!$S$7=11,ExtraTaal3!C45,)))))))))))","v":0},{"$f":"IF($S$7=1,NL!D45,IF(cal!$S$7=2,EN!D45,IF(cal!$S$7=3,DE!D45,IF(cal!$S$7=4,FR!D45,IF(cal!$S$7=5,NR!D45,IF(cal!$S$7=6,SP!D45,IF(cal!$S$7=7,SW!D45,IF(cal!$S$7=8,TS!D45,IF(cal!$S$7=9,ExtraTaal1!D45,IF(cal!$S$7=10,ExtraTaal2!D45,IF(cal!$S$7=11,ExtraTaal3!D45,)))))))))))","v":0},{"$f":"IF($S$7=1,NL!E45,IF(cal!$S$7=2,EN!E45,IF(cal!$S$7=3,DE!E45,IF(cal!$S$7=4,FR!E45,IF(cal!$S$7=5,NR!E45,IF(cal!$S$7=6,SP!E45,IF(cal!$S$7=7,SW!E45,IF(cal!$S$7=8,TS!E45,IF(cal!$S$7=9,ExtraTaal1!E45,IF(cal!$S$7=10,ExtraTaal2!E45,IF(cal!$S$7=11,ExtraTaal3!E45,)))))))))))","v":0},{"$f":"IF($S$7=1,NL!F45,IF(cal!$S$7=2,EN!F45,IF(cal!$S$7=3,DE!F45,IF(cal!$S$7=4,FR!F45,IF(cal!$S$7=5,NR!F45,IF(cal!$S$7=6,SP!F45,IF(cal!$S$7=7,SW!F45,IF(cal!$S$7=8,TS!F45,IF(cal!$S$7=9,ExtraTaal1!F45,IF(cal!$S$7=10,ExtraTaal2!F45,IF(cal!$S$7=11,ExtraTaal3!F45,)))))))))))","v":0},{"$f":"IF($S$7=1,NL!G45,IF(cal!$S$7=2,EN!G45,IF(cal!$S$7=3,DE!G45,IF(cal!$S$7=4,FR!G45,IF(cal!$S$7=5,NR!G45,IF(cal!$S$7=6,SP!G45,IF(cal!$S$7=7,SW!G45,IF(cal!$S$7=8,TS!G45,IF(cal!$S$7=9,ExtraTaal1!G45,IF(cal!$S$7=10,ExtraTaal2!G45,IF(cal!$S$7=11,ExtraTaal3!G45,)))))))))))","v":0},{"$f":"IF($S$7=1,NL!H45,IF(cal!$S$7=2,EN!H45,IF(cal!$S$7=3,DE!H45,IF(cal!$S$7=4,FR!H45,IF(cal!$S$7=5,NR!H45,IF(cal!$S$7=6,SP!H45,IF(cal!$S$7=7,SW!H45,IF(cal!$S$7=8,TS!H45,IF(cal!$S$7=9,ExtraTaal1!H45,IF(cal!$S$7=10,ExtraTaal2!H45,IF(cal!$S$7=11,ExtraTaal3!H45,)))))))))))","v":0},{"$f":"IF($S$7=1,NL!I45,IF(cal!$S$7=2,EN!I45,IF(cal!$S$7=3,DE!I45,IF(cal!$S$7=4,FR!I45,IF(cal!$S$7=5,NR!I45,IF(cal!$S$7=6,SP!I45,IF(cal!$S$7=7,SW!I45,IF(cal!$S$7=8,TS!I45,IF(cal!$S$7=9,ExtraTaal1!I45,IF(cal!$S$7=10,ExtraTaal2!I45,IF(cal!$S$7=11,ExtraTaal3!I45,)))))))))))","v":0},{"$f":"IF($S$7=1,NL!J45,IF(cal!$S$7=2,EN!J45,IF(cal!$S$7=3,DE!J45,IF(cal!$S$7=4,FR!J45,IF(cal!$S$7=5,NR!J45,IF(cal!$S$7=6,SP!J45,IF(cal!$S$7=7,SW!J45,IF(cal!$S$7=8,TS!J45,IF(cal!$S$7=9,ExtraTaal1!J45,IF(cal!$S$7=10,ExtraTaal2!J45,IF(cal!$S$7=11,ExtraTaal3!J45,)))))))))))","v":0},{"$f":"IF($S$7=1,NL!K45,IF(cal!$S$7=2,EN!K45,IF(cal!$S$7=3,DE!K45,IF(cal!$S$7=4,FR!K45,IF(cal!$S$7=5,NR!K45,IF(cal!$S$7=6,SP!K45,IF(cal!$S$7=7,SW!K45,IF(cal!$S$7=8,TS!K45,IF(cal!$S$7=9,ExtraTaal1!K45,IF(cal!$S$7=10,ExtraTaal2!K45,IF(cal!$S$7=11,ExtraTaal3!K45,)))))))))))","v":0},{"$f":"IF($S$7=1,NL!L45,IF(cal!$S$7=2,EN!L45,IF(cal!$S$7=3,DE!L45,IF(cal!$S$7=4,FR!L45,IF(cal!$S$7=5,NR!L45,IF(cal!$S$7=6,SP!L45,IF(cal!$S$7=7,SW!L45,IF(cal!$S$7=8,TS!L45,IF(cal!$S$7=9,ExtraTaal1!L45,IF(cal!$S$7=10,ExtraTaal2!L45,IF(cal!$S$7=11,ExtraTaal3!L45,)))))))))))","v":0},{"$f":"IF($S$7=1,NL!M45,IF(cal!$S$7=2,EN!M45,IF(cal!$S$7=3,DE!M45,IF(cal!$S$7=4,FR!M45,IF(cal!$S$7=5,NR!M45,IF(cal!$S$7=6,SP!M45,IF(cal!$S$7=7,SW!M45,IF(cal!$S$7=8,TS!M45,IF(cal!$S$7=9,ExtraTaal1!M45,IF(cal!$S$7=10,ExtraTaal2!M45,IF(cal!$S$7=11,ExtraTaal3!M45,)))))))))))","v":0},{"$f":"IF($S$7=1,NL!N45,IF(cal!$S$7=2,EN!N45,IF(cal!$S$7=3,DE!N45,IF(cal!$S$7=4,FR!N45,IF(cal!$S$7=5,NR!N45,IF(cal!$S$7=6,SP!N45,IF(cal!$S$7=7,SW!N45,IF(cal!$S$7=8,TS!N45,IF(cal!$S$7=9,ExtraTaal1!N45,IF(cal!$S$7=10,ExtraTaal2!N45,IF(cal!$S$7=11,ExtraTaal3!N45,)))))))))))","v":0},{"$f":"IF($S$7=1,NL!O45,IF(cal!$S$7=2,EN!O45,IF(cal!$S$7=3,DE!O45,IF(cal!$S$7=4,FR!O45,IF(cal!$S$7=5,NR!O45,IF(cal!$S$7=6,SP!O45,IF(cal!$S$7=7,SW!O45,IF(cal!$S$7=8,TS!O45,IF(cal!$S$7=9,ExtraTaal1!O45,IF(cal!$S$7=10,ExtraTaal2!O45,IF(cal!$S$7=11,ExtraTaal3!O45,)))))))))))","v":0},"n-value","n-value","n-value","n-value","n-value","n-value",null,"H",6,{"$f":"IF($X$16=1,AG46,IF($X$16=2,AS46,IF($X$16=3,BR46,IF($X$16=4,BK46,IF($X$16=5,CG46,IF($X$16=6,BZ46,IF($X$16=7,BD46,)))))))","v":"B"},14,{"$f":"IF($X$16=1,AI46,IF($X$16=2,AU46,IF($X$16=3,BT46,IF($X$16=4,BM46,IF($X$16=5,CI46,IF($X$16=6,CB46,IF($X$16=7,BF46,)))))))","v":"L"},{"$f":"IF($X$16=1,AJ46,IF($X$16=2,AV46,IF($X$16=3,BU46,IF($X$16=4,BN46,IF($X$16=5,CJ46,IF($X$16=6,CC46,IF($X$16=7,BG46,)))))))","v":200},{"$f":"IF($X$16=1,AK46,IF($X$16=2,AW46,IF($X$16=3,BV46,IF($X$16=4,BO46,IF($X$16=5,CK46,IF($X$16=6,CD46,IF($X$16=7,BH46,)))))))","v":170},"H",6,"B",{"$f":"AH40","v":14},"L",{"$f":"200*IF($X$4=1,1,IF($X$4=2,1/2.54))","v":200},170,200,0.96671046864459054,6.5250871001174002E-3,5.7852740858429998E-4,1.8056661148752]
[null,{"$f":"IF($S$7=1,NL!A69,IF(cal!$S$7=2,EN!A69,IF(cal!$S$7=3,DE!A69,IF(cal!$S$7=4,FR!A69,IF(cal!$S$7=5,NR!A69,IF(cal!$S$7=6,SP!A69,IF(cal!$S$7=7,SW!A69,IF(cal!$S$7=8,TS!A69,IF(cal!$S$7=9,ExtraTaal1!A69,IF(cal!$S$7=10,ExtraTaal2!A69,IF(cal!$S$7=11,ExtraTaal3!A69,)))))))))))","v":"*Values according to EN 16430"}]
[null,{"$f":"IF($S$7=1,NL!A70,IF(cal!$S$7=2,EN!A70,IF(cal!$S$7=3,DE!A70,IF(cal!$S$7=4,FR!A70,IF(cal!$S$7=5,NR!A70,IF(cal!$S$7=6,SP!A70,IF(cal!$S$7=7,SW!A70,IF(cal!$S$7=8,TS!A70,IF(cal!$S$7=9,ExtraTaal1!A70,IF(cal!$S$7=10,ExtraTaal2!A70,IF(cal!$S$7=11,ExtraTaal3!A70,)))))))))))","v":"**Sound power according to ISO 3741:2010"}]
[null,{"$f":"IF($S$7=1,NL!A71,IF(cal!$S$7=2,EN!A71,IF(cal!$S$7=3,DE!A71,IF(cal!$S$7=4,FR!A71,IF(cal!$S$7=5,NR!A71,IF(cal!$S$7=6,SP!A71,IF(cal!$S$7=7,SW!A71,IF(cal!$S$7=8,TS!A71,IF(cal!$S$7=9,ExtraTaal1!A71,IF(cal!$S$7=10,ExtraTaal2!A71,IF(cal!$S$7=11,ExtraTaal3!A71,)))))))))))","v":"***Sound pressure with an assumed room damping of 8dB(A)"}]
[]
[]
[]
[]
[]
[]
[]
[]
[]
[]
[]
[]
[]
[]
[]
[]
[]
[]
[]
[]
[null,null,null,null,null,null,null,null,null,null,null,null,null,"v2022-06-01"]

{"sheet":"NL","index":2,"n_rows":71,"n_cols":18,"rows_kept":71,"cut":false,"hidden":true,"merged":[[5,11,5,12],[6,11,6,12],[10,5,10,7],[14,0,14,12],[20,0,20,12],[50,0,50,12],[62,0,62,12],[7,0,7,2],[7,5,7,8],[8,0,8,2],[8,5,8,8],[9,0,9,2],[9,5,9,8],[26,0,26,12],[32,0,32,12],[38,0,38,12],[44,0,44,12],[56,0,56,12],[7,11,7,12]]}
[]
["Invulformulier"]
[]
["Randvoorwaarden"]
[]
["Temperaturen",null,null,null,null,null,null,null,null,null,null,"Geplaatste hoogte"]
["Verwarmen:",null,null,null,null,"Koelen:",null,null,null,null,null,null,null,null,null,null,"Kopieer alle data"]
[{"$f":"\"Aanvoertemp.\"","v":"Aanvoertemp."},null,null,{"$f":"cal!E9","v":75},{"$f":"IF(cal!$X$4=1,\"°C\",IF(cal!$X$4=2,\"°F\"))","v":"°C"},{"$f":"A8","v":"Aanvoertemp."},null,null,null,{"$f":"cal!K9","v":0},{"$f":"E8","v":"°C"},"Eenheidsstelsel",null,null,null,null,"SI-eenheden"]
[{"$f":"\"Retourtemp.\"","v":"Retourtemp."},null,null,{"$f":"cal!E10","v":65},{"$f":"E8","v":"°C"},{"$f":"A9","v":"Retourtemp."},null,null,null,{"$f":"cal!K10","v":0},{"$f":"E8","v":"°C"},null,null,null,null,null,"Imperiale-eenheden"]
[{"$f":"\"Ruimtetemp.\"","v":"Ruimtetemp."},null,null,{"$f":"cal!E11","v":20},{"$f":"E8","v":"°C"},{"$f":"A10","v":"Ruimtetemp."},null,null,null,{"$f":"cal!K11","v":0},{"$f":"E8","v":"°C"}]
[null,null,null,null,null,"Relatieve vochtigheid",null,null,null,{"$f":"cal!K12","v":0}]
[]
[]
["Snelheidsniveau:","Stuurspanning: [V]",{"$f":"CONCATENATE(\"Warmteafgifte * \",ROUND(D8,0),\"/\",ROUND(D9,0),\"/\",ROUND(D10,0),\" [\"&IF(cal!$X$4=1,\"W\",IF(cal!$X$4=2,\"Btu/h\"))&\"]\")","v":"Warmteafgifte * 75/65/20 [W]"},{"$f":"\"Waterdebiet, verwarming [\"&IF(cal!$X$4=1,\"l/h\",IF(cal!$X$4=2,\"GPM\"))&\"]\"","v":"Waterdebiet, verwarming [l/h]"},{"$f":"\"Waterzijdig drukverlies [\"&IF(cal!$X$4=1,\"kPa\",IF(cal!$X$4=2,\"ftH2O\"))&\"]\"","v":"Waterzijdig drukverlies [kPa]"},{"$f":"CONCATENATE(\"Voelb. Koelcapaciteit * \",ROUND(J8,0),\"/\",,ROUND(J9,0),\"/\",,ROUND(J10,0),\" [\"&IF(cal!$X$4=1,\"W\",IF(cal!$X$4=2,\"Btu/h\"))&\"]\")","v":"Voelb. Koelcapaciteit * 0/0/0 [W]"},{"$f":"CONCATENATE(\"Tot. koelcapaciteit \",,ROUND(J8,0),\"/\",,ROUND(J9,0),\"/\",,ROUND(J10,0),\" [\"&IF(cal!$X$4=1,\"W\",IF(cal!$X$4=2,\"Btu/h\"))&\"]\")","v":"Tot. koelcapaciteit 0/0/0 [W]"},{"$f":"\"Waterdebiet, koeling [\"&IF(cal!$X$4=1,\"l/h\",IF(cal!$X$4=2,\"GPM\"))&\"]\"","v":"Waterdebiet, koeling [l/h]"},{"$f":"\"Waterzijdig drukverlies [\"&IF(cal!$X$4=1,\"kPa\",IF(cal!$X$4=2,\"ftH2O\"))&\"]\"","v":"Waterzijdig drukverlies [kPa]"},"Geluidsdruk *** [dB(A)]","Geluidsvermogen ** [dB(A)]","Opgenomen elektr. vermogen [W]",{"$f":"\"Luchtdebiet [\"&IF(cal!$X$4=1,\"m³/h\",IF(cal!$X$4=2,\"CFM\"))&\"]\"","v":"Luchtdebiet [m³/h]"},{"$f":"\"Uitblaastemp. verwarming [\"&IF(cal!$X$4=1,\"°C\",IF(cal!$X$4=2,\"°F\"))&\"]\"","v":"Uitblaastemp. verwarming [°C]"},{"$f":"\"Uitblaastemp. koeling [\"&IF(cal!$X$4=1,\"°C\",IF(cal!$X$4=2,\"°F\"))&\"]\"","v":"Uitblaastemp. koeling [°C]"}]
[{"$f":"cal!$Z$1&\" \"&$R$15&\" \"&ROUND(cal!Y22,1)&IF(cal!$X$4=1,\" cm\",IF(cal!$X$4=2,\" in\"))&\" \"&$R$16&\" \"&ROUND(cal!AA22,1)&IF(cal!$X$4=1,\" cm\",IF(cal!$X$4=2,\" in\"))&\" \"&$R$17&\" \"&ROUND(cal!AC22,1)&IF(cal!$X$4=1,\" cm\",IF(cal!$X$4=2,\" in\"))","v":"Micro Canal hoogte 6 cm breedte 14 cm lengte 60 cm"},null,null,null,null,null,null,null,null,null,null,null,null,null,null,null,"Temp.","hoogte"]
[null,null,null,null,null,null,null,null,null,null,null,null,null,null,null,null,"verw.!","breedte"]
[null,null,null,null,null,null,null,null,null,null,null,null,null,null,null,null,"koelen!","lengte"]
[]
[]
[]
[{"$f":"cal!$Z$1&\" \"&$R$15&\" \"&ROUND(cal!Y28,1)&IF(cal!$X$4=1,\" cm\",IF(cal!$X$4=2,\" in\"))&\" \"&$R$16&\" \"&ROUND(cal!AA28,1)&IF(cal!$X$4=1,\" cm\",IF(cal!$X$4=2,\" in\"))&\" \"&$R$17&\" \"&ROUND(cal!AC28,1)&IF(cal!$X$4=1,\" cm\",IF(cal!$X$4=2,\" in\"))","v":"Micro Canal hoogte 6 cm breedte 14 cm lengte 95 cm"}]
[]
[]
[]
[]
[]
[{"$f":"cal!$Z$1&\" \"&$R$15&\" \"&ROUND(cal!Y34,1)&IF(cal!$X$4=1,\" cm\",IF(cal!$X$4=2,\" in\"))&\" \"&$R$16&\" \"&ROUND(cal!AA34,1)&IF(cal!$X$4=1,\" cm\",IF(cal!$X$4=2,\" in\"))&\" \"&$R$17&\" \"&ROUND(cal!AC34,1)&IF(cal!$X$4=1,\" cm\",IF(cal!$X$4=2,\" in\"))","v":"Micro Canal hoogte 6 cm breedte 14 cm lengte 130 cm"}]
[]
[]
[]
[]
[]
[{"$f":"cal!$Z$1&\" \"&$R$15&\" \"&ROUND(cal!Y40,1)&IF(cal!$X$4=1,\" cm\",IF(cal!$X$4=2,\" in\"))&\" \"&$R$16&\" \"&ROUND(cal!AA40,1)&IF(cal!$X$4=1,\" cm\",IF(cal!$X$4=2,\" in\"))&\" \"&$R$17&\" \"&ROUND(cal!AC40,1)&IF(cal!$X$4=1,\" cm\",IF(cal!$X$4=2,\" in\"))","v":"Micro Canal hoogte 6 cm breedte 14 cm lengte 165 cm"}]
[]
[]
[]
[]
[]
[{"$f":"cal!$Z$1&\" \"&$R$15&\" \"&ROUND(cal!Y46,1)&IF(cal!$X$4=1,\" cm\",IF(cal!$X$4=2,\" in\"))&\" \"&$R$16&\" \"&ROUND(cal!AA46,1)&IF(cal!$X$4=1,\" cm\",IF(cal!$X$4=2,\" in\"))&\" \"&$R$17&\" \"&ROUND(cal!AC46,1)&IF(cal!$X$4=1,\" cm\",IF(cal!$X$4=2,\" in\"))","v":"Micro Canal hoogte 6 cm breedte 14 cm lengte 200 cm"}]
[]
[]
[]
[]
[]
[{"$f":"cal!$Z$1&\" \"&$R$15&\" \"&ROUND(cal!Y52,1)&IF(cal!$X$4=1,\" cm\",IF(cal!$X$4=2,\" in\"))&\" \"&$R$16&\" \"&ROUND(cal!AA52,1)&IF(cal!$X$4=1,\" cm\",IF(cal!$X$4=2,\" in\"))&\" \"&$R$17&\" \"&ROUND(cal!AC52,1)&IF(cal!$X$4=1,\" cm\",IF(cal!$X$4=2,\" in\"))&\" (Type 6)\"","v":"Micro Canal hoogte 0 cm breedte 0 cm lengte 0 cm (Type 6)"}]
[]
[]
[]
[]
[]
[{"$f":"cal!$Z$1&\" \"&$R$15&\" \"&ROUND(cal!Y58,1)&IF(cal!$X$4=1,\" cm\",IF(cal!$X$4=2,\" in\"))&\" \"&$R$16&\" \"&ROUND(cal!AA58,1)&IF(cal!$X$4=1,\" cm\",IF(cal!$X$4=2,\" in\"))&\" \"&$R$17&\" \"&ROUND(cal!AC58,1)&IF(cal!$X$4=1,\" cm\",IF(cal!$X$4=2,\" in\"))&\" (Type 7)\"","v":"Micro Canal hoogte 0 cm breedte 0 cm lengte 0 cm (Type 7)"}]
[]
[]
[]
[]
[]
[{"$f":"cal!$Z$1&\" \"&$R$15&\" \"&ROUND(cal!Y64,1)&IF(cal!$X$4=1,\" cm\",IF(cal!$X$4=2,\" in\"))&\" \"&$R$16&\" \"&ROUND(cal!AA64,1)&IF(cal!$X$4=1,\" cm\",IF(cal!$X$4=2,\" in\"))&\" \"&$R$17&\" \"&ROUND(cal!AC64,1)&IF(cal!$X$4=1,\" cm\",IF(cal!$X$4=2,\" in\"))&\" (Type 8)\"","v":"Micro Canal hoogte 0 cm breedte 0 cm lengte 0 cm (Type 8)"}]
[]
[]
[]
[]
[]
[{"$f":"cal!$Z$1&\" \"&$R$15&\" \"&ROUND(cal!Y70,1)&IF(cal!$X$4=1,\" cm\",IF(cal!$X$4=2,\" in\"))&\" \"&$R$16&\" \"&ROUND(cal!AA70,1)&IF(cal!$X$4=1,\" cm\",IF(cal!$X$4=2,\" in\"))&\" \"&$R$17&\" \"&ROUND(cal!AC70,1)&IF(cal!$X$4=1,\" cm\",IF(cal!$X$4=2,\" in\"))&\" (Type 9)\"","v":"Micro Canal hoogte 0 cm breedte 0 cm lengte 0 cm (Type 9)"}]
[]
[]
[]
[]
[]
["*Waardes gemeten volgens EN 16430",null,null,null,null,null,null,null,null,null,null,null,{"$f":"cal!N70","v":"v2022-06-01"}]
["**Geluidsvermogen gemeten volgens ISO 3741:2010"]
["***Geluidsdruk bij een aangenomen ruimtedemping van 8 dB(A)"]

{"sheet":"EN","index":3,"n_rows":71,"n_cols":18,"rows_kept":71,"cut":false,"hidden":true,"merged":[[7,11,7,12],[5,11,5,12],[6,11,6,12],[10,5,10,7],[7,0,7,2],[7,5,7,8],[8,0,8,2],[8,5,8,8],[9,0,9,2],[9,5,9,8],[38,0,38,12],[44,0,44,12],[50,0,50,12],[62,0,62,12],[14,0,14,12],[20,0,20,12],[26,0,26,12],[32,0,32,12],[56,0,56,12]]}
[]
["Formulary"]
[]
["Conditions"]
[]
["Temperatures",null,null,null,null,null,null,null,null,null,null,"Altitude"]
["Heating:",null,null,null,null,"Cooling:",null,null,null,null,null,null,null,null,null,null,"Copy all data"]
[{"$f":"\"Inlet temp.\"","v":"Inlet temp."},null,null,{"$f":"cal!E9","v":75},{"$f":"IF(cal!$X$4=1,\"°C\",IF(cal!$X$4=2,\"°F\"))","v":"°C"},{"$f":"A8","v":"Inlet temp."},null,null,null,{"$f":"cal!K9","v":0},{"$f":"E8","v":"°C"},"Unit conversion",null,null,null,null,"SI-units"]
[{"$f":"\"Return temp.\"","v":"Return temp."},null,null,{"$f":"cal!E10","v":65},{"$f":"E8","v":"°C"},{"$f":"A9","v":"Return temp."},null,null,null,{"$f":"cal!K10","v":0},{"$f":"E8","v":"°C"},null,null,null,null,null,"Imperial-units"]
[{"$f":"\"Room temp.\"","v":"Room temp."},null,null,{"$f":"cal!E11","v":20},{"$f":"E8","v":"°C"},{"$f":"A10","v":"Room temp."},null,null,null,{"$f":"cal!K11","v":0},{"$f":"E8","v":"°C"}]
[null,null,null,null,null,"Relative humidity",null,null,null,{"$f":"cal!K12","v":0}]
[]
[]
["Speed level:","Control voltage [V]",{"$f":"CONCATENATE(\"Heat output * \",ROUND(D8,0),\"/\",ROUND(D9,0),\"/\",ROUND(D10,0),\" [\"&IF(cal!$X$4=1,\"W\",IF(cal!$X$4=2,\"Btu/h\"))&\"]\")","v":"Heat output * 75/65/20 [W]"},{"$f":"\"Water flowrate, heating [\"&IF(cal!$X$4=1,\"l/h\",IF(cal!$X$4=2,\"GPM\"))&\"]\"","v":"Water flowrate, heating [l/h]"},{"$f":"\"Watersided pressure loss [\"&IF(cal!$X$4=1,\"kPa\",IF(cal!$X$4=2,\"ftH2O\"))&\"]\"","v":"Watersided pressure loss [kPa]"},{"$f":"CONCATENATE(\"Sens. cooling capacity * \",ROUND(J8,0),\"/\",ROUND(J9,0),\"/\",ROUND(J10,0),\" [\"&IF(cal!$X$4=1,\"W\",IF(cal!$X$4=2,\"Btu/h\"))&\"]\")","v":"Sens. cooling capacity * 0/0/0 [W]"},{"$f":"CONCATENATE(\"Tot. cooling capacity \",ROUND(J8,0),\"/\",ROUND(J9,0),\"/\",ROUND(J10,0),\" [\"&IF(cal!$X$4=1,\"W\",IF(cal!$X$4=2,\"Btu/h\"))&\"]\")","v":"Tot. cooling capacity 0/0/0 [W]"},{"$f":"\"Water flowrate, cooling [\"&IF(cal!$X$4=1,\"l/h\",IF(cal!$X$4=2,\"GPM\"))&\"]\"","v":"Water flowrate, cooling [l/h]"},{"$f":"\"Watersided pressure loss [\"&IF(cal!$X$4=1,\"kPa\",IF(cal!$X$4=2,\"ftH2O\"))&\"]\"","v":"Watersided pressure loss [kPa]"},"Sound pressure *** [dB(A)]","Sound power ** [dB(A)]","Electrical power [W]",{"$f":"\"Air flowrate [\"&IF(cal!$X$4=1,\"m³/h\",IF(cal!$X$4=2,\"CFM\"))&\"]\"","v":"Air flowrate [m³/h]"},{"$f":"\"Air exhaust temp. heating [\"&IF(cal!$X$4=1,\"°C\",IF(cal!$X$4=2,\"°F\"))&\"]\"","v":"Air exhaust temp. heating [°C]"},{"$f":"\"Air exhaust temp. cooling [\"&IF(cal!$X$4=1,\"°C\",IF(cal!$X$4=2,\"°F\"))&\"]\"","v":"Air exhaust temp. cooling [°C]"}]
[{"$f":"cal!$Z$1&\" \"&$R$15&\" \"&ROUND(cal!Y22,1)&IF(cal!$X$4=1,\" cm\",IF(cal!$X$4=2,\" in\"))&\" \"&$R$16&\" \"&ROUND(cal!AA22,1)&IF(cal!$X$4=1,\" cm\",IF(cal!$X$4=2,\" in\"))&\" \"&$R$17&\" \"&ROUND(cal!AC22,1)&IF(cal!$X$4=1,\" cm\",IF(cal!$X$4=2,\" in\"))&\" (Type 1)\"","v":"Micro Canal height 6 cm width 14 cm length 60 cm (Type 1)"},null,null,null,null,null,null,null,null,null,null,null,null,null,null,null,"Temp.","height"]
[null,null,null,null,null,null,null,null,null,null,null,null,null,null,null,null,"heating!","width"]
[null,null,null,null,null,null,null,null,null,null,null,null,null,null,null,null,"cooling!","length"]
[]
[]
[]
[{"$f":"cal!$Z$1&\" \"&$R$15&\" \"&ROUND(cal!Y28,1)&IF(cal!$X$4=1,\" cm\",IF(cal!$X$4=2,\" in\"))&\" \"&$R$16&\" \"&ROUND(cal!AA28,1)&IF(cal!$X$4=1,\" cm\",IF(cal!$X$4=2,\" in\"))&\" \"&$R$17&\" \"&ROUND(cal!AC28,1)&IF(cal!$X$4=1,\" cm\",IF(cal!$X$4=2,\" in\"))&\" (Type 2)\"","v":"Micro Canal height 6 cm width 14 cm length 95 cm (Type 2)"}]
[]
[]
[]
[]
[]
[{"$f":"cal!$Z$1&\" \"&$R$15&\" \"&ROUND(cal!Y34,1)&IF(cal!$X$4=1,\" cm\",IF(cal!$X$4=2,\" in\"))&\" \"&$R$16&\" \"&ROUND(cal!AA34,1)&IF(cal!$X$4=1,\" cm\",IF(cal!$X$4=2,\" in\"))&\" \"&$R$17&\" \"&ROUND(cal!AC34,1)&IF(cal!$X$4=1,\" cm\",IF(cal!$X$4=2,\" in\"))&\" (Type 3)\"","v":"Micro Canal height 6 cm width 14 cm length 130 cm (Type 3)"}]
[]
[]
[]
[]
[]
[{"$f":"cal!$Z$1&\" \"&$R$15&\" \"&ROUND(cal!Y40,1)&IF(cal!$X$4=1,\" cm\",IF(cal!$X$4=2,\" in\"))&\" \"&$R$16&\" \"&ROUND(cal!AA40,1)&IF(cal!$X$4=1,\" cm\",IF(cal!$X$4=2,\" in\"))&\" \"&$R$17&\" \"&ROUND(cal!AC40,1)&IF(cal!$X$4=1,\" cm\",IF(cal!$X$4=2,\" in\"))&\" (Type 4)\"","v":"Micro Canal height 6 cm width 14 cm length 165 cm (Type 4)"}]
[]
[]
[]
[]
[]
[{"$f":"cal!$Z$1&\" \"&$R$15&\" \"&ROUND(cal!Y46,1)&IF(cal!$X$4=1,\" cm\",IF(cal!$X$4=2,\" in\"))&\" \"&$R$16&\" \"&ROUND(cal!AA46,1)&IF(cal!$X$4=1,\" cm\",IF(cal!$X$4=2,\" in\"))&\" \"&$R$17&\" \"&ROUND(cal!AC46,1)&IF(cal!$X$4=1,\" cm\",IF(cal!$X$4=2,\" in\"))&\" (Type 5)\"","v":"Micro Canal height 6 cm width 14 cm length 200 cm (Type 5)"}]
[]
[]
[]
[]
[]
[{"$f":"cal!$Z$1&\" \"&$R$15&\" \"&ROUND(cal!Y52,1)&IF(cal!$X$4=1,\" cm\",IF(cal!$X$4=2,\" in\"))&\" \"&$R$16&\" \"&ROUND(cal!AA52,1)&IF(cal!$X$4=1,\" cm\",IF(cal!$X$4=2,\" in\"))&\" \"&$R$17&\" \"&ROUND(cal!AC52,1)&IF(cal!$X$4=1,\" cm\",IF(cal!$X$4=2,\" in\"))&\" (Type 6)\"","v":"Micro Canal height 0 cm width 0 cm length 0 cm (Type 6)"}]
[]
[]
[]
[]
[]
[{"$f":"cal!$Z$1&\" \"&$R$15&\" \"&ROUND(cal!Y58,1)&IF(cal!$X$4=1,\" cm\",IF(cal!$X$4=2,\" in\"))&\" \"&$R$16&\" \"&ROUND(cal!AA58,1)&IF(cal!$X$4=1,\" cm\",IF(cal!$X$4=2,\" in\"))&\" \"&$R$17&\" \"&ROUND(cal!AC58,1)&IF(cal!$X$4=1,\" cm\",IF(cal!$X$4=2,\" in\"))&\" (Type 7)\"","v":"Micro Canal height 0 cm width 0 cm length 0 cm (Type 7)"}]
[]
[]
[]
[]
[]
[{"$f":"cal!$Z$1&\" \"&$R$15&\" \"&ROUND(cal!Y64,1)&IF(cal!$X$4=1,\" cm\",IF(cal!$X$4=2,\" in\"))&\" \"&$R$16&\" \"&ROUND(cal!AA64,1)&IF(cal!$X$4=1,\" cm\",IF(cal!$X$4=2,\" in\"))&\" \"&$R$17&\" \"&ROUND(cal!AC64,1)&IF(cal!$X$4=1,\" cm\",IF(cal!$X$4=2,\" in\"))&\" (Type 8)\"","v":"Micro Canal height 0 cm width 0 cm length 0 cm (Type 8)"}]
[]
[]
[]
[]
[]
[{"$f":"cal!$Z$1&\" \"&$R$15&\" \"&ROUND(cal!Y70,1)&IF(cal!$X$4=1,\" cm\",IF(cal!$X$4=2,\" in\"))&\" \"&$R$16&\" \"&ROUND(cal!AA70,1)&IF(cal!$X$4=1,\" cm\",IF(cal!$X$4=2,\" in\"))&\" \"&$R$17&\" \"&ROUND(cal!AC70,1)&IF(cal!$X$4=1,\" cm\",IF(cal!$X$4=2,\" in\"))&\" (Type 9)\"","v":"Micro Canal height 0 cm width 0 cm length 0 cm (Type 9)"}]
[]
[]
[]
[]
[]
["*Values according to EN 16430",null,null,null,null,null,null,null,null,null,null,null,{"$f":"cal!N70","v":"v2022-06-01"}]
["**Sound power according to ISO 3741:2010"]
["***Sound pressure with an assumed room damping of 8dB(A)"]

{"sheet":"DE","index":4,"n_rows":71,"n_cols":18,"rows_kept":71,"cut":false,"hidden":true,"merged":[[7,11,7,12],[5,11,5,12],[6,11,6,12],[10,5,10,7],[7,0,7,2],[7,5,7,8],[8,0,8,2],[8,5,8,8],[9,0,9,2],[9,5,9,8],[38,0,38,12],[44,0,44,12],[50,0,50,12],[62,0,62,12],[14,0,14,12],[20,0,20,12],[26,0,26,12],[32,0,32,12],[56,0,56,12]]}
[]
["Eingabefelder"]
[]
["Auslegungsrandbedingungen"]
[]
["Temperaturen",null,null,null,null,null,null,null,null,null,null,"Platzierte Höhe"]
["Heizen:",null,null,null,null,"Kühlen:",null,null,null,null,null,null,null,null,null,null,"Kopieren Sie alle daten"]
[{"$f":"\"Vorlauftemp.\"","v":"Vorlauftemp."},null,null,{"$f":"cal!E9","v":75},{"$f":"IF(cal!$X$4=1,\"°C\",IF(cal!$X$4=2,\"°F\"))","v":"°C"},{"$f":"A8","v":"Vorlauftemp."},null,null,null,{"$f":"cal!K9","v":0},{"$f":"E8","v":"°C"},"Einheiten",null,null,null,null,"SI-einheiten"]
[{"$f":"\"Rücklauftemp.\"","v":"Rücklauftemp."},null,null,{"$f":"cal!E10","v":65},{"$f":"E8","v":"°C"},{"$f":"A9","v":"Rücklauftemp."},null,null,null,{"$f":"cal!K10","v":0},{"$f":"E8","v":"°C"},null,null,null,null,null,"Imperiale-einheiten"]
[{"$f":"\"Raumtemp.\"","v":"Raumtemp."},null,null,{"$f":"cal!E11","v":20},{"$f":"E8","v":"°C"},{"$f":"A10","v":"Raumtemp."},null,null,null,{"$f":"cal!K11","v":0},{"$f":"E8","v":"°C"}]
[null,null,null,null,null,"Relative Luftfeuchtigkeit",null,null,null,{"$f":"cal!K12","v":0}]
[]
[]
["Drehzahlstufe:","Regelspannung: [V]",{"$f":"CONCATENATE(\"Wärmeleistung * \",ROUND(D8,0),\"/\",ROUND(D9,0),\"/\",ROUND(D10,0),\" [\"&IF(cal!$X$4=1,\"W\",IF(cal!$X$4=2,\"Btu/h\"))&\"]\")","v":"Wärmeleistung * 75/65/20 [W]"},{"$f":"\"Heizmittelstrom [\"&IF(cal!$X$4=1,\"l/h\",IF(cal!$X$4=2,\"GPM\"))&\"]\"","v":"Heizmittelstrom [l/h]"},{"$f":"\"zug. wassers. Druckverlust [\"&IF(cal!$X$4=1,\"kPa\",IF(cal!$X$4=2,\"ftH2O\"))&\"]\"","v":"zug. wassers. Druckverlust [kPa]"},{"$f":"CONCATENATE(\"Sens. Kälteleistung * \",ROUND(J8,0),\"/\",ROUND(J9,0),\"/\",ROUND(J10,0),\" [\"&IF(cal!$X$4=1,\"W\",IF(cal!$X$4=2,\"Btu/h\"))&\"]\")","v":"Sens. Kälteleistung * 0/0/0 [W]"},{"$f":"CONCATENATE(\"Tot. Kälteleistung \",ROUND(J8,0),\"/\",ROUND(J9,0),\"/\",ROUND(J10,0),\" [\"&IF(cal!$X$4=1,\"W\",IF(cal!$X$4=2,\"Btu/h\"))&\"]\")","v":"Tot. Kälteleistung 0/0/0 [W]"},{"$f":"\"Kühlmittelstrom [\"&IF(cal!$X$4=1,\"l/h\",IF(cal!$X$4=2,\"GPM\"))&\"]\"","v":"Kühlmittelstrom [l/h]"},{"$f":"\"zug. wassers. Druckverlust [\"&IF(cal!$X$4=1,\"kPa\",IF(cal!$X$4=2,\"ftH2O\"))&\"]\"","v":"zug. wassers. Druckverlust [kPa]"},"Schalldruckpegel *** [dB(A)]","Schallleistungspegel ** [dB(A)]","Leistungsaufnahme [W]",{"$f":"\"Luftvolumenstrom [\"&IF(cal!$X$4=1,\"m³/h\",IF(cal!$X$4=2,\"CFM\"))&\"]\"","v":"Luftvolumenstrom [m³/h]"},{"$f":"\"Luftaustrittstemp. Heizung [\"&IF(cal!$X$4=1,\"°C\",IF(cal!$X$4=2,\"°F\"))&\"]\"","v":"Luftaustrittstemp. Heizung [°C]"},{"$f":"\"Luftaustrittstemp. kühlung [\"&IF(cal!$X$4=1,\"°C\",IF(cal!$X$4=2,\"°F\"))&\"]\"","v":"Luftaustrittstemp. kühlung [°C]"}]
[{"$f":"cal!$Z$1&\" \"&$R$15&\" \"&ROUND(cal!Y22,1)&IF(cal!$X$4=1,\" cm\",IF(cal!$X$4=2,\" in\"))&\" \"&$R$16&\" \"&ROUND(cal!AA22,1)&IF(cal!$X$4=1,\" cm\",IF(cal!$X$4=2,\" in\"))&\" \"&$R$17&\" \"&ROUND(cal!AC22,1)&IF(cal!$X$4=1,\" cm\",IF(cal!$X$4=2,\" in\"))&\" (Type 1)\"","v":"Micro Canal höhe 6 cm breite 14 cm länge 60 cm (Type 1)"},null,null,null,null,null,null,null,null,null,null,null,null,null,null,null,"Temp.","höhe"]
[null,null,null,null,null,null,null,null,null,null,null,null,null,null,null,null,"heizen!","breite"]
[null,null,null,null,null,null,null,null,null,null,null,null,null,null,null,null,"kühlen!","länge"]
[]
[]
[]
[{"$f":"cal!$Z$1&\" \"&$R$15&\" \"&ROUND(cal!Y28,1)&IF(cal!$X$4=1,\" cm\",IF(cal!$X$4=2,\" in\"))&\" \"&$R$16&\" \"&ROUND(cal!AA28,1)&IF(cal!$X$4=1,\" cm\",IF(cal!$X$4=2,\" in\"))&\" \"&$R$17&\" \"&ROUND(cal!AC28,1)&IF(cal!$X$4=1,\" cm\",IF(cal!$X$4=2,\" in\"))&\" (Type 2)\"","v":"Micro Canal höhe 6 cm breite 14 cm länge 95 cm (Type 2)"}]
[]
[]
[]
[]
[]
[{"$f":"cal!$Z$1&\" \"&$R$15&\" \"&ROUND(cal!Y34,1)&IF(cal!$X$4=1,\" cm\",IF(cal!$X$4=2,\" in\"))&\" \"&$R$16&\" \"&ROUND(cal!AA34,1)&IF(cal!$X$4=1,\" cm\",IF(cal!$X$4=2,\" in\"))&\" \"&$R$17&\" \"&ROUND(cal!AC34,1)&IF(cal!$X$4=1,\" cm\",IF(cal!$X$4=2,\" in\"))&\" (Type 3)\"","v":"Micro Canal höhe 6 cm breite 14 cm länge 130 cm (Type 3)"}]
[]
[]
[]
[]
[]
[{"$f":"cal!$Z$1&\" \"&$R$15&\" \"&ROUND(cal!Y40,1)&IF(cal!$X$4=1,\" cm\",IF(cal!$X$4=2,\" in\"))&\" \"&$R$16&\" \"&ROUND(cal!AA40,1)&IF(cal!$X$4=1,\" cm\",IF(cal!$X$4=2,\" in\"))&\" \"&$R$17&\" \"&ROUND(cal!AC40,1)&IF(cal!$X$4=1,\" cm\",IF(cal!$X$4=2,\" in\"))&\" (Type 4)\"","v":"Micro Canal höhe 6 cm breite 14 cm länge 165 cm (Type 4)"}]
[]
[]
[]
[]
[]
[{"$f":"cal!$Z$1&\" \"&$R$15&\" \"&ROUND(cal!Y46,1)&IF(cal!$X$4=1,\" cm\",IF(cal!$X$4=2,\" in\"))&\" \"&$R$16&\" \"&ROUND(cal!AA46,1)&IF(cal!$X$4=1,\" cm\",IF(cal!$X$4=2,\" in\"))&\" \"&$R$17&\" \"&ROUND(cal!AC46,1)&IF(cal!$X$4=1,\" cm\",IF(cal!$X$4=2,\" in\"))&\" (Type 5)\"","v":"Micro Canal höhe 6 cm breite 14 cm länge 200 cm (Type 5)"}]
[]
[]
[]
[]
[]
[{"$f":"cal!$Z$1&\" \"&$R$15&\" \"&ROUND(cal!Y52,1)&IF(cal!$X$4=1,\" cm\",IF(cal!$X$4=2,\" in\"))&\" \"&$R$16&\" \"&ROUND(cal!AA52,1)&IF(cal!$X$4=1,\" cm\",IF(cal!$X$4=2,\" in\"))&\" \"&$R$17&\" \"&ROUND(cal!AC52,1)&IF(cal!$X$4=1,\" cm\",IF(cal!$X$4=2,\" in\"))&\" (Type 6)\"","v":"Micro Canal höhe 0 cm breite 0 cm länge 0 cm (Type 6)"}]
[]
[]
[]
[]
[]
[{"$f":"cal!$Z$1&\" \"&$R$15&\" \"&ROUND(cal!Y58,1)&IF(cal!$X$4=1,\" cm\",IF(cal!$X$4=2,\" in\"))&\" \"&$R$16&\" \"&ROUND(cal!AA58,1)&IF(cal!$X$4=1,\" cm\",IF(cal!$X$4=2,\" in\"))&\" \"&$R$17&\" \"&ROUND(cal!AC58,1)&IF(cal!$X$4=1,\" cm\",IF(cal!$X$4=2,\" in\"))&\" (Type 7)\"","v":"Micro Canal höhe 0 cm breite 0 cm länge 0 cm (Type 7)"}]
[]
[]
[]
[]
[]
[{"$f":"cal!$Z$1&\" \"&$R$15&\" \"&ROUND(cal!Y64,1)&IF(cal!$X$4=1,\" cm\",IF(cal!$X$4=2,\" in\"))&\" \"&$R$16&\" \"&ROUND(cal!AA64,1)&IF(cal!$X$4=1,\" cm\",IF(cal!$X$4=2,\" in\"))&\" \"&$R$17&\" \"&ROUND(cal!AC64,1)&IF(cal!$X$4=1,\" cm\",IF(cal!$X$4=2,\" in\"))&\" (Type 8)\"","v":"Micro Canal höhe 0 cm breite 0 cm länge 0 cm (Type 8)"}]
[]
[]
[]
[]
[]
[{"$f":"cal!$Z$1&\" \"&$R$15&\" \"&ROUND(cal!Y70,1)&IF(cal!$X$4=1,\" cm\",IF(cal!$X$4=2,\" in\"))&\" \"&$R$16&\" \"&ROUND(cal!AA70,1)&IF(cal!$X$4=1,\" cm\",IF(cal!$X$4=2,\" in\"))&\" \"&$R$17&\" \"&ROUND(cal!AC70,1)&IF(cal!$X$4=1,\" cm\",IF(cal!$X$4=2,\" in\"))&\" (Type 9)\"","v":"Micro Canal höhe 0 cm breite 0 cm länge 0 cm (Type 9)"}]
[]
[]
[]
[]
[]
["*Leistungsangaben nach EN 16430",null,null,null,null,null,null,null,null,null,null,null,{"$f":"cal!N70","v":"v2022-06-01"}]
["**Schallleistungspegel nach ISO 3741:2010"]
["***Schalldruckpegel bei angenommener Raumdämpfung von 8dB(A)"]

{"sheet":"FR","index":5,"n_rows":71,"n_cols":18,"rows_kept":71,"cut":false,"hidden":true,"merged":[[7,11,7,12],[5,11,5,12],[6,11,6,12],[10,5,10,7],[7,0,7,2],[7,5,7,8],[8,0,8,2],[8,5,8,8],[9,0,9,2],[9,5,9,8],[38,0,38,12],[44,0,44,12],[50,0,50,12],[62,0,62,12],[14,0,14,12],[20,0,20,12],[26,0,26,12],[32,0,32,12],[56,0,56,12]]}
[]
["Formulaire"]
[]
["Conditions"]
[]
["Températures",null,null,null,null,null,null,null,null,null,null,"Hauteur placée"]
["Chauffer:",null,null,null,null,"Refroidir:",null,null,null,null,null,null,null,null,null,null,"Copier toutes des données"]
[{"$f":"\"Temp. entrée\"","v":"Temp. entrée"},null,null,{"$f":"cal!E9","v":75},{"$f":"IF(cal!$X$4=1,\"°C\",IF(cal!$X$4=2,\"°F\"))","v":"°C"},{"$f":"A8","v":"Temp. entrée"},null,null,null,{"$f":"cal!K9","v":0},{"$f":"E8","v":"°C"},"Système unitaire",null,null,null,null,"Unités-SI"]
[{"$f":"\"Temp. retour\"","v":"Temp. retour"},null,null,{"$f":"cal!E10","v":65},{"$f":"E8","v":"°C"},{"$f":"A9","v":"Temp. retour"},null,null,null,{"$f":"cal!K10","v":0},{"$f":"E8","v":"°C"},null,null,null,null,null,"Unités-Impériales"]
[{"$f":"\"Temp. ambiante\"","v":"Temp. ambiante"},null,null,{"$f":"cal!E11","v":20},{"$f":"E8","v":"°C"},{"$f":"A10","v":"Temp. ambiante"},null,null,null,{"$f":"cal!K11","v":0},{"$f":"E8","v":"°C"}]
[null,null,null,null,null,"Humidité relative",null,null,null,{"$f":"cal!K12","v":0}]
[]
[]
["Niveau de vitesse","Voltage [V]",{"$f":"CONCATENATE(\"Puissance de cha. * \",ROUND(D8,0),\"/\",ROUND(D9,0),\"/\",ROUND(D10,0),\" [\"&IF(cal!$X$4=1,\"W\",IF(cal!$X$4=2,\"Btu/h\"))&\"]\")","v":"Puissance de cha. * 75/65/20 [W]"},{"$f":"\"Débit d'eau, chauffer [\"&IF(cal!$X$4=1,\"l/h\",IF(cal!$X$4=2,\"GPM\"))&\"]\"","v":"Débit d'eau, chauffer [l/h]"},{"$f":"\"Perte de charge [\"&IF(cal!$X$4=1,\"kPa\",IF(cal!$X$4=2,\"ftH2O\"))&\"]\"","v":"Perte de charge [kPa]"},{"$f":"CONCATENATE(\"Puissance sens. de refr. * \",ROUND(J8,0),\"/\",ROUND(J9,0),\"/\",ROUND(J10,0),\" [\"&IF(cal!$X$4=1,\"W\",IF(cal!$X$4=2,\"Btu/h\"))&\"]\")","v":"Puissance sens. de refr. * 0/0/0 [W]"},{"$f":"CONCATENATE(\"Puissance tot. de refr. \",ROUND(J8,0),\"/\",ROUND(J9,0),\"/\",ROUND(J10,0),\" [\"&IF(cal!$X$4=1,\"W\",IF(cal!$X$4=2,\"Btu/h\"))&\"]\")","v":"Puissance tot. de refr. 0/0/0 [W]"},{"$f":"\"Débit d'eau, refroidir [\"&IF(cal!$X$4=1,\"l/h\",IF(cal!$X$4=2,\"GPM\"))&\"]\"","v":"Débit d'eau, refroidir [l/h]"},{"$f":"\"Perte de charge [\"&IF(cal!$X$4=1,\"kPa\",IF(cal!$X$4=2,\"ftH2O\"))&\"]\"","v":"Perte de charge [kPa]"},"Pression sonore *** [dB(A)]","Puissance sonore ** [dB(A)]","Puissance absorbée [W]",{"$f":"\"Débit d'air [\"&IF(cal!$X$4=1,\"m³/h\",IF(cal!$X$4=2,\"CFM\"))&\"]\"","v":"Débit d'air [m³/h]"},{"$f":"\"Temp. de la sortie d'air cha. [\"&IF(cal!$X$4=1,\"°C\",IF(cal!$X$4=2,\"°F\"))&\"]\"","v":"Temp. de la sortie d'air cha. [°C]"},{"$f":"\"Temp. de la sortie d'air refr. [\"&IF(cal!$X$4=1,\"°C\",IF(cal!$X$4=2,\"°F\"))&\"]\"","v":"Temp. de la sortie d'air refr. [°C]"}]
[{"$f":"cal!$Z$1&\" \"&$R$15&\" \"&ROUND(cal!Y22,1)&IF(cal!$X$4=1,\" cm\",IF(cal!$X$4=2,\" in\"))&\" \"&$R$16&\" \"&ROUND(cal!AA22,1)&IF(cal!$X$4=1,\" cm\",IF(cal!$X$4=2,\" in\"))&\" \"&$R$17&\" \"&ROUND(cal!AC22,1)&IF(cal!$X$4=1,\" cm\",IF(cal!$X$4=2,\" in\"))&\" (Type 1)\"","v":"Micro Canal hauteur 6 cm largeur 14 cm longueur 60 cm (Type 1)"},null,null,null,null,null,null,null,null,null,null,null,null,null,null,null,"Temp.","hauteur"]
[null,null,null,null,null,null,null,null,null,null,null,null,null,null,null,null,"chauf.!","largeur"]
[null,null,null,null,null,null,null,null,null,null,null,null,null,null,null,null,"refr.!","longueur"]
[]
[]
[]
[{"$f":"cal!$Z$1&\" \"&$R$15&\" \"&ROUND(cal!Y28,1)&IF(cal!$X$4=1,\" cm\",IF(cal!$X$4=2,\" in\"))&\" \"&$R$16&\" \"&ROUND(cal!AA28,1)&IF(cal!$X$4=1,\" cm\",IF(cal!$X$4=2,\" in\"))&\" \"&$R$17&\" \"&ROUND(cal!AC28,1)&IF(cal!$X$4=1,\" cm\",IF(cal!$X$4=2,\" in\"))&\" (Type 2)\"","v":"Micro Canal hauteur 6 cm largeur 14 cm longueur 95 cm (Type 2)"}]
[]
[]
[]
[]
[]
[{"$f":"cal!$Z$1&\" \"&$R$15&\" \"&ROUND(cal!Y34,1)&IF(cal!$X$4=1,\" cm\",IF(cal!$X$4=2,\" in\"))&\" \"&$R$16&\" \"&ROUND(cal!AA34,1)&IF(cal!$X$4=1,\" cm\",IF(cal!$X$4=2,\" in\"))&\" \"&$R$17&\" \"&ROUND(cal!AC34,1)&IF(cal!$X$4=1,\" cm\",IF(cal!$X$4=2,\" in\"))&\" (Type 3)\"","v":"Micro Canal hauteur 6 cm largeur 14 cm longueur 130 cm (Type 3)"}]
[]
[]
[]
[]
[]
[{"$f":"cal!$Z$1&\" \"&$R$15&\" \"&ROUND(cal!Y40,1)&IF(cal!$X$4=1,\" cm\",IF(cal!$X$4=2,\" in\"))&\" \"&$R$16&\" \"&ROUND(cal!AA40,1)&IF(cal!$X$4=1,\" cm\",IF(cal!$X$4=2,\" in\"))&\" \"&$R$17&\" \"&ROUND(cal!AC40,1)&IF(cal!$X$4=1,\" cm\",IF(cal!$X$4=2,\" in\"))&\" (Type 4)\"","v":"Micro Canal hauteur 6 cm largeur 14 cm longueur 165 cm (Type 4)"}]
[]
[]
[]
[]
[]
[{"$f":"cal!$Z$1&\" \"&$R$15&\" \"&ROUND(cal!Y46,1)&IF(cal!$X$4=1,\" cm\",IF(cal!$X$4=2,\" in\"))&\" \"&$R$16&\" \"&ROUND(cal!AA46,1)&IF(cal!$X$4=1,\" cm\",IF(cal!$X$4=2,\" in\"))&\" \"&$R$17&\" \"&ROUND(cal!AC46,1)&IF(cal!$X$4=1,\" cm\",IF(cal!$X$4=2,\" in\"))&\" (Type 5)\"","v":"Micro Canal hauteur 6 cm largeur 14 cm longueur 200 cm (Type 5)"}]
[]
[]
[]
[]
[]
[{"$f":"cal!$Z$1&\" \"&$R$15&\" \"&ROUND(cal!Y52,1)&IF(cal!$X$4=1,\" cm\",IF(cal!$X$4=2,\" in\"))&\" \"&$R$16&\" \"&ROUND(cal!AA52,1)&IF(cal!$X$4=1,\" cm\",IF(cal!$X$4=2,\" in\"))&\" \"&$R$17&\" \"&ROUND(cal!AC52,1)&IF(cal!$X$4=1,\" cm\",IF(cal!$X$4=2,\" in\"))&\" (Type 6)\"","v":"Micro Canal hauteur 0 cm largeur 0 cm longueur 0 cm (Type 6)"}]
[]
[]
[]
[]
[]
[{"$f":"cal!$Z$1&\" \"&$R$15&\" \"&ROUND(cal!Y58,1)&IF(cal!$X$4=1,\" cm\",IF(cal!$X$4=2,\" in\"))&\" \"&$R$16&\" \"&ROUND(cal!AA58,1)&IF(cal!$X$4=1,\" cm\",IF(cal!$X$4=2,\" in\"))&\" \"&$R$17&\" \"&ROUND(cal!AC58,1)&IF(cal!$X$4=1,\" cm\",IF(cal!$X$4=2,\" in\"))&\" (Type 7)\"","v":"Micro Canal hauteur 0 cm largeur 0 cm longueur 0 cm (Type 7)"}]
[]
[]
[]
[]
[]
[{"$f":"cal!$Z$1&\" \"&$R$15&\" \"&ROUND(cal!Y64,1)&IF(cal!$X$4=1,\" cm\",IF(cal!$X$4=2,\" in\"))&\" \"&$R$16&\" \"&ROUND(cal!AA64,1)&IF(cal!$X$4=1,\" cm\",IF(cal!$X$4=2,\" in\"))&\" \"&$R$17&\" \"&ROUND(cal!AC64,1)&IF(cal!$X$4=1,\" cm\",IF(cal!$X$4=2,\" in\"))&\" (Type 8)\"","v":"Micro Canal hauteur 0 cm largeur 0 cm longueur 0 cm (Type 8)"}]
[]
[]
[]
[]
[]
[{"$f":"cal!$Z$1&\" \"&$R$15&\" \"&ROUND(cal!Y70,1)&IF(cal!$X$4=1,\" cm\",IF(cal!$X$4=2,\" in\"))&\" \"&$R$16&\" \"&ROUND(cal!AA70,1)&IF(cal!$X$4=1,\" cm\",IF(cal!$X$4=2,\" in\"))&\" \"&$R$17&\" \"&ROUND(cal!AC70,1)&IF(cal!$X$4=1,\" cm\",IF(cal!$X$4=2,\" in\"))&\" (Type 9)\"","v":"Micro Canal hauteur 0 cm largeur 0 cm longueur 0 cm (Type 9)"}]
[]
[]
[]
[]
[]
["*Testé selon EN 16430",null,null,null,null,null,null,null,null,null,null,null,{"$f":"cal!N70","v":"v2022-06-01"}]
["**Puissance sonore testé selon ISO 3741:2010"]
["***Pression sonore avec une atténuation ambiante du 8dB(A)"]

{"sheet":"NR","index":6,"n_rows":71,"n_cols":18,"rows_kept":71,"cut":false,"hidden":true,"merged":[[7,11,7,12],[5,11,5,12],[6,11,6,12],[10,5,10,7],[9,5,9,8],[50,0,50,12],[56,0,56,12],[62,0,62,12],[2,6,2,9],[3,6,3,9],[14,0,14,12],[20,0,20,12],[26,0,26,12],[32,0,32,12],[38,0,38,12],[44,0,44,12],[7,0,7,2],[7,5,7,8],[8,0,8,2],[8,5,8,8],[9,0,9,2]]}
[]
["Modell"]
[]
["Conditions"]
[]
["Temperaturer",null,null,null,null,null,null,null,null,null,null,"Plassert høyde"]
["Varme:",null,null,null,null,"Kjøling:",null,null,null,null,null,null,null,null,null,null,"Kopier alle data"]
["Tur vanntemp.",0,0,{"$f":"cal!E9","v":75},{"$f":"IF(cal!$X$4=1,\"°C\",IF(cal!$X$4=2,\"°F\"))","v":"°C"},{"$f":"A8","v":"Tur vanntemp."},null,null,null,{"$f":"cal!K9","v":0},{"$f":"E8","v":"°C"},"Enhetssystem",null,null,null,null,"SI-enheter"]
["Retur vanntemp.",0,0,{"$f":"cal!E10","v":65},{"$f":"E8","v":"°C"},{"$f":"A9","v":"Retur vanntemp."},null,null,null,{"$f":"cal!K10","v":0},{"$f":"E8","v":"°C"},null,null,null,null,null,"Imperiale-enheter"]
["Rom temp.",0,0,{"$f":"cal!E11","v":20},{"$f":"E8","v":"°C"},{"$f":"A10","v":"Rom temp."},null,null,null,{"$f":"cal!K11","v":0},{"$f":"E8","v":"°C"}]
[null,null,null,null,null,"Relativ fuktighet",null,null,null,{"$f":"cal!K12","v":0}]
[]
[]
["Hastighet:","Styresignal[V]",{"$f":"CONCATENATE(\"Varme effekt * \",ROUND(D8,0),\"/\",ROUND(D9,0),\"/\",ROUND(D10,0),\" [\"&IF(cal!$X$4=1,\"W\",IF(cal!$X$4=2,\"Btu/h\"))&\"]\")","v":"Varme effekt * 75/65/20 [W]"},{"$f":"\"Vannmengde, varme [\"&IF(cal!$X$4=1,\"l/h\",IF(cal!$X$4=2,\"GPM\"))&\"]\"","v":"Vannmengde, varme [l/h]"},{"$f":"\"Trykktap [\"&IF(cal!$X$4=1,\"kPa\",IF(cal!$X$4=2,\"ftH2O\"))&\"]\"","v":"Trykktap [kPa]"},{"$f":"CONCATENATE(\"Sens. Kjøling effekt * \",ROUND(J8,0),\"/\",ROUND(J9,0),\"/\",ROUND(J10,0),\" [\"&IF(cal!$X$4=1,\"W\",IF(cal!$X$4=2,\"Btu/h\"))&\"]\")","v":"Sens. Kjøling effekt * 0/0/0 [W]"},{"$f":"CONCATENATE(\"Tot. Kjøle effekt * \",ROUND(J8,0),\"/\",ROUND(J9,0),\"/\",ROUND(J10,0),\" [\"&IF(cal!$X$4=1,\"W\",IF(cal!$X$4=2,\"Btu/h\"))&\"]\")","v":"Tot. Kjøle effekt * 0/0/0 [W]"},{"$f":"\"Vannmengde, kjøling [\"&IF(cal!$X$4=1,\"l/h\",IF(cal!$X$4=2,\"GPM\"))&\"]\"","v":"Vannmengde, kjøling [l/h]"},{"$f":"E14","v":"Trykktap [kPa]"},"Lydtrykk *** [dB(A)]","Lydeffekt ** [dB(A)]","Elektrisk effekt [W]",{"$f":"\"Luftmengde [\"&IF(cal!$X$4=1,\"m³/h\",IF(cal!$X$4=2,\"CFM\"))&\"]\"","v":"Luftmengde [m³/h]"},{"$f":"\"Utluft temperatur, Varme [\"&IF(cal!$X$4=1,\"°C\",IF(cal!$X$4=2,\"°F\"))&\"]\"","v":"Utluft temperatur, Varme [°C]"},{"$f":"\"Utluft temperatur, Kjøling [\"&IF(cal!$X$4=1,\"°C\",IF(cal!$X$4=2,\"°F\"))&\"]\"","v":"Utluft temperatur, Kjøling [°C]"}]
[{"$f":"cal!$Z$1&\" \"&$R$15&\" \"&ROUND(cal!Y22,1)&IF(cal!$X$4=1,\" cm\",IF(cal!$X$4=2,\" in\"))&\" \"&$R$16&\" \"&ROUND(cal!AA22,1)&IF(cal!$X$4=1,\" cm\",IF(cal!$X$4=2,\" in\"))&\" \"&$R$17&\" \"&ROUND(cal!AC22,1)&IF(cal!$X$4=1,\" cm\",IF(cal!$X$4=2,\" in\"))&\" (Type 1)\"","v":"Micro Canal høyde 6 cm bredde 14 cm lengde 60 cm (Type 1)"},null,null,null,null,null,null,null,null,null,null,null,null,null,null,null,"Temp.","høyde"]
[null,null,null,null,null,null,null,null,null,null,null,null,null,null,null,null,"varme!","bredde"]
[null,null,null,null,null,null,null,null,null,null,null,null,null,null,null,null,"kjøling!","lengde"]
[]
[]
[]
[{"$f":"cal!$Z$1&\" \"&$R$15&\" \"&ROUND(cal!Y28,1)&IF(cal!$X$4=1,\" cm\",IF(cal!$X$4=2,\" in\"))&\" \"&$R$16&\" \"&ROUND(cal!AA28,1)&IF(cal!$X$4=1,\" cm\",IF(cal!$X$4=2,\" in\"))&\" \"&$R$17&\" \"&ROUND(cal!AC28,1)&IF(cal!$X$4=1,\" cm\",IF(cal!$X$4=2,\" in\"))&\" (Type 2)\"","v":"Micro Canal høyde 6 cm bredde 14 cm lengde 95 cm (Type 2)"}]
[]
[]
[]
[]
[]
[{"$f":"cal!$Z$1&\" \"&$R$15&\" \"&ROUND(cal!Y34,1)&IF(cal!$X$4=1,\" cm\",IF(cal!$X$4=2,\" in\"))&\" \"&$R$16&\" \"&ROUND(cal!AA34,1)&IF(cal!$X$4=1,\" cm\",IF(cal!$X$4=2,\" in\"))&\" \"&$R$17&\" \"&ROUND(cal!AC34,1)&IF(cal!$X$4=1,\" cm\",IF(cal!$X$4=2,\" in\"))&\" (Type 3)\"","v":"Micro Canal høyde 6 cm bredde 14 cm lengde 130 cm (Type 3)"}]
[]
[]
[]
[]
[]
[{"$f":"cal!$Z$1&\" \"&$R$15&\" \"&ROUND(cal!Y40,1)&IF(cal!$X$4=1,\" cm\",IF(cal!$X$4=2,\" in\"))&\" \"&$R$16&\" \"&ROUND(cal!AA40,1)&IF(cal!$X$4=1,\" cm\",IF(cal!$X$4=2,\" in\"))&\" \"&$R$17&\" \"&ROUND(cal!AC40,1)&IF(cal!$X$4=1,\" cm\",IF(cal!$X$4=2,\" in\"))&\" (Type 4)\"","v":"Micro Canal høyde 6 cm bredde 14 cm lengde 165 cm (Type 4)"}]
[]
[]
[]
[]
[]
[{"$f":"cal!$Z$1&\" \"&$R$15&\" \"&ROUND(cal!Y46,1)&IF(cal!$X$4=1,\" cm\",IF(cal!$X$4=2,\" in\"))&\" \"&$R$16&\" \"&ROUND(cal!AA46,1)&IF(cal!$X$4=1,\" cm\",IF(cal!$X$4=2,\" in\"))&\" \"&$R$17&\" \"&ROUND(cal!AC46,1)&IF(cal!$X$4=1,\" cm\",IF(cal!$X$4=2,\" in\"))&\" (Type 5)\"","v":"Micro Canal høyde 6 cm bredde 14 cm lengde 200 cm (Type 5)"}]
[]
[]
[]
[]
[]
[{"$f":"cal!$Z$1&\" \"&$R$15&\" \"&ROUND(cal!Y52,1)&IF(cal!$X$4=1,\" cm\",IF(cal!$X$4=2,\" in\"))&\" \"&$R$16&\" \"&ROUND(cal!AA52,1)&IF(cal!$X$4=1,\" cm\",IF(cal!$X$4=2,\" in\"))&\" \"&$R$17&\" \"&ROUND(cal!AC52,1)&IF(cal!$X$4=1,\" cm\",IF(cal!$X$4=2,\" in\"))&\" (Type 6)\"","v":"Micro Canal høyde 0 cm bredde 0 cm lengde 0 cm (Type 6)"}]
[]
[]
[]
[]
[]
[{"$f":"cal!$Z$1&\" \"&$R$15&\" \"&ROUND(cal!Y58,1)&IF(cal!$X$4=1,\" cm\",IF(cal!$X$4=2,\" in\"))&\" \"&$R$16&\" \"&ROUND(cal!AA58,1)&IF(cal!$X$4=1,\" cm\",IF(cal!$X$4=2,\" in\"))&\" \"&$R$17&\" \"&ROUND(cal!AC58,1)&IF(cal!$X$4=1,\" cm\",IF(cal!$X$4=2,\" in\"))&\" (Type 7)\"","v":"Micro Canal høyde 0 cm bredde 0 cm lengde 0 cm (Type 7)"}]
[]
[]
[]
[]
[]
[{"$f":"cal!$Z$1&\" \"&$R$15&\" \"&ROUND(cal!Y64,1)&IF(cal!$X$4=1,\" cm\",IF(cal!$X$4=2,\" in\"))&\" \"&$R$16&\" \"&ROUND(cal!AA64,1)&IF(cal!$X$4=1,\" cm\",IF(cal!$X$4=2,\" in\"))&\" \"&$R$17&\" \"&ROUND(cal!AC64,1)&IF(cal!$X$4=1,\" cm\",IF(cal!$X$4=2,\" in\"))&\" (Type 8)\"","v":"Micro Canal høyde 0 cm bredde 0 cm lengde 0 cm (Type 8)"}]
[]
[]
[]
[]
[]
[{"$f":"cal!$Z$1&\" \"&$R$15&\" \"&ROUND(cal!Y70,1)&IF(cal!$X$4=1,\" cm\",IF(cal!$X$4=2,\" in\"))&\" \"&$R$16&\" \"&ROUND(cal!AA70,1)&IF(cal!$X$4=1,\" cm\",IF(cal!$X$4=2,\" in\"))&\" \"&$R$17&\" \"&ROUND(cal!AC70,1)&IF(cal!$X$4=1,\" cm\",IF(cal!$X$4=2,\" in\"))&\" (Type 9)\"","v":"Micro Canal høyde 0 cm bredde 0 cm lengde 0 cm (Type 9)"}]
[]
[]
[]
[]
[]
["*Testé selon EN 16430",null,null,null,null,null,null,null,null,null,null,null,{"$f":"cal!N70","v":"v2022-06-01"}]
["**Puissance sonore testé selon ISO 3741:2010"]
["***Pression sonore avec une atténuation ambiante du 8dB(A)"]

{"sheet":"SP","index":7,"n_rows":71,"n_cols":18,"rows_kept":71,"cut":false,"hidden":true,"merged":[[38,0,38,12],[44,0,44,12],[50,0,50,12],[56,0,56,12],[62,0,62,12],[14,0,14,12],[20,0,20,12],[26,0,26,12],[32,0,32,12],[2,6,2,9],[3,6,3,9],[7,0,7,2],[7,5,7,8],[7,11,7,12],[8,0,8,2],[8,5,8,8],[5,11,5,12],[6,11,6,12],[10,5,10,7],[9,0,9,2],[9,5,9,8]]}
[]
["Model"]
[]
["Conditions"]
[]
["Temperaturas",null,null,null,null,null,null,null,null,null,null,"Altitud"]
["Calefacción:",null,null,null,null,"Enfriamiento:",null,null,null,null,null,null,null,null,null,null,"Copiar todos los datos"]
["Agua impulsión",0,0,{"$f":"cal!E9","v":75},{"$f":"IF(cal!$X$4=1,\"°C\",IF(cal!$X$4=2,\"°F\"))","v":"°C"},{"$f":"A8","v":"Agua impulsión"},null,null,null,{"$f":"cal!K9","v":0},{"$f":"E8","v":"°C"},"Convers. de unidades",null,null,null,null,"Unidades-SI"]
["Agua retorno",0,0,{"$f":"cal!E10","v":65},{"$f":"E8","v":"°C"},{"$f":"A9","v":"Agua retorno"},null,null,null,{"$f":"cal!K10","v":0},{"$f":"E8","v":"°C"},null,null,null,null,null,"Unidades-Imperial"]
["Ambiente (bulbo seco)",0,0,{"$f":"cal!E11","v":20},{"$f":"E8","v":"°C"},{"$f":"A10","v":"Ambiente (bulbo seco)"},null,null,null,{"$f":"cal!K11","v":0},{"$f":"E8","v":"°C"}]
[null,null,null,null,null,"Humedad relativa",null,null,null,{"$f":"cal!K12","v":0}]
[]
[]
["Nivel de velocidad:"," Voltaje control [V]",{"$f":"CONCATENATE(\"Emisión calefacción * \",ROUND(D8,0),\"/\",ROUND(D9,0),\"/\",ROUND(D10,0),\" [\"&IF(cal!$X$4=1,\"W\",IF(cal!$X$4=2,\"Btu/h\"))&\"]\")","v":"Emisión calefacción * 75/65/20 [W]"},{"$f":"\"Caudal de agua, calefacción [\"&IF(cal!$X$4=1,\"l/h\",IF(cal!$X$4=2,\"GPM\"))&\"]\"","v":"Caudal de agua, calefacción [l/h]"},{"$f":"\"Pérdida de carga del agua [\"&IF(cal!$X$4=1,\"kPa\",IF(cal!$X$4=2,\"ftH2O\"))&\"]\"","v":"Pérdida de carga del agua [kPa]"},{"$f":"CONCATENATE(\"Emisión sensible Frío * \",ROUND(J8,0),\"/\",ROUND(J9,0),\"/\",ROUND(J10,0),\" [\"&IF(cal!$X$4=1,\"W\",IF(cal!$X$4=2,\"Btu/h\"))&\"]\")","v":"Emisión sensible Frío * 0/0/0 [W]"},{"$f":"CONCATENATE(\"Emisión total Frío * \",ROUND(J8,0),\"/\",ROUND(J9,0),\"/\",ROUND(J10,0),\" [\"&IF(cal!$X$4=1,\"W\",IF(cal!$X$4=2,\"Btu/h\"))&\"]\")","v":"Emisión total Frío * 0/0/0 [W]"},{"$f":"\"Caudal de agua, calefacción [\"&IF(cal!$X$4=1,\"l/h\",IF(cal!$X$4=2,\"GPM\"))&\"]\"","v":"Caudal de agua, calefacción [l/h]"},{"$f":"E14","v":"Pérdida de carga del agua [kPa]"},"Presión sonora *** [dB(A)]","Potencia sonora ** [dB(A)]","Potencia eléctrica absorbida [W]",{"$f":"\"Caudal de aire [\"&IF(cal!$X$4=1,\"m³/h\",IF(cal!$X$4=2,\"CFM\"))&\"]\"","v":"Caudal de aire [m³/h]"},{"$f":"\"Temperatura salida de aire calefacción [\"&IF(cal!$X$4=1,\"°C\",IF(cal!$X$4=2,\"°F\"))&\"]\"","v":"Temperatura salida de aire calefacción [°C]"},{"$f":"\"Temperatura salida de aire refrigeración [\"&IF(cal!$X$4=1,\"°C\",IF(cal!$X$4=2,\"°F\"))&\"]\"","v":"Temperatura salida de aire refrigeración [°C]"}]
[{"$f":"cal!$Z$1&\" \"&$R$15&\" \"&ROUND(cal!Y22,1)&IF(cal!$X$4=1,\" cm\",IF(cal!$X$4=2,\" in\"))&\" \"&$R$16&\" \"&ROUND(cal!AA22,1)&IF(cal!$X$4=1,\" cm\",IF(cal!$X$4=2,\" in\"))&\" \"&$R$17&\" \"&ROUND(cal!AC22,1)&IF(cal!$X$4=1,\" cm\",IF(cal!$X$4=2,\" in\"))&\" (Type 1)\"","v":"Micro Canal altura 6 cm ancho 14 cm longitud 60 cm (Type 1)"},null,null,null,null,null,null,null,null,null,null,null,null,null,null,null,"Temp.","altura"]
[null,null,null,null,null,null,null,null,null,null,null,null,null,null,null,null,"calefac.","ancho"]
[null,null,null,null,null,null,null,null,null,null,null,null,null,null,null,null,"enfria.","longitud"]
[]
[]
[]
[{"$f":"cal!$Z$1&\" \"&$R$15&\" \"&ROUND(cal!Y28,1)&IF(cal!$X$4=1,\" cm\",IF(cal!$X$4=2,\" in\"))&\" \"&$R$16&\" \"&ROUND(cal!AA28,1)&IF(cal!$X$4=1,\" cm\",IF(cal!$X$4=2,\" in\"))&\" \"&$R$17&\" \"&ROUND(cal!AC28,1)&IF(cal!$X$4=1,\" cm\",IF(cal!$X$4=2,\" in\"))&\" (Type 2)\"","v":"Micro Canal altura 6 cm ancho 14 cm longitud 95 cm (Type 2)"}]
[]
[]
[]
[]
[]
[{"$f":"cal!$Z$1&\" \"&$R$15&\" \"&ROUND(cal!Y34,1)&IF(cal!$X$4=1,\" cm\",IF(cal!$X$4=2,\" in\"))&\" \"&$R$16&\" \"&ROUND(cal!AA34,1)&IF(cal!$X$4=1,\" cm\",IF(cal!$X$4=2,\" in\"))&\" \"&$R$17&\" \"&ROUND(cal!AC34,1)&IF(cal!$X$4=1,\" cm\",IF(cal!$X$4=2,\" in\"))&\" (Type 3)\"","v":"Micro Canal altura 6 cm ancho 14 cm longitud 130 cm (Type 3)"}]
[]
[]
[]
[]
[]
[{"$f":"cal!$Z$1&\" \"&$R$15&\" \"&ROUND(cal!Y40,1)&IF(cal!$X$4=1,\" cm\",IF(cal!$X$4=2,\" in\"))&\" \"&$R$16&\" \"&ROUND(cal!AA40,1)&IF(cal!$X$4=1,\" cm\",IF(cal!$X$4=2,\" in\"))&\" \"&$R$17&\" \"&ROUND(cal!AC40,1)&IF(cal!$X$4=1,\" cm\",IF(cal!$X$4=2,\" in\"))&\" (Type 4)\"","v":"Micro Canal altura 6 cm ancho 14 cm longitud 165 cm (Type 4)"}]
[]
[]
[]
[]
[]
[{"$f":"cal!$Z$1&\" \"&$R$15&\" \"&ROUND(cal!Y46,1)&IF(cal!$X$4=1,\" cm\",IF(cal!$X$4=2,\" in\"))&\" \"&$R$16&\" \"&ROUND(cal!AA46,1)&IF(cal!$X$4=1,\" cm\",IF(cal!$X$4=2,\" in\"))&\" \"&$R$17&\" \"&ROUND(cal!AC46,1)&IF(cal!$X$4=1,\" cm\",IF(cal!$X$4=2,\" in\"))&\" (Type 5)\"","v":"Micro Canal altura 6 cm ancho 14 cm longitud 200 cm (Type 5)"}]
[]
[]
[]
[]
[]
[{"$f":"cal!$Z$1&\" \"&$R$15&\" \"&ROUND(cal!Y52,1)&IF(cal!$X$4=1,\" cm\",IF(cal!$X$4=2,\" in\"))&\" \"&$R$16&\" \"&ROUND(cal!AA52,1)&IF(cal!$X$4=1,\" cm\",IF(cal!$X$4=2,\" in\"))&\" \"&$R$17&\" \"&ROUND(cal!AC52,1)&IF(cal!$X$4=1,\" cm\",IF(cal!$X$4=2,\" in\"))&\" (Type 6)\"","v":"Micro Canal altura 0 cm ancho 0 cm longitud 0 cm (Type 6)"}]
[]
[]
[]
[]
[]
[{"$f":"cal!$Z$1&\" \"&$R$15&\" \"&ROUND(cal!Y58,1)&IF(cal!$X$4=1,\" cm\",IF(cal!$X$4=2,\" in\"))&\" \"&$R$16&\" \"&ROUND(cal!AA58,1)&IF(cal!$X$4=1,\" cm\",IF(cal!$X$4=2,\" in\"))&\" \"&$R$17&\" \"&ROUND(cal!AC58,1)&IF(cal!$X$4=1,\" cm\",IF(cal!$X$4=2,\" in\"))&\" (Type 7)\"","v":"Micro Canal altura 0 cm ancho 0 cm longitud 0 cm (Type 7)"}]
[]
[]
[]
[]
[]
[{"$f":"cal!$Z$1&\" \"&$R$15&\" \"&ROUND(cal!Y64,1)&IF(cal!$X$4=1,\" cm\",IF(cal!$X$4=2,\" in\"))&\" \"&$R$16&\" \"&ROUND(cal!AA64,1)&IF(cal!$X$4=1,\" cm\",IF(cal!$X$4=2,\" in\"))&\" \"&$R$17&\" \"&ROUND(cal!AC64,1)&IF(cal!$X$4=1,\" cm\",IF(cal!$X$4=2,\" in\"))&\" (Type 8)\"","v":"Micro Canal altura 0 cm ancho 0 cm longitud 0 cm (Type 8)"}]
[]
[]
[]
[]
[]
[{"$f":"cal!$Z$1&\" \"&$R$15&\" \"&ROUND(cal!Y70,1)&IF(cal!$X$4=1,\" cm\",IF(cal!$X$4=2,\" in\"))&\" \"&$R$16&\" \"&ROUND(cal!AA70,1)&IF(cal!$X$4=1,\" cm\",IF(cal!$X$4=2,\" in\"))&\" \"&$R$17&\" \"&ROUND(cal!AC70,1)&IF(cal!$X$4=1,\" cm\",IF(cal!$X$4=2,\" in\"))&\" (Type 9)\"","v":"Micro Canal altura 0 cm ancho 0 cm longitud 0 cm (Type 9)"}]
[]
[]
[]
[]
[]
["*La potencia de enfriamiento se calcula según la norma EN 16430 con ventiladores de todas las alturas.",null,null,null,null,null,null,null,null,null,null,null,{"$f":"cal!N70","v":"v2022-06-01"}]
["**Potencia sonora según ISO 3741: 2010."]
["***Nivel de presión acústica con una amortiguación ambiental supuesta de 8 dB (A)."]

{"sheet":"SW","index":8,"n_rows":71,"n_cols":18,"rows_kept":71,"cut":false,"hidden":true,"merged":[[62,0,62,12],[9,5,9,8],[14,0,14,12],[20,0,20,12],[26,0,26,12],[10,5,10,8],[32,0,32,12],[38,0,38,12],[44,0,44,12],[50,0,50,12],[56,0,56,12],[5,11,5,12],[6,11,6,12],[7,5,7,8],[7,11,7,12],[8,5,8,8]]}
[]
["Formulary"]
[]
["Conditions"]
[]
["Temperaturer",null,null,null,null,null,null,null,null,null,null,"Höjd över havet"]
["Värme:",null,null,null,null,"Kyla:",null,null,null,null,null,null,null,null,null,null,"Kopiera all data"]
["Tillopp",null,null,{"$f":"cal!E9","v":75},{"$f":"IF(cal!$X$4=1,\"°C\",IF(cal!$X$4=2,\"°F\"))","v":"°C"},{"$f":"A8","v":"Tillopp"},null,null,null,{"$f":"cal!K9","v":0},{"$f":"E8","v":"°C"},"Enhetssystem",null,null,null,null,"SI-enheter"]
["Retur",null,null,{"$f":"cal!E10","v":65},{"$f":"E8","v":"°C"},{"$f":"A9","v":"Retur"},null,null,null,{"$f":"cal!K10","v":0},{"$f":"E8","v":"°C"},null,null,null,null,null,"Imperiella-enheter"]
["Rum (torr)",null,null,{"$f":"cal!E11","v":20},{"$f":"E8","v":"°C"},{"$f":"A10","v":"Rum (torr)"},null,null,null,{"$f":"cal!K11","v":0},{"$f":"E8","v":"°C"}]
[null,null,null,null,null,"rel. Fuktighet",null,null,null,{"$f":"cal!K12","v":0}]
[]
[]
["Fläkthastighet","Spänning, Fläkt [V]",{"$f":"CONCATENATE(\"Värme effekt * \",ROUND(D8,0),\"/\",ROUND(D9,0),\"/\",ROUND(D10,0),\" [\"&IF(cal!$X$4=1,\"W\",IF(cal!$X$4=2,\"Btu/h\"))&\"]\")","v":"Värme effekt * 75/65/20 [W]"},{"$f":"\"Vattenflöde, värme [\"&IF(cal!$X$4=1,\"l/h\",IF(cal!$X$4=2,\"GPM\"))&\"]\"","v":"Vattenflöde, värme [l/h]"},{"$f":"\"Tryckfall, vatten [\"&IF(cal!$X$4=1,\"kPa\",IF(cal!$X$4=2,\"ftH2O\"))&\"]\"","v":"Tryckfall, vatten [kPa]"},{"$f":"CONCATENATE(\"Märkbar kylkapacitet * \",ROUND(J8,0),\"/\",ROUND(J9,0),\"/\",ROUND(J10,0),\" [\"&IF(cal!$X$4=1,\"W\",IF(cal!$X$4=2,\"Btu/h\"))&\"]\")","v":"Märkbar kylkapacitet * 0/0/0 [W]"},{"$f":"CONCATENATE(\"Total kylkapacitet \",ROUND(J8,0),\"/\",ROUND(J9,0),\"/\",ROUND(J10,0),\" [\"&IF(cal!$X$4=1,\"W\",IF(cal!$X$4=2,\"Btu/h\"))&\"]\")","v":"Total kylkapacitet 0/0/0 [W]"},{"$f":"\"Vattenflöde, kyla [\"&IF(cal!$X$4=1,\"l/h\",IF(cal!$X$4=2,\"GPM\"))&\"]\"","v":"Vattenflöde, kyla [l/h]"},{"$f":"E14","v":"Tryckfall, vatten [kPa]"},"Ljudtryck *** [dB(A)]","Ljudeffekt ** [dB(A)]","Effektförbrukning [W]",{"$f":"\"Luftflöde [\"&IF(cal!$X$4=1,\"m³/h\",IF(cal!$X$4=2,\"CFM\"))&\"]\"","v":"Luftflöde [m³/h]"},{"$f":"\"Air exhaust temp. heating [\"&IF(cal!$X$4=1,\"°C\",IF(cal!$X$4=2,\"°F\"))&\"]\"","v":"Air exhaust temp. heating [°C]"},{"$f":"\"Air exhaust temp. cooling [\"&IF(cal!$X$4=1,\"°C\",IF(cal!$X$4=2,\"°F\"))&\"]\"","v":"Air exhaust temp. cooling [°C]"}]
[{"$f":"cal!$Z$1&\" \"&$R$15&\" \"&ROUND(cal!Y22,1)&IF(cal!$X$4=1,\" cm\",IF(cal!$X$4=2,\" in\"))&\" \"&$R$16&\" \"&ROUND(cal!AA22,1)&IF(cal!$X$4=1,\" cm\",IF(cal!$X$4=2,\" in\"))&\" \"&$R$17&\" \"&ROUND(cal!AC22,1)&IF(cal!$X$4=1,\" cm\",IF(cal!$X$4=2,\" in\"))&\" (Typ 1)\"","v":"Micro Canal höjd 6 cm djup 14 cm längd 60 cm (Typ 1)"},null,null,null,null,null,null,null,null,null,null,null,null,null,null,null,"Temp.","höjd"]
[null,null,null,null,null,null,null,null,null,null,null,null,null,null,null,null,"värme!","djup"]
[null,null,null,null,null,null,null,null,null,null,null,null,null,null,null,null,"kyla!","längd"]
[]
[]
[]
[{"$f":"cal!$Z$1&\" \"&$R$15&\" \"&ROUND(cal!Y28,1)&IF(cal!$X$4=1,\" cm\",IF(cal!$X$4=2,\" in\"))&\" \"&$R$16&\" \"&ROUND(cal!AA28,1)&IF(cal!$X$4=1,\" cm\",IF(cal!$X$4=2,\" in\"))&\" \"&$R$17&\" \"&ROUND(cal!AC28,1)&IF(cal!$X$4=1,\" cm\",IF(cal!$X$4=2,\" in\"))&\" (Typ 2)\"","v":"Micro Canal höjd 6 cm djup 14 cm längd 95 cm (Typ 2)"}]
[]
[]
[]
[]
[]
[{"$f":"cal!$Z$1&\" \"&$R$15&\" \"&ROUND(cal!Y34,1)&IF(cal!$X$4=1,\" cm\",IF(cal!$X$4=2,\" in\"))&\" \"&$R$16&\" \"&ROUND(cal!AA34,1)&IF(cal!$X$4=1,\" cm\",IF(cal!$X$4=2,\" in\"))&\" \"&$R$17&\" \"&ROUND(cal!AC34,1)&IF(cal!$X$4=1,\" cm\",IF(cal!$X$4=2,\" in\"))&\" (Typ 3)\"","v":"Micro Canal höjd 6 cm djup 14 cm längd 130 cm (Typ 3)"}]
[]
[]
[]
[]
[]
[{"$f":"cal!$Z$1&\" \"&$R$15&\" \"&ROUND(cal!Y40,1)&IF(cal!$X$4=1,\" cm\",IF(cal!$X$4=2,\" in\"))&\" \"&$R$16&\" \"&ROUND(cal!AA40,1)&IF(cal!$X$4=1,\" cm\",IF(cal!$X$4=2,\" in\"))&\" \"&$R$17&\" \"&ROUND(cal!AC40,1)&IF(cal!$X$4=1,\" cm\",IF(cal!$X$4=2,\" in\"))&\" (Typ 4)\"","v":"Micro Canal höjd 6 cm djup 14 cm längd 165 cm (Typ 4)"}]
[]
[]
[]
[]
[]
[{"$f":"cal!$Z$1&\" \"&$R$15&\" \"&ROUND(cal!Y46,1)&IF(cal!$X$4=1,\" cm\",IF(cal!$X$4=2,\" in\"))&\" \"&$R$16&\" \"&ROUND(cal!AA46,1)&IF(cal!$X$4=1,\" cm\",IF(cal!$X$4=2,\" in\"))&\" \"&$R$17&\" \"&ROUND(cal!AC46,1)&IF(cal!$X$4=1,\" cm\",IF(cal!$X$4=2,\" in\"))&\" (Typ 5)\"","v":"Micro Canal höjd 6 cm djup 14 cm längd 200 cm (Typ 5)"}]
[]
[]
[]
[]
[]
[{"$f":"cal!$Z$1&\" \"&$R$15&\" \"&ROUND(cal!Y52,1)&IF(cal!$X$4=1,\" cm\",IF(cal!$X$4=2,\" in\"))&\" \"&$R$16&\" \"&ROUND(cal!AA52,1)&IF(cal!$X$4=1,\" cm\",IF(cal!$X$4=2,\" in\"))&\" \"&$R$17&\" \"&ROUND(cal!AC52,1)&IF(cal!$X$4=1,\" cm\",IF(cal!$X$4=2,\" in\"))&\" (Typ 6)\"","v":"Micro Canal höjd 0 cm djup 0 cm längd 0 cm (Typ 6)"}]
[]
[]
[]
[]
[]
[{"$f":"cal!$Z$1&\" \"&$R$15&\" \"&ROUND(cal!Y58,1)&IF(cal!$X$4=1,\" cm\",IF(cal!$X$4=2,\" in\"))&\" \"&$R$16&\" \"&ROUND(cal!AA58,1)&IF(cal!$X$4=1,\" cm\",IF(cal!$X$4=2,\" in\"))&\" \"&$R$17&\" \"&ROUND(cal!AC58,1)&IF(cal!$X$4=1,\" cm\",IF(cal!$X$4=2,\" in\"))&\" (Typ 7)\"","v":"Micro Canal höjd 0 cm djup 0 cm längd 0 cm (Typ 7)"}]
[]
[]
[]
[]
[]
[{"$f":"cal!$Z$1&\" \"&$R$15&\" \"&ROUND(cal!Y64,1)&IF(cal!$X$4=1,\" cm\",IF(cal!$X$4=2,\" in\"))&\" \"&$R$16&\" \"&ROUND(cal!AA64,1)&IF(cal!$X$4=1,\" cm\",IF(cal!$X$4=2,\" in\"))&\" \"&$R$17&\" \"&ROUND(cal!AC64,1)&IF(cal!$X$4=1,\" cm\",IF(cal!$X$4=2,\" in\"))&\" (Typ 8)\"","v":"Micro Canal höjd 0 cm djup 0 cm längd 0 cm (Typ 8)"}]
[]
[]
[]
[]
[]
[{"$f":"cal!$Z$1&\" \"&$R$15&\" \"&ROUND(cal!Y70,1)&IF(cal!$X$4=1,\" cm\",IF(cal!$X$4=2,\" in\"))&\" \"&$R$16&\" \"&ROUND(cal!AA70,1)&IF(cal!$X$4=1,\" cm\",IF(cal!$X$4=2,\" in\"))&\" \"&$R$17&\" \"&ROUND(cal!AC70,1)&IF(cal!$X$4=1,\" cm\",IF(cal!$X$4=2,\" in\"))&\" (Typ 9)\"","v":"Micro Canal höjd 0 cm djup 0 cm längd 0 cm (Typ 9)"}]
[]
[]
[]
[]
[]
["*Värden enligt EN16430",null,null,null,null,null,null,null,null,null,null,null,{"$f":"cal!N70","v":"v2022-06-01"}]
["**Ljudeffekt enligt ISO 3741: 2010"]
["***Ljudtryck med en antagen rumsdämpning på 8dB (A),"]

{"sheet":"TS","index":9,"n_rows":71,"n_cols":18,"rows_kept":71,"cut":false,"hidden":true,"merged":[[62,0,62,12],[9,0,9,2],[9,5,9,8],[10,5,10,7],[14,0,14,12],[20,0,20,12],[26,0,26,12],[32,0,32,12],[38,0,38,12],[44,0,44,12],[50,0,50,12],[56,0,56,12],[8,0,8,2],[8,5,8,8],[5,11,5,12],[6,11,6,12],[7,0,7,2],[7,5,7,8],[7,11,7,12]]}
[]
["Formulary"]
[]
["Conditions"]
[]
["Teploty",null,null,null,null,null,null,null,null,null,null,"Výška umístění"]
["Topení:",null,null,null,null,"Chlazení:",null,null,null,null,null,null,null,null,null,null,"Kopírovat všechna data"]
["Voda na přívodu",null,null,{"$f":"cal!E9","v":75},{"$f":"IF(cal!$X$4=1,\"°C\",IF(cal!$X$4=2,\"°F\"))","v":"°C"},{"$f":"A8","v":"Voda na přívodu"},null,null,null,{"$f":"cal!K9","v":0},{"$f":"E8","v":"°C"},"Převod jednotek",null,null,null,null,"Mezinárodní (Sl)"]
["Voda na zpátečce",null,null,{"$f":"cal!E10","v":65},{"$f":"E8","v":"°C"},{"$f":"A9","v":"Voda na zpátečce"},null,null,null,{"$f":"cal!K10","v":0},{"$f":"E8","v":"°C"},null,null,null,null,null,"Imperiální"]
["\"Suchá\" Teplota vzduchu",null,null,{"$f":"cal!E11","v":20},{"$f":"E8","v":"°C"},{"$f":"A10","v":"\"Suchá\" Teplota vzduchu"},null,null,null,{"$f":"cal!K11","v":0},{"$f":"E8","v":"°C"}]
[null,null,null,null,null,"Relativní vlhkost",null,null,null,{"$f":"cal!K12","v":0}]
[]
[]
["Rychlost","Ovládací napětí [V]",{"$f":"CONCATENATE(\"Výkon Topení * \",ROUND(D8,0),\"/\",ROUND(D9,0),\"/\",ROUND(D10,0),\" [\"&IF(cal!$X$4=1,\"W\",IF(cal!$X$4=2,\"Btu/h\"))&\"]\")","v":"Výkon Topení * 75/65/20 [W]"},{"$f":"\"Průtok vody, topení [\"&IF(cal!$X$4=1,\"l/h\",IF(cal!$X$4=2,\"GPM\"))&\"]\"","v":"Průtok vody, topení [l/h]"},{"$f":"\"Tlaková ztráta [\"&IF(cal!$X$4=1,\"kPa\",IF(cal!$X$4=2,\"ftH2O\"))&\"]\"","v":"Tlaková ztráta [kPa]"},{"$f":"CONCATENATE(\"Výkon chlazení Znatelný * \",ROUND(J8,0),\"/\",ROUND(J9,0),\"/\",ROUND(J10,0),\" [\"&IF(cal!$X$4=1,\"W\",IF(cal!$X$4=2,\"Btu/h\"))&\"]\")","v":"Výkon chlazení Znatelný * 0/0/0 [W]"},{"$f":"CONCATENATE(\"Výkon chlazení Celkový \",ROUND(J8,0),\"/\",ROUND(J9,0),\"/\",ROUND(J10,0),\" [\"&IF(cal!$X$4=1,\"W\",IF(cal!$X$4=2,\"Btu/h\"))&\"]\")","v":"Výkon chlazení Celkový 0/0/0 [W]"},{"$f":"\"Průtok vody,chlazení [\"&IF(cal!$X$4=1,\"l/h\",IF(cal!$X$4=2,\"GPM\"))&\"]\"","v":"Průtok vody,chlazení [l/h]"},{"$f":"E14","v":"Tlaková ztráta [kPa]"},"Akustický tlak *** [dB(A)]","Akustický výkon ** [dB(A)]","Elektrický výkon [W]",{"$f":"\"Průtok vzduchu [\"&IF(cal!$X$4=1,\"m³/h\",IF(cal!$X$4=2,\"CFM\"))&\"]\"","v":"Průtok vzduchu [m³/h]"},{"$f":"\"Air exhaust temp. heating [\"&IF(cal!$X$4=1,\"°C\",IF(cal!$X$4=2,\"°F\"))&\"]\"","v":"Air exhaust temp. heating [°C]"},{"$f":"\"Air exhaust temp. cooling [\"&IF(cal!$X$4=1,\"°C\",IF(cal!$X$4=2,\"°F\"))&\"]\"","v":"Air exhaust temp. cooling [°C]"}]
[{"$f":"cal!$Z$1&\", \"&$R$15&\" \"&ROUND(cal!Y22,1)&IF(cal!$X$4=1,\" cm\",IF(cal!$X$4=2,\" in\"))&\", \"&$R$16&\" \"&ROUND(cal!AA22,1)&IF(cal!$X$4=1,\" cm\",IF(cal!$X$4=2,\" in\"))&\", \"&$R$17&\" \"&ROUND(cal!AC22,1)&IF(cal!$X$4=1,\" cm\",IF(cal!$X$4=2,\" in\"))&\" (Typ 1)\"","v":"Micro Canal, Výška 6 cm, Šířka 14 cm, Délka 60 cm (Typ 1)"},null,null,null,null,null,null,null,null,null,null,null,null,null,null,null,"Teploty","Výška"]
[null,null,null,null,null,null,null,null,null,null,null,null,null,null,null,null,"topení!","Šířka"]
[null,null,null,null,null,null,null,null,null,null,null,null,null,null,null,null,"chlazení!","Délka"]
[]
[]
[]
[{"$f":"cal!$Z$1&\" \"&$R$15&\" \"&ROUND(cal!Y28,1)&IF(cal!$X$4=1,\" cm\",IF(cal!$X$4=2,\" in\"))&\" \"&$R$16&\" \"&ROUND(cal!AA28,1)&IF(cal!$X$4=1,\" cm\",IF(cal!$X$4=2,\" in\"))&\" \"&$R$17&\" \"&ROUND(cal!AC28,1)&IF(cal!$X$4=1,\" cm\",IF(cal!$X$4=2,\" in\"))&\" (Typ 2)\"","v":"Micro Canal Výška 6 cm Šířka 14 cm Délka 95 cm (Typ 2)"}]
[]
[]
[]
[]
[]
[{"$f":"cal!$Z$1&\" \"&$R$15&\" \"&ROUND(cal!Y34,1)&IF(cal!$X$4=1,\" cm\",IF(cal!$X$4=2,\" in\"))&\" \"&$R$16&\" \"&ROUND(cal!AA34,1)&IF(cal!$X$4=1,\" cm\",IF(cal!$X$4=2,\" in\"))&\" \"&$R$17&\" \"&ROUND(cal!AC34,1)&IF(cal!$X$4=1,\" cm\",IF(cal!$X$4=2,\" in\"))&\" (Type 3)\"","v":"Micro Canal Výška 6 cm Šířka 14 cm Délka 130 cm (Type 3)"}]
[]
[]
[]
[]
[]
[{"$f":"cal!$Z$1&\" \"&$R$15&\" \"&ROUND(cal!Y40,1)&IF(cal!$X$4=1,\" cm\",IF(cal!$X$4=2,\" in\"))&\" \"&$R$16&\" \"&ROUND(cal!AA40,1)&IF(cal!$X$4=1,\" cm\",IF(cal!$X$4=2,\" in\"))&\" \"&$R$17&\" \"&ROUND(cal!AC40,1)&IF(cal!$X$4=1,\" cm\",IF(cal!$X$4=2,\" in\"))&\" (Typ 4)\"","v":"Micro Canal Výška 6 cm Šířka 14 cm Délka 165 cm (Typ 4)"}]
[]
[]
[]
[]
[]
[{"$f":"cal!$Z$1&\" \"&$R$15&\" \"&ROUND(cal!Y46,1)&IF(cal!$X$4=1,\" cm\",IF(cal!$X$4=2,\" in\"))&\" \"&$R$16&\" \"&ROUND(cal!AA46,1)&IF(cal!$X$4=1,\" cm\",IF(cal!$X$4=2,\" in\"))&\" \"&$R$17&\" \"&ROUND(cal!AC46,1)&IF(cal!$X$4=1,\" cm\",IF(cal!$X$4=2,\" in\"))&\" (Typ 5)\"","v":"Micro Canal Výška 6 cm Šířka 14 cm Délka 200 cm (Typ 5)"}]
[]
[]
[]
[]
[]
[{"$f":"cal!$Z$1&\" \"&$R$15&\" \"&ROUND(cal!Y52,1)&IF(cal!$X$4=1,\" cm\",IF(cal!$X$4=2,\" in\"))&\" \"&$R$16&\" \"&ROUND(cal!AA52,1)&IF(cal!$X$4=1,\" cm\",IF(cal!$X$4=2,\" in\"))&\" \"&$R$17&\" \"&ROUND(cal!AC52,1)&IF(cal!$X$4=1,\" cm\",IF(cal!$X$4=2,\" in\"))&\" (Typ 6)\"","v":"Micro Canal Výška 0 cm Šířka 0 cm Délka 0 cm (Typ 6)"}]
[]
[]
[]
[]
[]
[{"$f":"cal!$Z$1&\" \"&$R$15&\" \"&ROUND(cal!Y58,1)&IF(cal!$X$4=1,\" cm\",IF(cal!$X$4=2,\" in\"))&\" \"&$R$16&\" \"&ROUND(cal!AA58,1)&IF(cal!$X$4=1,\" cm\",IF(cal!$X$4=2,\" in\"))&\" \"&$R$17&\" \"&ROUND(cal!AC58,1)&IF(cal!$X$4=1,\" cm\",IF(cal!$X$4=2,\" in\"))&\" (Typ 7)\"","v":"Micro Canal Výška 0 cm Šířka 0 cm Délka 0 cm (Typ 7)"}]
[]
[]
[]
[]
[]
[{"$f":"cal!$Z$1&\" \"&$R$15&\" \"&ROUND(cal!Y64,1)&IF(cal!$X$4=1,\" cm\",IF(cal!$X$4=2,\" in\"))&\" \"&$R$16&\" \"&ROUND(cal!AA64,1)&IF(cal!$X$4=1,\" cm\",IF(cal!$X$4=2,\" in\"))&\" \"&$R$17&\" \"&ROUND(cal!AC64,1)&IF(cal!$X$4=1,\" cm\",IF(cal!$X$4=2,\" in\"))&\" (Typ 8)\"","v":"Micro Canal Výška 0 cm Šířka 0 cm Délka 0 cm (Typ 8)"}]
[]
[]
[]
[]
[]
[{"$f":"cal!$Z$1&\" \"&$R$15&\" \"&ROUND(cal!Y70,1)&IF(cal!$X$4=1,\" cm\",IF(cal!$X$4=2,\" in\"))&\" \"&$R$16&\" \"&ROUND(cal!AA70,1)&IF(cal!$X$4=1,\" cm\",IF(cal!$X$4=2,\" in\"))&\" \"&$R$17&\" \"&ROUND(cal!AC70,1)&IF(cal!$X$4=1,\" cm\",IF(cal!$X$4=2,\" in\"))&\" (Typ 9)\"","v":"Micro Canal Výška 0 cm Šířka 0 cm Délka 0 cm (Typ 9)"}]
[]
[]
[]
[]
[]
["*Hodnoty podle EN16430",null,null,null,null,null,null,null,null,null,null,null,{"$f":"cal!N70","v":"v2022-06-01"}]
["**Akustický tlak podle ISO 3741:2010"]
["***Akustický výkon s předpokládaným útlumem místnosti 8 dB (A)."]

{"sheet":"ExtraTaal1","index":10,"n_rows":71,"n_cols":18,"rows_kept":71,"cut":false,"hidden":true,"merged":[[62,0,62,12],[9,0,9,2],[9,5,9,8],[10,5,10,7],[14,0,14,12],[20,0,20,12],[26,0,26,12],[32,0,32,12],[38,0,38,12],[44,0,44,12],[50,0,50,12],[56,0,56,12],[8,0,8,2],[8,5,8,8],[5,11,5,12],[6,11,6,12],[7,0,7,2],[7,5,7,8],[7,11,7,12]]}
[]
["Formulary"]
[]
["Conditions"]
[]
["Temperatures",null,null,null,null,null,null,null,null,null,null,"Altitude"]
["Heating:",null,null,null,null,"Cooling:",null,null,null,null,null,null,null,null,null,null,"Copy all data"]
[{"$f":"\"Inlet temp.\"","v":"Inlet temp."},null,null,{"$f":"cal!E9","v":75},{"$f":"IF(cal!$X$4=1,\"°C\",IF(cal!$X$4=2,\"°F\"))","v":"°C"},{"$f":"A8","v":"Inlet temp."},null,null,null,{"$f":"cal!K9","v":0},{"$f":"E8","v":"°C"},"Unit conversion",null,null,null,null,"SI-units"]
[{"$f":"\"Return temp.\"","v":"Return temp."},null,null,{"$f":"cal!E10","v":65},{"$f":"E8","v":"°C"},{"$f":"A9","v":"Return temp."},null,null,null,{"$f":"cal!K10","v":0},{"$f":"E8","v":"°C"},null,null,null,null,null,"Imperial-units"]
[{"$f":"\"Room temp.\"","v":"Room temp."},null,null,{"$f":"cal!E11","v":20},{"$f":"E8","v":"°C"},{"$f":"A10","v":"Room temp."},null,null,null,{"$f":"cal!K11","v":0},{"$f":"E8","v":"°C"}]
[null,null,null,null,null,"Relative humidity",null,null,null,{"$f":"cal!K12","v":0}]
[]
[]
["Speed level:","Control voltage [V]",{"$f":"CONCATENATE(\"Heat output * \",ROUND(D8,0),\"/\",ROUND(D9,0),\"/\",ROUND(D10,0),\" [\"&IF(cal!$X$4=1,\"W\",IF(cal!$X$4=2,\"Btu/h\"))&\"]\")","v":"Heat output * 75/65/20 [W]"},{"$f":"\"Water flowrate, heating [\"&IF(cal!$X$4=1,\"l/h\",IF(cal!$X$4=2,\"GPM\"))&\"]\"","v":"Water flowrate, heating [l/h]"},{"$f":"\"Watersided pressure loss [\"&IF(cal!$X$4=1,\"kPa\",IF(cal!$X$4=2,\"inH2O\"))&\"]\"","v":"Watersided pressure loss [kPa]"},{"$f":"CONCATENATE(\"Sens. cooling capacity * \",ROUND(J8,0),\"/\",ROUND(J9,0),\"/\",ROUND(J10,0),\" [\"&IF(cal!$X$4=1,\"W\",IF(cal!$X$4=2,\"Btu/h\"))&\"]\")","v":"Sens. cooling capacity * 0/0/0 [W]"},{"$f":"CONCATENATE(\"Tot. cooling capacity \",ROUND(J8,0),\"/\",ROUND(J9,0),\"/\",ROUND(J10,0),\" [\"&IF(cal!$X$4=1,\"W\",IF(cal!$X$4=2,\"Btu/h\"))&\"]\")","v":"Tot. cooling capacity 0/0/0 [W]"},{"$f":"\"Water flowrate, cooling [\"&IF(cal!$X$4=1,\"l/h\",IF(cal!$X$4=2,\"GPM\"))&\"]\"","v":"Water flowrate, cooling [l/h]"},{"$f":"\"Watersided pressure loss [\"&IF(cal!$X$4=1,\"kPa\",IF(cal!$X$4=2,\"ftH2O\"))&\"]\"","v":"Watersided pressure loss [kPa]"},"Sound pressure *** [dB(A)]","Sound power ** [dB(A)]","Electrical power [W]",{"$f":"\"Air flowrate [\"&IF(cal!$X$4=1,\"m³/h\",IF(cal!$X$4=2,\"CFM\"))&\"]\"","v":"Air flowrate [m³/h]"},{"$f":"\"Air exhaust temp. heating [\"&IF(cal!$X$4=1,\"°C\",IF(cal!$X$4=2,\"°F\"))&\"]\"","v":"Air exhaust temp. heating [°C]"},{"$f":"\"Air exhaust temp. cooling [\"&IF(cal!$X$4=1,\"°C\",IF(cal!$X$4=2,\"°F\"))&\"]\"","v":"Air exhaust temp. cooling [°C]"}]
[{"$f":"cal!$Z$1&\" \"&$R$15&\" \"&ROUND(cal!Y22,1)&IF(cal!$X$4=1,\" cm\",IF(cal!$X$4=2,\" in\"))&\" \"&$R$16&\" \"&ROUND(cal!AA22,1)&IF(cal!$X$4=1,\" cm\",IF(cal!$X$4=2,\" in\"))&\" \"&$R$17&\" \"&ROUND(cal!AC22,1)&IF(cal!$X$4=1,\" cm\",IF(cal!$X$4=2,\" in\"))&\" (Type 1)\"","v":"Micro Canal height 6 cm width 14 cm length 60 cm (Type 1)"},null,null,null,null,null,null,null,null,null,null,null,null,null,null,null,"Temp.","height"]
[null,null,null,null,null,null,null,null,null,null,null,null,null,null,null,null,"heating!","width"]
[null,null,null,null,null,null,null,null,null,null,null,null,null,null,null,null,"cooling!","length"]
[]
[]
[]
[{"$f":"cal!$Z$1&\" \"&$R$15&\" \"&ROUND(cal!Y28,1)&IF(cal!$X$4=1,\" cm\",IF(cal!$X$4=2,\" in\"))&\" \"&$R$16&\" \"&ROUND(cal!AA28,1)&IF(cal!$X$4=1,\" cm\",IF(cal!$X$4=2,\" in\"))&\" \"&$R$17&\" \"&ROUND(cal!AC28,1)&IF(cal!$X$4=1,\" cm\",IF(cal!$X$4=2,\" in\"))&\" (Type 2)\"","v":"Micro Canal height 6 cm width 14 cm length 95 cm (Type 2)"}]
[]
[]
[]
[]
[]
[{"$f":"cal!$Z$1&\" \"&$R$15&\" \"&ROUND(cal!Y34,1)&IF(cal!$X$4=1,\" cm\",IF(cal!$X$4=2,\" in\"))&\" \"&$R$16&\" \"&ROUND(cal!AA34,1)&IF(cal!$X$4=1,\" cm\",IF(cal!$X$4=2,\" in\"))&\" \"&$R$17&\" \"&ROUND(cal!AC34,1)&IF(cal!$X$4=1,\" cm\",IF(cal!$X$4=2,\" in\"))&\" (Type 3)\"","v":"Micro Canal height 6 cm width 14 cm length 130 cm (Type 3)"}]
[]
[]
[]
[]
[]
[{"$f":"cal!$Z$1&\" \"&$R$15&\" \"&ROUND(cal!Y40,1)&IF(cal!$X$4=1,\" cm\",IF(cal!$X$4=2,\" in\"))&\" \"&$R$16&\" \"&ROUND(cal!AA40,1)&IF(cal!$X$4=1,\" cm\",IF(cal!$X$4=2,\" in\"))&\" \"&$R$17&\" \"&ROUND(cal!AC40,1)&IF(cal!$X$4=1,\" cm\",IF(cal!$X$4=2,\" in\"))&\" (Type 4)\"","v":"Micro Canal height 6 cm width 14 cm length 165 cm (Type 4)"}]
[]
[]
[]
[]
[]
[{"$f":"cal!$Z$1&\" \"&$R$15&\" \"&ROUND(cal!Y46,1)&IF(cal!$X$4=1,\" cm\",IF(cal!$X$4=2,\" in\"))&\" \"&$R$16&\" \"&ROUND(cal!AA46,1)&IF(cal!$X$4=1,\" cm\",IF(cal!$X$4=2,\" in\"))&\" \"&$R$17&\" \"&ROUND(cal!AC46,1)&IF(cal!$X$4=1,\" cm\",IF(cal!$X$4=2,\" in\"))&\" (Type 5)\"","v":"Micro Canal height 6 cm width 14 cm length 200 cm (Type 5)"}]
[]
[]
[]
[]
[]
[{"$f":"cal!$Z$1&\" \"&$R$15&\" \"&ROUND(cal!Y52,1)&IF(cal!$X$4=1,\" cm\",IF(cal!$X$4=2,\" in\"))&\" \"&$R$16&\" \"&ROUND(cal!AA52,1)&IF(cal!$X$4=1,\" cm\",IF(cal!$X$4=2,\" in\"))&\" \"&$R$17&\" \"&ROUND(cal!AC52,1)&IF(cal!$X$4=1,\" cm\",IF(cal!$X$4=2,\" in\"))&\" (Type 6)\"","v":"Micro Canal height 0 cm width 0 cm length 0 cm (Type 6)"}]
[]
[]
[]
[]
[]
[{"$f":"cal!$Z$1&\" \"&$R$15&\" \"&ROUND(cal!Y58,1)&IF(cal!$X$4=1,\" cm\",IF(cal!$X$4=2,\" in\"))&\" \"&$R$16&\" \"&ROUND(cal!AA58,1)&IF(cal!$X$4=1,\" cm\",IF(cal!$X$4=2,\" in\"))&\" \"&$R$17&\" \"&ROUND(cal!AC58,1)&IF(cal!$X$4=1,\" cm\",IF(cal!$X$4=2,\" in\"))&\" (Type 7)\"","v":"Micro Canal height 0 cm width 0 cm length 0 cm (Type 7)"}]
[]
[]
[]
[]
[]
[{"$f":"cal!$Z$1&\" \"&$R$15&\" \"&ROUND(cal!Y64,1)&IF(cal!$X$4=1,\" cm\",IF(cal!$X$4=2,\" in\"))&\" \"&$R$16&\" \"&ROUND(cal!AA64,1)&IF(cal!$X$4=1,\" cm\",IF(cal!$X$4=2,\" in\"))&\" \"&$R$17&\" \"&ROUND(cal!AC64,1)&IF(cal!$X$4=1,\" cm\",IF(cal!$X$4=2,\" in\"))&\" (Type 8)\"","v":"Micro Canal height 0 cm width 0 cm length 0 cm (Type 8)"}]
[]
[]
[]
[]
[]
[{"$f":"cal!$Z$1&\" \"&$R$15&\" \"&ROUND(cal!Y70,1)&IF(cal!$X$4=1,\" cm\",IF(cal!$X$4=2,\" in\"))&\" \"&$R$16&\" \"&ROUND(cal!AA70,1)&IF(cal!$X$4=1,\" cm\",IF(cal!$X$4=2,\" in\"))&\" \"&$R$17&\" \"&ROUND(cal!AC70,1)&IF(cal!$X$4=1,\" cm\",IF(cal!$X$4=2,\" in\"))&\" (Type 9)\"","v":"Micro Canal height 0 cm width 0 cm length 0 cm (Type 9)"}]
[]
[]
[]
[]
[]
["*Values according to EN 16430",null,null,null,null,null,null,null,null,null,null,null,{"$f":"cal!N70","v":"v2022-06-01"}]
["**Sound power according to ISO 3741:2010"]
["***Sound pressure with an assumed room damping of 8dB(A)"]

{"sheet":"ExtraTaal2","index":11,"n_rows":71,"n_cols":18,"rows_kept":71,"cut":false,"hidden":true,"merged":[[62,0,62,12],[9,0,9,2],[9,5,9,8],[10,5,10,7],[14,0,14,12],[20,0,20,12],[26,0,26,12],[32,0,32,12],[38,0,38,12],[44,0,44,12],[50,0,50,12],[56,0,56,12],[8,0,8,2],[8,5,8,8],[5,11,5,12],[6,11,6,12],[7,0,7,2],[7,5,7,8],[7,11,7,12]]}
[]
["Formulary"]
[]
["Conditions"]
[]
["Temperatures",null,null,null,null,null,null,null,null,null,null,"Altitude"]
["Heating:",null,null,null,null,"Cooling:",null,null,null,null,null,null,null,null,null,null,"Copy all data"]
[{"$f":"\"Inlet temp.\"","v":"Inlet temp."},null,null,{"$f":"cal!E9","v":75},{"$f":"IF(cal!$X$4=1,\"°C\",IF(cal!$X$4=2,\"°F\"))","v":"°C"},{"$f":"A8","v":"Inlet temp."},null,null,null,{"$f":"cal!K9","v":0},{"$f":"E8","v":"°C"},"Unit conversion",null,null,null,null,"SI-units"]
[{"$f":"\"Return temp.\"","v":"Return temp."},null,null,{"$f":"cal!E10","v":65},{"$f":"E8","v":"°C"},{"$f":"A9","v":"Return temp."},null,null,null,{"$f":"cal!K10","v":0},{"$f":"E8","v":"°C"},null,null,null,null,null,"Imperial-units"]
[{"$f":"\"Room temp.\"","v":"Room temp."},null,null,{"$f":"cal!E11","v":20},{"$f":"E8","v":"°C"},{"$f":"A10","v":"Room temp."},null,null,null,{"$f":"cal!K11","v":0},{"$f":"E8","v":"°C"}]
[null,null,null,null,null,"Relative humidity",null,null,null,{"$f":"cal!K12","v":0}]
[]
[]
["Speed level:","Control voltage [V]",{"$f":"CONCATENATE(\"Heat output * \",ROUND(D8,0),\"/\",ROUND(D9,0),\"/\",ROUND(D10,0),\" [\"&IF(cal!$X$4=1,\"W\",IF(cal!$X$4=2,\"Btu/h\"))&\"]\")","v":"Heat output * 75/65/20 [W]"},{"$f":"\"Water flowrate, heating [\"&IF(cal!$X$4=1,\"l/h\",IF(cal!$X$4=2,\"GPM\"))&\"]\"","v":"Water flowrate, heating [l/h]"},{"$f":"\"Watersided pressure loss [\"&IF(cal!$X$4=1,\"kPa\",IF(cal!$X$4=2,\"inH2O\"))&\"]\"","v":"Watersided pressure loss [kPa]"},{"$f":"CONCATENATE(\"Sens. cooling capacity * \",ROUND(J8,0),\"/\",ROUND(J9,0),\"/\",ROUND(J10,0),\" [\"&IF(cal!$X$4=1,\"W\",IF(cal!$X$4=2,\"Btu/h\"))&\"]\")","v":"Sens. cooling capacity * 0/0/0 [W]"},{"$f":"CONCATENATE(\"Tot. cooling capacity \",ROUND(J8,0),\"/\",ROUND(J9,0),\"/\",ROUND(J10,0),\" [\"&IF(cal!$X$4=1,\"W\",IF(cal!$X$4=2,\"Btu/h\"))&\"]\")","v":"Tot. cooling capacity 0/0/0 [W]"},{"$f":"\"Water flowrate, cooling [\"&IF(cal!$X$4=1,\"l/h\",IF(cal!$X$4=2,\"GPM\"))&\"]\"","v":"Water flowrate, cooling [l/h]"},{"$f":"\"Watersided pressure loss [\"&IF(cal!$X$4=1,\"kPa\",IF(cal!$X$4=2,\"ftH2O\"))&\"]\"","v":"Watersided pressure loss [kPa]"},"Sound pressure *** [dB(A)]","Sound power ** [dB(A)]","Electrical power [W]",{"$f":"\"Air flowrate [\"&IF(cal!$X$4=1,\"m³/h\",IF(cal!$X$4=2,\"CFM\"))&\"]\"","v":"Air flowrate [m³/h]"},{"$f":"\"Air exhaust temp. heating [\"&IF(cal!$X$4=1,\"°C\",IF(cal!$X$4=2,\"°F\"))&\"]\"","v":"Air exhaust temp. heating [°C]"},{"$f":"\"Air exhaust temp. cooling [\"&IF(cal!$X$4=1,\"°C\",IF(cal!$X$4=2,\"°F\"))&\"]\"","v":"Air exhaust temp. cooling [°C]"}]
[{"$f":"cal!$Z$1&\" \"&$R$15&\" \"&ROUND(cal!Y22,1)&IF(cal!$X$4=1,\" cm\",IF(cal!$X$4=2,\" in\"))&\" \"&$R$16&\" \"&ROUND(cal!AA22,1)&IF(cal!$X$4=1,\" cm\",IF(cal!$X$4=2,\" in\"))&\" \"&$R$17&\" \"&ROUND(cal!AC22,1)&IF(cal!$X$4=1,\" cm\",IF(cal!$X$4=2,\" in\"))&\" (Type 1)\"","v":"Micro Canal height 6 cm width 14 cm length 60 cm (Type 1)"},null,null,null,null,null,null,null,null,null,null,null,null,null,null,null,"Temp.","height"]
[null,null,null,null,null,null,null,null,null,null,null,null,null,null,null,null,"heating!","width"]
[null,null,null,null,null,null,null,null,null,null,null,null,null,null,null,null,"cooling!","length"]
[]
[]
[]
[{"$f":"cal!$Z$1&\" \"&$R$15&\" \"&ROUND(cal!Y28,1)&IF(cal!$X$4=1,\" cm\",IF(cal!$X$4=2,\" in\"))&\" \"&$R$16&\" \"&ROUND(cal!AA28,1)&IF(cal!$X$4=1,\" cm\",IF(cal!$X$4=2,\" in\"))&\" \"&$R$17&\" \"&ROUND(cal!AC28,1)&IF(cal!$X$4=1,\" cm\",IF(cal!$X$4=2,\" in\"))&\" (Type 2)\"","v":"Micro Canal height 6 cm width 14 cm length 95 cm (Type 2)"}]
[]
[]
[]
[]
[]
[{"$f":"cal!$Z$1&\" \"&$R$15&\" \"&ROUND(cal!Y34,1)&IF(cal!$X$4=1,\" cm\",IF(cal!$X$4=2,\" in\"))&\" \"&$R$16&\" \"&ROUND(cal!AA34,1)&IF(cal!$X$4=1,\" cm\",IF(cal!$X$4=2,\" in\"))&\" \"&$R$17&\" \"&ROUND(cal!AC34,1)&IF(cal!$X$4=1,\" cm\",IF(cal!$X$4=2,\" in\"))&\" (Type 3)\"","v":"Micro Canal height 6 cm width 14 cm length 130 cm (Type 3)"}]
[]
[]
[]
[]
[]
[{"$f":"cal!$Z$1&\" \"&$R$15&\" \"&ROUND(cal!Y40,1)&IF(cal!$X$4=1,\" cm\",IF(cal!$X$4=2,\" in\"))&\" \"&$R$16&\" \"&ROUND(cal!AA40,1)&IF(cal!$X$4=1,\" cm\",IF(cal!$X$4=2,\" in\"))&\" \"&$R$17&\" \"&ROUND(cal!AC40,1)&IF(cal!$X$4=1,\" cm\",IF(cal!$X$4=2,\" in\"))&\" (Type 4)\"","v":"Micro Canal height 6 cm width 14 cm length 165 cm (Type 4)"}]
[]
[]
[]
[]
[]
[{"$f":"cal!$Z$1&\" \"&$R$15&\" \"&ROUND(cal!Y46,1)&IF(cal!$X$4=1,\" cm\",IF(cal!$X$4=2,\" in\"))&\" \"&$R$16&\" \"&ROUND(cal!AA46,1)&IF(cal!$X$4=1,\" cm\",IF(cal!$X$4=2,\" in\"))&\" \"&$R$17&\" \"&ROUND(cal!AC46,1)&IF(cal!$X$4=1,\" cm\",IF(cal!$X$4=2,\" in\"))&\" (Type 5)\"","v":"Micro Canal height 6 cm width 14 cm length 200 cm (Type 5)"}]
[]
[]
[]
[]
[]
[{"$f":"cal!$Z$1&\" \"&$R$15&\" \"&ROUND(cal!Y52,1)&IF(cal!$X$4=1,\" cm\",IF(cal!$X$4=2,\" in\"))&\" \"&$R$16&\" \"&ROUND(cal!AA52,1)&IF(cal!$X$4=1,\" cm\",IF(cal!$X$4=2,\" in\"))&\" \"&$R$17&\" \"&ROUND(cal!AC52,1)&IF(cal!$X$4=1,\" cm\",IF(cal!$X$4=2,\" in\"))&\" (Type 6)\"","v":"Micro Canal height 0 cm width 0 cm length 0 cm (Type 6)"}]
[]
[]
[]
[]
[]
[{"$f":"cal!$Z$1&\" \"&$R$15&\" \"&ROUND(cal!Y58,1)&IF(cal!$X$4=1,\" cm\",IF(cal!$X$4=2,\" in\"))&\" \"&$R$16&\" \"&ROUND(cal!AA58,1)&IF(cal!$X$4=1,\" cm\",IF(cal!$X$4=2,\" in\"))&\" \"&$R$17&\" \"&ROUND(cal!AC58,1)&IF(cal!$X$4=1,\" cm\",IF(cal!$X$4=2,\" in\"))&\" (Type 7)\"","v":"Micro Canal height 0 cm width 0 cm length 0 cm (Type 7)"}]
[]
[]
[]
[]
[]
[{"$f":"cal!$Z$1&\" \"&$R$15&\" \"&ROUND(cal!Y64,1)&IF(cal!$X$4=1,\" cm\",IF(cal!$X$4=2,\" in\"))&\" \"&$R$16&\" \"&ROUND(cal!AA64,1)&IF(cal!$X$4=1,\" cm\",IF(cal!$X$4=2,\" in\"))&\" \"&$R$17&\" \"&ROUND(cal!AC64,1)&IF(cal!$X$4=1,\" cm\",IF(cal!$X$4=2,\" in\"))&\" (Type 8)\"","v":"Micro Canal height 0 cm width 0 cm length 0 cm (Type 8)"}]
[]
[]
[]
[]
[]
[{"$f":"cal!$Z$1&\" \"&$R$15&\" \"&ROUND(cal!Y70,1)&IF(cal!$X$4=1,\" cm\",IF(cal!$X$4=2,\" in\"))&\" \"&$R$16&\" \"&ROUND(cal!AA70,1)&IF(cal!$X$4=1,\" cm\",IF(cal!$X$4=2,\" in\"))&\" \"&$R$17&\" \"&ROUND(cal!AC70,1)&IF(cal!$X$4=1,\" cm\",IF(cal!$X$4=2,\" in\"))&\" (Type 9)\"","v":"Micro Canal height 0 cm width 0 cm length 0 cm (Type 9)"}]
[]
[]
[]
[]
[]
["*Values according to EN 16430",null,null,null,null,null,null,null,null,null,null,null,{"$f":"cal!N70","v":"v2022-06-01"}]
["**Sound power according to ISO 3741:2010"]
["***Sound pressure with an assumed room damping of 8dB(A)"]

{"sheet":"ExtraTaal3","index":12,"n_rows":71,"n_cols":18,"rows_kept":71,"cut":false,"hidden":true,"merged":[[62,0,62,12],[9,0,9,2],[9,5,9,8],[10,5,10,7],[14,0,14,12],[20,0,20,12],[26,0,26,12],[32,0,32,12],[38,0,38,12],[44,0,44,12],[50,0,50,12],[56,0,56,12],[8,0,8,2],[8,5,8,8],[5,11,5,12],[6,11,6,12],[7,0,7,2],[7,5,7,8],[7,11,7,12]]}
[]
["Formulary"]
[]
["Conditions"]
[]
["Temperatures",null,null,null,null,null,null,null,null,null,null,"Altitude"]
["Heating:",null,null,null,null,"Cooling:",null,null,null,null,null,null,null,null,null,null,"Copy all data"]
[{"$f":"\"Inlet temp.\"","v":"Inlet temp."},null,null,{"$f":"cal!E9","v":75},{"$f":"IF(cal!$X$4=1,\"°C\",IF(cal!$X$4=2,\"°F\"))","v":"°C"},{"$f":"A8","v":"Inlet temp."},null,null,null,{"$f":"cal!K9","v":0},{"$f":"E8","v":"°C"},"Unit conversion",null,null,null,null,"SI-units"]
[{"$f":"\"Return temp.\"","v":"Return temp."},null,null,{"$f":"cal!E10","v":65},{"$f":"E8","v":"°C"},{"$f":"A9","v":"Return temp."},null,null,null,{"$f":"cal!K10","v":0},{"$f":"E8","v":"°C"},null,null,null,null,null,"Imperial-units"]
[{"$f":"\"Room temp.\"","v":"Room temp."},null,null,{"$f":"cal!E11","v":20},{"$f":"E8","v":"°C"},{"$f":"A10","v":"Room temp."},null,null,null,{"$f":"cal!K11","v":0},{"$f":"E8","v":"°C"}]
[null,null,null,null,null,"Relative humidity",null,null,null,{"$f":"cal!K12","v":0}]
[]
[]
["Speed level:","Control voltage [V]",{"$f":"CONCATENATE(\"Heat output * \",ROUND(D8,0),\"/\",ROUND(D9,0),\"/\",ROUND(D10,0),\" [\"&IF(cal!$X$4=1,\"W\",IF(cal!$X$4=2,\"Btu/h\"))&\"]\")","v":"Heat output * 75/65/20 [W]"},{"$f":"\"Water flowrate, heating [\"&IF(cal!$X$4=1,\"l/h\",IF(cal!$X$4=2,\"GPM\"))&\"]\"","v":"Water flowrate, heating [l/h]"},{"$f":"\"Watersided pressure loss [\"&IF(cal!$X$4=1,\"kPa\",IF(cal!$X$4=2,\"inH2O\"))&\"]\"","v":"Watersided pressure loss [kPa]"},{"$f":"CONCATENATE(\"Sens. cooling capacity * \",ROUND(J8,0),\"/\",ROUND(J9,0),\"/\",ROUND(J10,0),\" [\"&IF(cal!$X$4=1,\"W\",IF(cal!$X$4=2,\"Btu/h\"))&\"]\")","v":"Sens. cooling capacity * 0/0/0 [W]"},{"$f":"CONCATENATE(\"Tot. cooling capacity \",ROUND(J8,0),\"/\",ROUND(J9,0),\"/\",ROUND(J10,0),\" [\"&IF(cal!$X$4=1,\"W\",IF(cal!$X$4=2,\"Btu/h\"))&\"]\")","v":"Tot. cooling capacity 0/0/0 [W]"},{"$f":"\"Water flowrate, cooling [\"&IF(cal!$X$4=1,\"l/h\",IF(cal!$X$4=2,\"GPM\"))&\"]\"","v":"Water flowrate, cooling [l/h]"},{"$f":"\"Watersided pressure loss [\"&IF(cal!$X$4=1,\"kPa\",IF(cal!$X$4=2,\"ftH2O\"))&\"]\"","v":"Watersided pressure loss [kPa]"},"Sound pressure *** [dB(A)]","Sound power ** [dB(A)]","Electrical power [W]",{"$f":"\"Air flowrate [\"&IF(cal!$X$4=1,\"m³/h\",IF(cal!$X$4=2,\"CFM\"))&\"]\"","v":"Air flowrate [m³/h]"},{"$f":"\"Air exhaust temp. heating [\"&IF(cal!$X$4=1,\"°C\",IF(cal!$X$4=2,\"°F\"))&\"]\"","v":"Air exhaust temp. heating [°C]"},{"$f":"\"Air exhaust temp. cooling [\"&IF(cal!$X$4=1,\"°C\",IF(cal!$X$4=2,\"°F\"))&\"]\"","v":"Air exhaust temp. cooling [°C]"}]
[{"$f":"cal!$Z$1&\" \"&$R$15&\" \"&ROUND(cal!Y22,1)&IF(cal!$X$4=1,\" cm\",IF(cal!$X$4=2,\" in\"))&\" \"&$R$16&\" \"&ROUND(cal!AA22,1)&IF(cal!$X$4=1,\" cm\",IF(cal!$X$4=2,\" in\"))&\" \"&$R$17&\" \"&ROUND(cal!AC22,1)&IF(cal!$X$4=1,\" cm\",IF(cal!$X$4=2,\" in\"))&\" (Type 1)\"","v":"Micro Canal height 6 cm width 14 cm length 60 cm (Type 1)"},null,null,null,null,null,null,null,null,null,null,null,null,null,null,null,"Temp.","height"]
[null,null,null,null,null,null,null,null,null,null,null,null,null,null,null,null,"heating!","width"]
[null,null,null,null,null,null,null,null,null,null,null,null,null,null,null,null,"cooling!","length"]
[]
[]
[]
[{"$f":"cal!$Z$1&\" \"&$R$15&\" \"&ROUND(cal!Y28,1)&IF(cal!$X$4=1,\" cm\",IF(cal!$X$4=2,\" in\"))&\" \"&$R$16&\" \"&ROUND(cal!AA28,1)&IF(cal!$X$4=1,\" cm\",IF(cal!$X$4=2,\" in\"))&\" \"&$R$17&\" \"&ROUND(cal!AC28,1)&IF(cal!$X$4=1,\" cm\",IF(cal!$X$4=2,\" in\"))&\" (Type 2)\"","v":"Micro Canal height 6 cm width 14 cm length 95 cm (Type 2)"}]
[]
[]
[]
[]
[]
[{"$f":"cal!$Z$1&\" \"&$R$15&\" \"&ROUND(cal!Y34,1)&IF(cal!$X$4=1,\" cm\",IF(cal!$X$4=2,\" in\"))&\" \"&$R$16&\" \"&ROUND(cal!AA34,1)&IF(cal!$X$4=1,\" cm\",IF(cal!$X$4=2,\" in\"))&\" \"&$R$17&\" \"&ROUND(cal!AC34,1)&IF(cal!$X$4=1,\" cm\",IF(cal!$X$4=2,\" in\"))&\" (Type 3)\"","v":"Micro Canal height 6 cm width 14 cm length 130 cm (Type 3)"}]
[]
[]
[]
[]
[]
[{"$f":"cal!$Z$1&\" \"&$R$15&\" \"&ROUND(cal!Y40,1)&IF(cal!$X$4=1,\" cm\",IF(cal!$X$4=2,\" in\"))&\" \"&$R$16&\" \"&ROUND(cal!AA40,1)&IF(cal!$X$4=1,\" cm\",IF(cal!$X$4=2,\" in\"))&\" \"&$R$17&\" \"&ROUND(cal!AC40,1)&IF(cal!$X$4=1,\" cm\",IF(cal!$X$4=2,\" in\"))&\" (Type 4)\"","v":"Micro Canal height 6 cm width 14 cm length 165 cm (Type 4)"}]
[]
[]
[]
[]
[]
[{"$f":"cal!$Z$1&\" \"&$R$15&\" \"&ROUND(cal!Y46,1)&IF(cal!$X$4=1,\" cm\",IF(cal!$X$4=2,\" in\"))&\" \"&$R$16&\" \"&ROUND(cal!AA46,1)&IF(cal!$X$4=1,\" cm\",IF(cal!$X$4=2,\" in\"))&\" \"&$R$17&\" \"&ROUND(cal!AC46,1)&IF(cal!$X$4=1,\" cm\",IF(cal!$X$4=2,\" in\"))&\" (Type 5)\"","v":"Micro Canal height 6 cm width 14 cm length 200 cm (Type 5)"}]
[]
[]
[]
[]
[]
[{"$f":"cal!$Z$1&\" \"&$R$15&\" \"&ROUND(cal!Y52,1)&IF(cal!$X$4=1,\" cm\",IF(cal!$X$4=2,\" in\"))&\" \"&$R$16&\" \"&ROUND(cal!AA52,1)&IF(cal!$X$4=1,\" cm\",IF(cal!$X$4=2,\" in\"))&\" \"&$R$17&\" \"&ROUND(cal!AC52,1)&IF(cal!$X$4=1,\" cm\",IF(cal!$X$4=2,\" in\"))&\" (Type 6)\"","v":"Micro Canal height 0 cm width 0 cm length 0 cm (Type 6)"}]
[]
[]
[]
[]
[]
[{"$f":"cal!$Z$1&\" \"&$R$15&\" \"&ROUND(cal!Y58,1)&IF(cal!$X$4=1,\" cm\",IF(cal!$X$4=2,\" in\"))&\" \"&$R$16&\" \"&ROUND(cal!AA58,1)&IF(cal!$X$4=1,\" cm\",IF(cal!$X$4=2,\" in\"))&\" \"&$R$17&\" \"&ROUND(cal!AC58,1)&IF(cal!$X$4=1,\" cm\",IF(cal!$X$4=2,\" in\"))&\" (Type 7)\"","v":"Micro Canal height 0 cm width 0 cm length 0 cm (Type 7)"}]
[]
[]
[]
[]
[]
[{"$f":"cal!$Z$1&\" \"&$R$15&\" \"&ROUND(cal!Y64,1)&IF(cal!$X$4=1,\" cm\",IF(cal!$X$4=2,\" in\"))&\" \"&$R$16&\" \"&ROUND(cal!AA64,1)&IF(cal!$X$4=1,\" cm\",IF(cal!$X$4=2,\" in\"))&\" \"&$R$17&\" \"&ROUND(cal!AC64,1)&IF(cal!$X$4=1,\" cm\",IF(cal!$X$4=2,\" in\"))&\" (Type 8)\"","v":"Micro Canal height 0 cm width 0 cm length 0 cm (Type 8)"}]
[]
[]
[]
[]
[]
[{"$f":"cal!$Z$1&\" \"&$R$15&\" \"&ROUND(cal!Y70,1)&IF(cal!$X$4=1,\" cm\",IF(cal!$X$4=2,\" in\"))&\" \"&$R$16&\" \"&ROUND(cal!AA70,1)&IF(cal!$X$4=1,\" cm\",IF(cal!$X$4=2,\" in\"))&\" \"&$R$17&\" \"&ROUND(cal!AC70,1)&IF(cal!$X$4=1,\" cm\",IF(cal!$X$4=2,\" in\"))&\" (Type 9)\"","v":"Micro Canal height 0 cm width 0 cm length 0 cm (Type 9)"}]
[]
[]
[]
[]
[]
["*Values according to EN 16430",null,null,null,null,null,null,null,null,null,null,null,{"$f":"cal!N70","v":"v2022-06-01"}]
["**Sound power according to ISO 3741:2010"]
["***Sound pressure with an assumed room damping of 8dB(A)"]