{"text_format":"1","workbook":"xlsx","n_sheets":13,"sheets":["Briza Net Zero","cal","NL","EN","DE","FR","NR","SP","SW","TS","ExtraTaal1","ExtraTaal2","ExtraTaal3"],"not_rendered":{"charts":0,"images":4,"macros":1,"external_links":0,"defined_names":10,"comments":1,"pivot_tables":0},"unopened":[],"bounds":{"document_bytes":16777216,"sheet_cells":100000,"rows_first":2000,"rows_last":500,"rows_between":2000,"halvings":0,"cell_chars":16384,"cell_head_chars":4096},"cells_cut":0,"cells_raw":0,"read":"whole","date_system":"1900"}

{"sheet":"Briza Net Zero","index":0,"n_rows":40,"n_cols":16,"rows_kept":40,"cut":false,"hidden":false,"merged":[[0,14,1,15],[2,14,2,15],[6,12,6,13],[1,10,1,11],[3,10,3,12],[3,13,3,15],[5,12,5,13],[1,6,1,9],[3,6,3,9],[7,1,7,3],[7,6,7,9],[7,12,7,13],[2,1,2,2],[1,1,1,2],[14,1,14,13],[20,1,20,13],[26,1,26,13],[32,1,32,13],[9,1,9,3],[9,6,9,9],[8,12,11,13],[8,1,8,3],[8,6,8,9],[10,6,10,9]]}
[]
[null,"Selectiontool",null,null,null,null,"Taal/Language/Sprache/Språk/Jazyk",0,0,0,"English"]
[null,"Briza Net Zero "]
[null,null,null,null,null,null,{"$f":"IF(cal!$S$7=1,\"Uitvoering\",IF(cal!$S$7=2,\"Version\",IF(cal!$S$7=3,\"Ausführung\",IF(cal!$S$7=4,\"Version\",IF(cal!$S$7=5,\"Modell\",IF(cal!$S$7=6,\"Montaje\",IF(cal!$S$7=7,\"Version\",IF(cal!$S$7=8,\"Verze\",IF(cal!$S$7=9,\"ExtraTaal1\",IF(cal!$S$7=10,\"ExtraTaal2\",IF(cal!$S$7=11,\"ExtraTaal3\",)))))))))))","v":"Version"},null,null,null,"Briza Net Zero S",null,null,"Wall"]
[]
[null,{"$f":"cal!B7","v":"Temperatures"},null,null,null,null,null,null,null,null,null,null,{"$f":"cal!M7","v":"h_atm"},0]
[null,{"$f":"cal!B8","v":"Heating:"},null,null,null,null,{"$f":"cal!G8","v":"Cooling:"},null,null,null,null,null,0,0,{"$f":"IF(UnitsNo=1,\"m\",IF(UnitsNo=2,\"ft\"))","v":"m"}]
[null,{"$f":"cal!B9","v":"Supply water"},{"$f":"cal!C9","v":0},{"$f":"cal!D9","v":0},45,{"$f":"cal!F9","v":"°C"},{"$f":"cal!G9","v":"Supply water"},{"$f":"cal!H9","v":0},{"$f":"cal!I9","v":0},{"$f":"cal!J9","v":0},15.999999999999998,{"$f":"cal!L9","v":"°C"},{"$f":"cal!M9","v":"Unit conversion"}]
[null,{"$f":"cal!B10","v":"Return water"},{"$f":"cal!C10","v":0},{"$f":"cal!D10","v":0},35,{"$f":"cal!F10","v":"°C"},{"$f":"cal!G10","v":"Return water"},{"$f":"cal!H10","v":0},{"$f":"cal!I10","v":0},{"$f":"cal!J10","v":0},18.222222222222221,{"$f":"cal!L10","v":"°C"}]
[null,{"$f":"cal!B11","v":"Entering air"},{"$f":"cal!C11","v":0},{"$f":"cal!D11","v":0},20,{"$f":"cal!F11","v":"°C"},{"$f":"cal!G11","v":"Entering air"},{"$f":"cal!H11","v":0},{"$f":"cal!I11","v":0},{"$f":"cal!J11","v":0},26.999999999999996,{"$f":"cal!L11","v":"°C"}]
[null,null,null,null,null,null,{"$f":"cal!G12","v":"Relative humidity"},null,null,null,0.5]
[]
[null,null,null,{"$f":"cal!D14","v":1},{"$f":"cal!E14","v":1},{"$f":"cal!F14","v":1},{"$f":"cal!G14","v":1},{"$f":"cal!H14","v":1},{"$f":"cal!I14","v":1},{"$f":"cal!J14","v":1},{"$f":"cal!K14","v":3.3444444444444401E-4},{"$f":"cal!L14","v":0},{"$f":"cal!M14","v":1},{"$f":"cal!N14","v":1}]
[null,{"$f":"cal!B15","v":"Speed level"},{"$f":"cal!C15","v":"Control voltage [V]"},{"$f":"cal!D15","v":"Heat output  45/35/20 [W]"},{"$f":"cal!E15","v":"Water flowrate, heating [l/h]"},{"$f":"cal!F15","v":"Watersided pressure loss [kPa]"},{"$f":"cal!G15","v":"Sens. cooling capacity  16/18/27 [W]"},{"$f":"cal!H15","v":"Tot. cooling capacity 16/18/27 [W]"},{"$f":"cal!I15","v":"Water flowrate, cooling [l/h]"},{"$f":"cal!J15","v":"Watersided pressure loss [kPa]"},{"$f":"cal!K15","v":"Sound pressure ** [dB(A)]"},{"$f":"cal!L15","v":"Sound power * [dB(A)]"},{"$f":"cal!M15","v":"Electrical power [W]"},{"$f":"cal!N15","v":"Air flowrate [m³/h]"},null,{"$f":"cal!P15","v":"Air exhaust temp. cooling  [°C]"}]
[null,{"$f":"cal!B16","v":"Briza Net Zero S height 55,8 cm width 11 cm length 75 cm (Type 1)"}]
[null,{"$f":"cal!B17","v":0.2},{"$f":"cal!C17","v":2},{"$f":"IF($E$8<=$E$9,cal!$Z$3,cal!D17)","v":76.234447489331004},{"$f":"IF($E$8<=$E$9,\"\",cal!E17)","v":7},{"$f":"IF($E$8<=$E$9,\"\",cal!F17)","v":0.01},{"$f":"IF($K$8>=$K$9,cal!$Z$3,cal!G17)","v":27.188896114947411},{"$f":"IF($K$8>=$K$9,\"\",cal!H17)","v":27.188896114947411},{"$f":"IF($K$8>=$K$9,\"\",cal!I17)","v":11},{"$f":"IF($K$8>=$K$9,\"\",cal!J17)","v":0.01},{"$f":"cal!K17","v":"<20"},{"$f":"cal!L17","v":25},{"$f":"cal!M17","v":1},{"$f":"cal!N17","v":32},null,{"$f":"IF($K$8>=$K$9,\"\",cal!P17)","v":24.474661323643197}]
[null,{"$f":"cal!B18","v":0.4},{"$f":"cal!C18","v":4},{"$f":"IF($E$8<=$E$9,cal!$Z$4,cal!D18)","v":295.37886453387819},{"$f":"IF($E$8<=$E$9,\"\",cal!E18)","v":25},{"$f":"IF($E$8<=$E$9,\"\",cal!F18)","v":2.9374999999999821E-2},{"$f":"IF($K$8>=$K$9,cal!$Z$5,cal!G18)","v":149.15679843682747},{"$f":"IF($K$8>=$K$9,\"\",cal!H18)","v":149.15679843682747},{"$f":"IF($K$8>=$K$9,\"\",cal!I18)","v":58},{"$f":"IF($K$8>=$K$9,\"\",cal!J18)","v":0.15810799999999903},{"$f":"cal!K18","v":23.5},{"$f":"cal!L18","v":31.5},{"$f":"cal!M18","v":1.4},{"$f":"cal!N18","v":63},null,{"$f":"IF($K$8>=$K$9,\"\",cal!P18)","v":19.963113656134965}]
[null,{"$f":"cal!B19","v":0.6},{"$f":"cal!C19","v":6},{"$f":"IF($E$8<=$E$9,\"\",cal!D19)","v":482.18475559167626},{"$f":"IF($E$8<=$E$9,\"\",cal!E19)","v":41},{"$f":"IF($E$8<=$E$9,\"\",cal!F19)","v":7.9006999999999522E-2},{"$f":"IF($K$8>=$K$9,\"\",cal!G19)","v":247.43291632072007},{"$f":"IF($K$8>=$K$9,\"\",cal!H19)","v":247.43291632072007},{"$f":"IF($K$8>=$K$9,\"\",cal!I19)","v":96},{"$f":"IF($K$8>=$K$9,\"\",cal!J19)","v":0.43315199999999732},{"$f":"cal!K19","v":28.5},{"$f":"cal!L19","v":36.5},{"$f":"cal!M19","v":2.4},{"$f":"cal!N19","v":95},null,{"$f":"IF($K$8>=$K$9,\"\",cal!P19)","v":19.258735584789967}]
[null,{"$f":"cal!B20","v":0.8},{"$f":"cal!C20","v":8},{"$f":"IF($E$8<=$E$9,\"\",cal!D20)","v":636.53543303018887},{"$f":"IF($E$8<=$E$9,\"\",cal!E20)","v":55},{"$f":"IF($E$8<=$E$9,\"\",cal!F20)","v":0.14217499999999914},{"$f":"IF($K$8>=$K$9,\"\",cal!G20)","v":321.68667321442121},{"$f":"IF($K$8>=$K$9,\"\",cal!H20)","v":321.68667321442121},{"$f":"IF($K$8>=$K$9,\"\",cal!I20)","v":124},{"$f":"IF($K$8>=$K$9,\"\",cal!J20)","v":0.72267199999999554},{"$f":"cal!K20","v":35},{"$f":"cal!L20","v":43},{"$f":"cal!M20","v":3.8},{"$f":"cal!N20","v":123},null,{"$f":"IF($K$8>=$K$9,\"\",cal!P20)","v":19.22668994022845}]
[null,{"$f":"cal!B21","v":1},{"$f":"cal!C21","v":10},{"$f":"IF($E$8<=$E$9,\"\",cal!D21)","v":758.35674826722777},{"$f":"IF($E$8<=$E$9,\"\",cal!E21)","v":65},{"$f":"IF($E$8<=$E$9,\"\",cal!F21)","v":0.19857499999999881},{"$f":"IF($K$8>=$K$9,\"\",cal!G21)","v":371.4713918809756},{"$f":"IF($K$8>=$K$9,\"\",cal!H21)","v":371.4713918809756},{"$f":"IF($K$8>=$K$9,\"\",cal!I21)","v":144},{"$f":"IF($K$8>=$K$9,\"\",cal!J21)","v":0.9745919999999938},{"$f":"cal!K21","v":40.5},{"$f":"cal!L21","v":48.5},{"$f":"cal!M21","v":6.5},{"$f":"cal!N21","v":160},null,{"$f":"IF($K$8>=$K$9,\"\",cal!P21)","v":20.09945450443356}]
[null,{"$f":"cal!B22","v":"Briza Net Zero S height 55,8 cm width 11 cm length 110 cm (Type 2)"}]
[null,{"$f":"cal!B23","v":0.2},{"$f":"cal!C23","v":2},{"$f":"IF($E$8<=$E$9,cal!$Z$3,cal!D23)","v":152.4292863836942},{"$f":"IF($E$8<=$E$9,\"\",cal!E23)","v":13},{"$f":"IF($E$8<=$E$9,\"\",cal!F23)","v":1.0832899999999965E-2},{"$f":"IF($K$8>=$K$9,cal!$Z$3,cal!G23)","v":54.428252795029167},{"$f":"IF($K$8>=$K$9,\"\",cal!H23)","v":54.428252795029167},{"$f":"IF($K$8>=$K$9,\"\",cal!I23)","v":21},{"$f":"IF($K$8>=$K$9,\"\",cal!J23)","v":2.8268099999999911E-2},{"$f":"cal!K23","v":22},{"$f":"cal!L23","v":30},{"$f":"cal!M23","v":1.1000000000000001},{"$f":"cal!N23","v":55},null,{"$f":"IF($K$8>=$K$9,\"\",cal!P23)","v":24.058697196733441}]
[null,{"$f":"cal!B24","v":0.4},{"$f":"cal!C24","v":4},{"$f":"IF($E$8<=$E$9,cal!$Z$4,cal!D24)","v":590.83879287855223},{"$f":"IF($E$8<=$E$9,\"\",cal!E24)","v":51},{"$f":"IF($E$8<=$E$9,\"\",cal!F24)","v":0.16672409999999943},{"$f":"IF($K$8>=$K$9,cal!$Z$5,cal!G24)","v":298.54767325287094},{"$f":"IF($K$8>=$K$9,\"\",cal!H24)","v":298.54767325287094},{"$f":"IF($K$8>=$K$9,\"\",cal!I24)","v":116},{"$f":"IF($K$8>=$K$9,\"\",cal!J24)","v":0.86252959999999712},{"$f":"cal!K24","v":30},{"$f":"cal!L24","v":38},{"$f":"cal!M24","v":1.9},{"$f":"cal!N24","v":100},null,{"$f":"IF($K$8>=$K$9,\"\",cal!P24)","v":18.126565988534431}]
[null,{"$f":"cal!B25","v":0.6},{"$f":"cal!C25","v":6},{"$f":"IF($E$8<=$E$9,\"\",cal!D25)","v":964.3736908289485},{"$f":"IF($E$8<=$E$9,\"\",cal!E25)","v":83},{"$f":"IF($E$8<=$E$9,\"\",cal!F25)","v":0.44158489999999867},{"$f":"IF($K$8>=$K$9,\"\",cal!G25)","v":494.93477068487698},{"$f":"IF($K$8>=$K$9,\"\",cal!H25)","v":494.93477068487698},{"$f":"IF($K$8>=$K$9,\"\",cal!I25)","v":192},{"$f":"IF($K$8>=$K$9,\"\",cal!J25)","v":2.3629823999999924},{"$f":"cal!K25","v":35.5},{"$f":"cal!L25","v":43.5},{"$f":"cal!M25","v":4.0999999999999996},{"$f":"cal!N25","v":170},null,{"$f":"IF($K$8>=$K$9,\"\",cal!P25)","v":18.346793314446135}]
[null,{"$f":"cal!B26","v":0.8},{"$f":"cal!C26","v":8},{"$f":"IF($E$8<=$E$9,\"\",cal!D26)","v":1273.0142673567282},{"$f":"IF($E$8<=$E$9,\"\",cal!E26)","v":109},{"$f":"IF($E$8<=$E$9,\"\",cal!F26)","v":0.76157209999999753},{"$f":"IF($K$8>=$K$9,\"\",cal!G26)","v":643.2800869373558},{"$f":"IF($K$8>=$K$9,\"\",cal!H26)","v":643.2800869373558},{"$f":"IF($K$8>=$K$9,\"\",cal!I26)","v":249},{"$f":"IF($K$8>=$K$9,\"\",cal!J26)","v":3.9742640999999872},{"$f":"cal!K26","v":41.5},{"$f":"cal!L26","v":49.5},{"$f":"cal!M26","v":7.7},{"$f":"cal!N26","v":228},null,{"$f":"IF($K$8>=$K$9,\"\",cal!P26)","v":18.614223294556535}]
[null,{"$f":"cal!B27","v":1},{"$f":"cal!C27","v":10},{"$f":"IF($E$8<=$E$9,\"\",cal!D27)","v":1516.7324115641925},{"$f":"IF($E$8<=$E$9,\"\",cal!E27)","v":130},{"$f":"IF($E$8<=$E$9,\"\",cal!F27)","v":1.0832899999999968},{"$f":"IF($K$8>=$K$9,\"\",cal!G27)","v":743.00681218329464},{"$f":"IF($K$8>=$K$9,\"\",cal!H27)","v":743.00681218329464},{"$f":"IF($K$8>=$K$9,\"\",cal!I27)","v":287},{"$f":"IF($K$8>=$K$9,\"\",cal!J27)","v":5.2798528999999821},{"$f":"cal!K27","v":46},{"$f":"cal!L27","v":54},{"$f":"cal!M27","v":13.2},{"$f":"cal!N27","v":281},null,{"$f":"IF($K$8>=$K$9,\"\",cal!P27)","v":19.141050306560086}]
[null,{"$f":"cal!B28","v":"Briza Net Zero S height 55,8 cm width 11 cm length 155 cm (Type 3)"}]
[null,{"$f":"cal!B29","v":0.2},{"$f":"cal!C29","v":2},{"$f":"IF($E$8<=$E$9,cal!$Z$3,cal!D29)","v":239.27515841161488},{"$f":"IF($E$8<=$E$9,\"\",cal!E29)","v":21},{"$f":"IF($E$8<=$E$9,\"\",cal!F29)","v":3.6779399999999803E-2},{"$f":"IF($K$8>=$K$9,cal!$Z$3,cal!G29)","v":85.308970779744428},{"$f":"IF($K$8>=$K$9,\"\",cal!H29)","v":85.308970779744428},{"$f":"IF($K$8>=$K$9,\"\",cal!I29)","v":33},{"$f":"IF($K$8>=$K$9,\"\",cal!J29)","v":9.0822599999999531E-2},{"$f":"cal!K29","v":22.5},{"$f":"cal!L29","v":30.5},{"$f":"cal!M29","v":2},{"$f":"cal!N29","v":56},null,{"$f":"IF($K$8>=$K$9,\"\",cal!P29)","v":22.472226341655208}]
[null,{"$f":"cal!B30","v":0.4},{"$f":"cal!C30","v":4},{"$f":"IF($E$8<=$E$9,cal!$Z$4,cal!D30)","v":927.2106617910033},{"$f":"IF($E$8<=$E$9,\"\",cal!E30)","v":80},{"$f":"IF($E$8<=$E$9,\"\",cal!F30)","v":0.53375999999999713},{"$f":"IF($K$8>=$K$9,cal!$Z$5,cal!G30)","v":468.30913485848373},{"$f":"IF($K$8>=$K$9,\"\",cal!H30)","v":468.30913485848373},{"$f":"IF($K$8>=$K$9,\"\",cal!I30)","v":181},{"$f":"IF($K$8>=$K$9,\"\",cal!J30)","v":2.7322673999999854},{"$f":"cal!K30","v":30},{"$f":"cal!L30","v":38},{"$f":"cal!M30","v":3.4},{"$f":"cal!N30","v":130},null,{"$f":"IF($K$8>=$K$9,\"\",cal!P30)","v":16.293012145053623}]
[null,{"$f":"cal!B31","v":0.6},{"$f":"cal!C31","v":6},{"$f":"IF($E$8<=$E$9,\"\",cal!D31)","v":1513.5360374034033},{"$f":"IF($E$8<=$E$9,\"\",cal!E31)","v":130},{"$f":"IF($E$8<=$E$9,\"\",cal!F31)","v":1.4094599999999924},{"$f":"IF($K$8>=$K$9,\"\",cal!G31)","v":776.69046995967869},{"$f":"IF($K$8>=$K$9,\"\",cal!H31)","v":776.69046995967869},{"$f":"IF($K$8>=$K$9,\"\",cal!I31)","v":301},{"$f":"IF($K$8>=$K$9,\"\",cal!J31)","v":7.5561233999999606},{"$f":"cal!K31","v":36.5},{"$f":"cal!L31","v":44.5},{"$f":"cal!M31","v":6.5},{"$f":"cal!N31","v":227},null,{"$f":"IF($K$8>=$K$9,\"\",cal!P31)","v":16.830487082572667}]
[null,{"$f":"cal!B32","v":0.8},{"$f":"cal!C32","v":8},{"$f":"IF($E$8<=$E$9,\"\",cal!D32)","v":1997.974424539804},{"$f":"IF($E$8<=$E$9,\"\",cal!E32)","v":172},{"$f":"IF($E$8<=$E$9,\"\",cal!F32)","v":2.4673055999999867},{"$f":"IF($K$8>=$K$9,\"\",cal!G32)","v":1009.637638819612},{"$f":"IF($K$8>=$K$9,\"\",cal!H32)","v":1009.637638819612},{"$f":"IF($K$8>=$K$9,\"\",cal!I32)","v":391},{"$f":"IF($K$8>=$K$9,\"\",cal!J32)","v":12.750275399999932},{"$f":"cal!K32","v":42.5},{"$f":"cal!L32","v":50.5},{"$f":"cal!M32","v":11.5},{"$f":"cal!N32","v":331},null,{"$f":"IF($K$8>=$K$9,\"\",cal!P32)","v":17.934002982559797}]
[null,{"$f":"cal!B33","v":1},{"$f":"cal!C33","v":10},{"$f":"IF($E$8<=$E$9,\"\",cal!D33)","v":2380.4148250163921},{"$f":"IF($E$8<=$E$9,\"\",cal!E33)","v":205},{"$f":"IF($E$8<=$E$9,\"\",cal!F33)","v":3.5048849999999812},{"$f":"IF($K$8>=$K$9,\"\",cal!G33)","v":1166.0361835426631},{"$f":"IF($K$8>=$K$9,\"\",cal!H33)","v":1166.0361835426631},{"$f":"IF($K$8>=$K$9,\"\",cal!I33)","v":451},{"$f":"IF($K$8>=$K$9,\"\",cal!J33)","v":16.96364339999991},{"$f":"cal!K33","v":48},{"$f":"cal!L33","v":56},{"$f":"cal!M33","v":19.7},{"$f":"cal!N33","v":392},null,{"$f":"IF($K$8>=$K$9,\"\",cal!P33)","v":18.158947012982797}]
[null,{"$f":"cal!B34","v":"Briza Net Zero S height 55,8 cm width 11 cm length 190 cm (Type 4)"}]
[null,{"$f":"cal!B35","v":0.2},{"$f":"cal!C35","v":2},{"$f":"IF($E$8<=$E$9,cal!$Z$3,cal!D35)","v":315.50096472998041},{"$f":"IF($E$8<=$E$9,\"\",cal!E35)","v":27},{"$f":"IF($E$8<=$E$9,\"\",cal!F35)","v":7.3118699999999967E-2},{"$f":"IF($K$8>=$K$9,cal!$Z$3,cal!G35)","v":112.48229895138553},{"$f":"IF($K$8>=$K$9,\"\",cal!H35)","v":112.48229895138553},{"$f":"IF($K$8>=$K$9,\"\",cal!I35)","v":44},{"$f":"IF($K$8>=$K$9,\"\",cal!J35)","v":0.19418079999999993},{"$f":"cal!K35","v":24},{"$f":"cal!L35","v":32},{"$f":"cal!M35","v":2.1},{"$f":"cal!N35","v":60},null,{"$f":"IF($K$8>=$K$9,\"\",cal!P35)","v":21.428001808845313}]
[null,{"$f":"cal!B36","v":0.4},{"$f":"cal!C36","v":4},{"$f":"IF($E$8<=$E$9,cal!$Z$4,cal!D36)","v":1222.6208945391088},{"$f":"IF($E$8<=$E$9,\"\",cal!E36)","v":105},{"$f":"IF($E$8<=$E$9,\"\",cal!F36)","v":1.1058074999999996},{"$f":"IF($K$8>=$K$9,cal!$Z$5,cal!G36)","v":617.52393346788472},{"$f":"IF($K$8>=$K$9,\"\",cal!H36)","v":617.52393346788472},{"$f":"IF($K$8>=$K$9,\"\",cal!I36)","v":239},{"$f":"IF($K$8>=$K$9,\"\",cal!J36)","v":5.7292362999999984},{"$f":"cal!K36","v":31},{"$f":"cal!L36","v":39},{"$f":"cal!M36","v":3.8},{"$f":"cal!N36","v":176},null,{"$f":"IF($K$8>=$K$9,\"\",cal!P36)","v":16.571564494768456}]
[null,{"$f":"cal!B37","v":0.6},{"$f":"cal!C37","v":6},{"$f":"IF($E$8<=$E$9,\"\",cal!D37)","v":1995.7186295037375},{"$f":"IF($E$8<=$E$9,\"\",cal!E37)","v":172},{"$f":"IF($E$8<=$E$9,\"\",cal!F37)","v":2.9672751999999991},{"$f":"IF($K$8>=$K$9,\"\",cal!G37)","v":1024.1361147388939},{"$f":"IF($K$8>=$K$9,\"\",cal!H37)","v":1024.1361147388939},{"$f":"IF($K$8>=$K$9,\"\",cal!I37)","v":396},{"$f":"IF($K$8>=$K$9,\"\",cal!J37)","v":15.728644799999996},{"$f":"cal!K37","v":37.5},{"$f":"cal!L37","v":45.5},{"$f":"cal!M37","v":8.1999999999999993},{"$f":"cal!N37","v":299},null,{"$f":"IF($K$8>=$K$9,\"\",cal!P37)","v":16.819607413961258}]
[null,{"$f":"cal!B38","v":0.8},{"$f":"cal!C38","v":8},{"$f":"IF($E$8<=$E$9,\"\",cal!D38)","v":2634.497108023611},{"$f":"IF($E$8<=$E$9,\"\",cal!E38)","v":227},{"$f":"IF($E$8<=$E$9,\"\",cal!F38)","v":5.1683586999999989},{"$f":"IF($K$8>=$K$9,\"\",cal!G38)","v":1331.2774852534549},{"$f":"IF($K$8>=$K$9,\"\",cal!H38)","v":1331.2774852534549},{"$f":"IF($K$8>=$K$9,\"\",cal!I38)","v":515},{"$f":"IF($K$8>=$K$9,\"\",cal!J38)","v":26.602067499999993},{"$f":"cal!K38","v":44},{"$f":"cal!L38","v":52},{"$f":"cal!M38","v":15.4},{"$f":"cal!N38","v":403},null,{"$f":"IF($K$8>=$K$9,\"\",cal!P38)","v":17.181580715716322}]
[null,{"$f":"cal!B39","v":1},{"$f":"cal!C39","v":10},{"$f":"IF($E$8<=$E$9,\"\",cal!D39)","v":3138.7754097535849},{"$f":"IF($E$8<=$E$9,\"\",cal!E39)","v":270},{"$f":"IF($E$8<=$E$9,\"\",cal!F39)","v":7.3118699999999981},{"$f":"IF($K$8>=$K$9,\"\",cal!G39)","v":1537.5212119279431},{"$f":"IF($K$8>=$K$9,\"\",cal!H39)","v":1537.5212119279431},{"$f":"IF($K$8>=$K$9,\"\",cal!I39)","v":595},{"$f":"IF($K$8>=$K$9,\"\",cal!J39)","v":35.508707499999986},{"$f":"cal!K39","v":49},{"$f":"cal!L39","v":57},{"$f":"cal!M39","v":26.4},{"$f":"cal!N39","v":503},null,{"$f":"IF($K$8>=$K$9,\"\",cal!P39)","v":17.914869621034249}]
[null,{"$f":"cal!B46","v":"*Sound power according to ISO 3741:2010"},null,null,null,null,null,null,null,null,null,null,null,"v2024-02-29",null,{"$f":"cal!P46","v":"v2023-10-02"}]
[null,{"$f":"cal!B47","v":"**Sound pressure with an assumed room damping of 8dB(A)"}]

{"sheet":"cal","index":1,"n_rows":47,"n_cols":86,"rows_kept":47,"cut":false,"hidden":true,"merged":[[39,1,39,15],[21,1,21,15],[27,1,27,15],[33,1,33,15],[2,6,2,9],[8,1,8,3],[8,6,8,9],[9,1,9,3],[9,6,9,9],[4,6,4,9],[6,12,6,13],[7,12,7,13],[15,1,15,15],[10,1,10,3],[10,6,10,9],[8,12,8,13],[15,79,15,85],[15,22,15,28],[15,30,15,36],[15,37,15,43],[15,44,15,50],[15,51,15,57],[15,58,15,64],[15,65,15,71],[15,72,15,78]]}
[null,null,null,null,"Nederlands","English","Deutsch","Français","Norsk","Español","Svenska","Čeština","ExtraTaal1","ExtraTaal2","ExtraTaal3",null,null,null,null,null,null,null,null,{"$f":"'Briza Net Zero'!K4:M4","v":"Briza Net Zero S"},0,0,{"$f":"IF('Briza Net Zero'!$K$4=cal!$X2,1,IF('Briza Net Zero'!$K$4=cal!$X3,1,IF('Briza Net Zero'!$K$4=cal!$X4,2,IF('Briza Net Zero'!$K$4=cal!$X5,2,IF('Briza Net Zero'!$K$4=cal!$X6,2,IF('Briza Net Zero'!$K$4=cal!$X7,2,IF('Briza Net Zero'!$K$4=cal!$X8,7,IF('Briza Net Zero'!$K$4=cal!$X9,8,))))))))","v":1},null,null,null,null,null,null,{"$f":"'Briza Net Zero'!K2","v":"English"},{"$f":"'Briza Net Zero'!N4","v":"Wall"},null,null,"Briza xs",null,"Briza s",null,"Briza M 42",null,"Briza M 56"]
[null,null,null,null,null,null,null,null,null,null,null,null,null,null,null,null,null,null,null,null,null,null,null,"Briza Net Zero XS",null,null,null,null,null,null,null,null,null,{"$f":"IF(AH$1=\"English\",\"Wall\",IF(AH$1=\"Nederlands\",\"Wand\",IF(AH$1=\"Deutch\",\"Wand\",IF(AH$1=\"Français\",\"Mur\",IF(AH$1=\"Norsk\",\"Vegg\",IF(AH$1=\"Español\",\"Muro\",IF(AH$1=\"Svenska\",\"Vägg\",IF(AH$1=\"Čeština\",\"Stěna\",\"Error\"))))))))","v":"Wall"},null,null,null,"wall","ceiling","wall","ceiling","wall","ceiling","wall","ceiling"]
[null,{"$f":"IF($S$7=1,NL!B3,IF(cal!$S$7=2,EN!B3,IF(cal!$S$7=3,DE!B3,IF(cal!$S$7=4,FR!B3,IF(cal!$S$7=5,NR!B3,IF(cal!$S$7=6,SP!B3,IF(cal!$S$7=7,SW!B3,IF(cal!$S$7=8,TS!B3,IF(cal!$S$7=9,ExtraTaal1!B3,IF(cal!$S$7=10,ExtraTaal2!B3,IF(cal!$S$7=11,ExtraTaal3!B3,)))))))))))","v":"Formulary"},null,null,null,null,null,null,null,null,null,null,null,null,null,null,null,null,null,null,null,null,null,"Briza Net Zero S",null,{"$f":"IF($S$7=1,NL!R16,IF(cal!$S$7=2,EN!R16,IF(cal!$S$7=3,DE!R16,IF(cal!$S$7=4,FR!R16,IF(cal!$S$7=5,NR!R16,IF(cal!$S$7=6,SP!R16,IF(cal!$S$7=7,SW!R16,IF(cal!$S$7=8,TS!R16,IF(cal!$S$7=9,ExtraTaal1!R16,IF(cal!$S$7=10,ExtraTaal2!R16,IF(cal!$S$7=11,ExtraTaal3!R16,)))))))))))","v":"Temp."},{"$f":"IF($S$7=1,NL!Q7,IF(cal!$S$7=2,EN!Q7,IF(cal!$S$7=3,DE!Q7,IF(cal!$S$7=4,FR!Q7,IF(cal!$S$7=5,NR!Q7,IF(cal!$S$7=6,SP!Q7,IF(cal!$S$7=7,SW!Q7,IF(cal!$S$7=8,TS!Q7,IF(cal!$S$7=9,ExtraTaal1!Q7,IF(cal!$S$7=10,ExtraTaal2!Q7,IF(cal!$S$7=11,ExtraTaal3!Q7,)))))))))))","v":"Copy all data"},null,null,null,null,null,null,{"$f":"IF(AH$1=\"English\",\"Ceiling\",IF(AH$1=\"Nederlands\",\"Plafond\",IF(AH$1=\"Deutch\",\"Decke\",IF(AH$1=\"Français\",\"Plafond\",IF(AH$1=\"Norsk\",\"Tak\",IF(AH$1=\"Español\",\"Techo\",IF(AH$1=\"Svenska\",\"Tak\",IF(AH$1=\"Čeština\",\"Strop\",\"Error\"))))))))","v":"Ceiling"},null,null,"dikte",8.5,8.5,11,11.5,14,16,14,16]
[null,null,null,null,null,null,null,null,null,null,null,null,null,null,null,null,null,null,null,null,null,null,1,"Briza Net Zero M H42 2P",null,{"$f":"IF($S$7=1,NL!R17,IF(cal!$S$7=2,EN!R17,IF(cal!$S$7=3,DE!R17,IF(cal!$S$7=4,FR!R17,IF(cal!$S$7=5,NR!R17,IF(cal!$S$7=6,SP!R17,IF(cal!$S$7=7,SW!R17,IF(cal!$S$7=8,TS!R17,IF(cal!$S$7=9,ExtraTaal1!R17,IF(cal!$S$7=10,ExtraTaal2!R17,IF(cal!$S$7=11,ExtraTaal3!R17,)))))))))))","v":"heating!"},{"$f":"IF($S$7=1,NL!Q8,IF(cal!$S$7=2,EN!Q8,IF(cal!$S$7=3,DE!Q8,IF(cal!$S$7=4,FR!Q8,IF(cal!$S$7=5,NR!Q8,IF(cal!$S$7=6,SP!Q8,IF(cal!$S$7=7,SW!Q8,IF(cal!$S$7=8,TS!Q8,IF(cal!$S$7=9,ExtraTaal1!Q8,IF(cal!$S$7=10,ExtraTaal2!Q8,IF(cal!$S$7=11,ExtraTaal3!Q8,)))))))))))","v":"SI-units"},null,null,null,null,null,null,null,null,null,"hoogte",52.1,53.4,55.8,58.9,42,42,56,56]
[null,{"$f":"IF($S$7=1,NL!B5,IF(cal!$S$7=2,EN!B5,IF(cal!$S$7=3,DE!B5,IF(cal!$S$7=4,FR!B5,IF(cal!$S$7=5,NR!B5,IF(cal!$S$7=6,SP!B5,IF(cal!$S$7=7,SW!B5,IF(cal!$S$7=8,TS!B5,IF(cal!$S$7=9,ExtraTaal1!B5,IF(cal!$S$7=10,ExtraTaal2!B5,IF(cal!$S$7=11,ExtraTaal3!B5,)))))))))))","v":"Conditions"},null,null,null,null,null,null,null,null,null,null,null,null,null,null,null,null,null,null,null,null,null,"Briza Net Zero M H42 4P",null,{"$f":"IF($S$7=1,NL!R18,IF(cal!$S$7=2,EN!R18,IF(cal!$S$7=3,DE!R18,IF(cal!$S$7=4,FR!R18,IF(cal!$S$7=5,NR!R18,IF(cal!$S$7=6,SP!R18,IF(cal!$S$7=7,SW!R18,IF(cal!$S$7=8,TS!R18,IF(cal!$S$7=9,ExtraTaal1!R18,IF(cal!$S$7=10,ExtraTaal2!R18,IF(cal!$S$7=11,ExtraTaal3!R18,)))))))))))","v":"cooling!"},{"$f":"IF($S$7=1,NL!Q9,IF(cal!$S$7=2,EN!Q9,IF(cal!$S$7=3,DE!Q9,IF(cal!$S$7=4,FR!Q9,IF(cal!$S$7=5,NR!Q9,IF(cal!$S$7=6,SP!Q9,IF(cal!$S$7=7,SW!Q9,IF(cal!$S$7=8,TS!Q9,IF(cal!$S$7=9,ExtraTaal1!Q9,IF(cal!$S$7=10,ExtraTaal2!Q9,IF(cal!$S$7=11,ExtraTaal3!Q9,)))))))))))","v":"Imperial-units"},null,null,null,null,null,null,null,null,"lengte","T1",86,86,75,90,75,75,75,75]
[null,null,null,null,null,null,null,null,null,null,null,null,null,null,null,null,null,null,null,null,null,null,null,"Briza Net Zero M H56 2P",null,null,null,null,null,null,null,null,null,null,null,null,"T2",122,122,110,125,95,95,95,95]
[null,{"$f":"IF($S$7=1,NL!B7,IF(cal!$S$7=2,EN!B7,IF(cal!$S$7=3,DE!B7,IF(cal!$S$7=4,FR!B7,IF(cal!$S$7=5,NR!B7,IF(cal!$S$7=6,SP!B7,IF(cal!$S$7=7,SW!B7,IF(cal!$S$7=8,TS!B7,IF(cal!$S$7=9,ExtraTaal1!B7,IF(cal!$S$7=10,ExtraTaal2!B7,IF(cal!$S$7=11,ExtraTaal3!B7,)))))))))))","v":"Temperatures"},null,null,null,null,null,null,null,null,null,null,{"$f":"IF($S$7=8,\"Výška umístění\",\"h_atm\")","v":"h_atm"},null,null,null,null,null,{"$f":"IF('Briza Net Zero'!$K$2=cal!$E$1,1,IF('Briza Net Zero'!$K$2=cal!$F$1,2,IF('Briza Net Zero'!$K$2=cal!G1,3,IF('Briza Net Zero'!$K$2=cal!H1,4,IF('Briza Net Zero'!$K$2=cal!I1,5,IF('Briza Net Zero'!$K$2=cal!J1,6,IF('Briza Net Zero'!$K$2=cal!K1,7,IF('Briza Net Zero'!$K$2=cal!L1,8,IF('Briza Net Zero'!$K$2=cal!M1,9,IF('Briza Net Zero'!$K$2=cal!N1,10,IF('Briza Net Zero'!$K$2=cal!O1,11,)))))))))))","v":2},null,null,null,null,"Briza Net Zero M H56 4P",null,null,null,null,null,null,null,null,null,null,null,null,"T3",163,163,155,170,125,125,125,125]
[null,{"$f":"IF($S$7=1,NL!B8,IF(cal!$S$7=2,EN!B8,IF(cal!$S$7=3,DE!B8,IF(cal!$S$7=4,FR!B8,IF(cal!$S$7=5,NR!B8,IF(cal!$S$7=6,SP!B8,IF(cal!$S$7=7,SW!B8,IF(cal!$S$7=8,TS!B8,IF(cal!$S$7=9,ExtraTaal1!B8,IF(cal!$S$7=10,ExtraTaal2!B8,IF(cal!$S$7=11,ExtraTaal3!B8,)))))))))))","v":"Heating:"},null,null,null,null,{"$f":"IF($S$7=1,NL!G8,IF(cal!$S$7=2,EN!G8,IF(cal!$S$7=3,DE!G8,IF(cal!$S$7=4,FR!G8,IF(cal!$S$7=5,NR!G8,IF(cal!$S$7=6,SP!G8,IF(cal!$S$7=7,SW!G8,IF(cal!$S$7=8,TS!G8,IF(cal!$S$7=9,ExtraTaal1!G8,IF(cal!$S$7=10,ExtraTaal2!G8,IF(cal!$S$7=11,ExtraTaal3!G8,)))))))))))","v":"Cooling:"},null,null,null,null,null,{"$f":"'Briza Net Zero'!M7","v":0},{"$f":"'Briza Net Zero'!N7","v":0},null,null,null,null,"Temp",null,null,null,"Temp","Briza 12 H55 2P casing",null,null,null,null,null,null,null,null,null,null,null,null,"T4",199,199,190,205,145,145,145,145]
[null,{"$f":"IF($S$7=1,NL!B9,IF(cal!$S$7=2,EN!B9,IF(cal!$S$7=3,DE!B9,IF(cal!$S$7=4,FR!B9,IF(cal!$S$7=5,NR!B9,IF(cal!$S$7=6,SP!B9,IF(cal!$S$7=7,SW!B9,IF(cal!$S$7=8,TS!B9,IF(cal!$S$7=9,ExtraTaal1!B9,IF(cal!$S$7=10,ExtraTaal2!B9,IF(cal!$S$7=11,ExtraTaal3!B9,)))))))))))","v":"Supply water"},{"$f":"IF($S$7=1,NL!C9,IF(cal!$S$7=2,EN!C9,IF(cal!$S$7=3,DE!C9,IF(cal!$S$7=4,FR!C9,IF(cal!$S$7=5,NR!C9,IF(cal!$S$7=6,SP!C9,IF(cal!$S$7=7,SW!C9,IF(cal!$S$7=8,TS!C9,IF(cal!$S$7=9,ExtraTaal1!C9,IF(cal!$S$7=10,ExtraTaal2!C9,IF(cal!$S$7=11,ExtraTaal3!C9,)))))))))))","v":0},{"$f":"IF($S$7=1,NL!D9,IF(cal!$S$7=2,EN!D9,IF(cal!$S$7=3,DE!D9,IF(cal!$S$7=4,FR!D9,IF(cal!$S$7=5,NR!D9,IF(cal!$S$7=6,SP!D9,IF(cal!$S$7=7,SW!D9,IF(cal!$S$7=8,TS!D9,IF(cal!$S$7=9,ExtraTaal1!D9,IF(cal!$S$7=10,ExtraTaal2!D9,IF(cal!$S$7=11,ExtraTaal3!D9,)))))))))))","v":0},{"$f":"'Briza Net Zero'!E8","v":45},{"$f":"IF($W$4=1,\"°C\",IF($W$4=2,\"°F\",))","v":"°C"},{"$f":"B9","v":"Supply water"},{"$f":"IF($S$7=1,NL!H9,IF(cal!$S$7=2,EN!H9,IF(cal!$S$7=3,DE!H9,IF(cal!$S$7=4,FR!H9,))))","v":0},{"$f":"IF($S$7=1,NL!I9,IF(cal!$S$7=2,EN!I9,IF(cal!$S$7=3,DE!I9,IF(cal!$S$7=4,FR!I9,))))","v":0},{"$f":"IF($S$7=1,NL!J9,IF(cal!$S$7=2,EN!J9,IF(cal!$S$7=3,DE!J9,IF(cal!$S$7=4,FR!J9,))))","v":0},{"$f":"'Briza Net Zero'!K8","v":15.999999999999998},{"$f":"F9","v":"°C"},{"$f":"IF($S$7=1,NL!M9,IF(cal!$S$7=2,EN!M9,IF(cal!$S$7=3,DE!M9,IF(cal!$S$7=4,FR!M9,IF(cal!$S$7=5,NR!M9,IF(cal!$S$7=6,SP!M9,))))))","v":"Unit conversion"},{"$f":"IF($S$7=1,NL!N9,IF(cal!$S$7=2,EN!N9,IF(cal!$S$7=3,DE!N9,IF(cal!$S$7=4,FR!N9,IF(cal!$S$7=5,#REF!,)))))","v":0},null,null,null,null,{"$f":"IF($W$4=1,E9,IF($W$4=2,(E9-32)/1.8))","v":45},null,null,null,{"$f":"IF($W$4=1,K9,IF($W$4=2,(K9-32)/1.8))","v":15.999999999999998},"Briza 12 H55 4P casing"]
[null,{"$f":"IF($S$7=1,NL!B10,IF(cal!$S$7=2,EN!B10,IF(cal!$S$7=3,DE!B10,IF(cal!$S$7=4,FR!B10,IF(cal!$S$7=5,NR!B10,IF(cal!$S$7=6,SP!B10,IF(cal!$S$7=7,SW!B10,IF(cal!$S$7=8,TS!B10,IF(cal!$S$7=9,ExtraTaal1!B10,IF(cal!$S$7=10,ExtraTaal2!B10,IF(cal!$S$7=11,ExtraTaal3!B10,)))))))))))","v":"Return water"},{"$f":"IF($S$7=1,NL!C10,IF(cal!$S$7=2,EN!C10,IF(cal!$S$7=3,DE!C10,IF(cal!$S$7=4,FR!C10,IF(cal!$S$7=5,NR!C10,IF(cal!$S$7=6,SP!C10,IF(cal!$S$7=7,SW!C10,IF(cal!$S$7=8,TS!C10,IF(cal!$S$7=9,ExtraTaal1!C10,IF(cal!$S$7=10,ExtraTaal2!C10,IF(cal!$S$7=11,ExtraTaal3!C10,)))))))))))","v":0},{"$f":"IF($S$7=1,NL!D10,IF(cal!$S$7=2,EN!D10,IF(cal!$S$7=3,DE!D10,IF(cal!$S$7=4,FR!D10,IF(cal!$S$7=5,NR!D10,IF(cal!$S$7=6,SP!D10,IF(cal!$S$7=7,SW!D10,IF(cal!$S$7=8,TS!D10,IF(cal!$S$7=9,ExtraTaal1!D10,IF(cal!$S$7=10,ExtraTaal2!D10,IF(cal!$S$7=11,ExtraTaal3!D10,)))))))))))","v":0},{"$f":"'Briza Net Zero'!E9","v":35},{"$f":"F9","v":"°C"},{"$f":"B10","v":"Return water"},{"$f":"IF($S$7=1,NL!H10,IF(cal!$S$7=2,EN!H10,IF(cal!$S$7=3,DE!H10,IF(cal!$S$7=4,FR!H10,))))","v":0},{"$f":"IF($S$7=1,NL!I10,IF(cal!$S$7=2,EN!I10,IF(cal!$S$7=3,DE!I10,IF(cal!$S$7=4,FR!I10,))))","v":0},{"$f":"IF($S$7=1,NL!J10,IF(cal!$S$7=2,EN!J10,IF(cal!$S$7=3,DE!J10,IF(cal!$S$7=4,FR!J10,))))","v":0},{"$f":"'Briza Net Zero'!K9","v":18.222222222222221},{"$f":"F9","v":"°C"},null,null,null,null,null,null,{"$f":"IF($W$4=1,E10,IF($W$4=2,(E10-32)/1.8))","v":35},null,null,null,{"$f":"IF($W$4=1,K10,IF($W$4=2,(K10-32)/1.8))","v":18.222222222222221},null,"p_atm","h[mm]","cf_h"]
[null,{"$f":"IF($S$7=1,NL!B11,IF(cal!$S$7=2,EN!B11,IF(cal!$S$7=3,DE!B11,IF(cal!$S$7=4,FR!B11,IF(cal!$S$7=5,NR!B11,IF(cal!$S$7=6,SP!B11,IF(cal!$S$7=7,SW!B11,IF(cal!$S$7=8,TS!B11,IF(cal!$S$7=9,ExtraTaal1!B11,IF(cal!$S$7=10,ExtraTaal2!B11,IF(cal!$S$7=11,ExtraTaal3!B11,)))))))))))","v":"Entering air"},{"$f":"IF($S$7=1,NL!C11,IF(cal!$S$7=2,EN!C11,IF(cal!$S$7=3,DE!C11,IF(cal!$S$7=4,FR!C11,IF(cal!$S$7=5,NR!C11,IF(cal!$S$7=6,SP!C11,IF(cal!$S$7=7,SW!C11,IF(cal!$S$7=8,TS!C11,IF(cal!$S$7=9,ExtraTaal1!C11,IF(cal!$S$7=10,ExtraTaal2!C11,IF(cal!$S$7=11,ExtraTaal3!C11,)))))))))))","v":0},{"$f":"IF($S$7=1,NL!D11,IF(cal!$S$7=2,EN!D11,IF(cal!$S$7=3,DE!D11,IF(cal!$S$7=4,FR!D11,IF(cal!$S$7=5,NR!D11,IF(cal!$S$7=6,SP!D11,IF(cal!$S$7=7,SW!D11,IF(cal!$S$7=8,TS!D11,IF(cal!$S$7=9,ExtraTaal1!D11,IF(cal!$S$7=10,ExtraTaal2!D11,IF(cal!$S$7=11,ExtraTaal3!D11,)))))))))))","v":0},{"$f":"'Briza Net Zero'!E10","v":20},{"$f":"F9","v":"°C"},{"$f":"B11","v":"Entering air"},{"$f":"IF($S$7=1,NL!H11,IF(cal!$S$7=2,EN!H11,IF(cal!$S$7=3,DE!H11,IF(cal!$S$7=4,FR!H11,))))","v":0},null,null,{"$f":"'Briza Net Zero'!K10","v":26.999999999999996},{"$f":"F9","v":"°C"},null,null,null,null,null,null,20,null,null,null,26.999999999999996,null,{"$f":"IF($W$4=1,(101325*(1-((0.0065*M8)/(288.15)))^((9.81*0.028964)/(8.31447*0.0065))),IF($W$4=2,(101325*(1-((0.0065*(M8*0.3048))/(288.15)))^((9.81*0.028964)/(8.31447*0.0065)))))","v":101325},{"$f":"IF($W$4=1,M8/1000,IF($W$4=2,M8*0.0003048))","v":0},{"$f":"-(0.000265264729874266*Z11^6)+(0.000957582908802335*Z11^5)+(0.00470250661483425*Z11^4)-(0.0298716926548353*Z11^3)+(0.0557086806557086*Z11^2)-(0.0484008125693582*Z11)+1","v":1}]
[null,null,null,null,null,null,{"$f":"IF($S$7=1,NL!G12,IF(cal!$S$7=2,EN!G12,IF(cal!$S$7=3,DE!G12,IF(cal!$S$7=4,FR!G12,IF(cal!$S$7=5,NR!G12,IF(cal!$S$7=6,SP!G12,IF(cal!$S$7=7,SW!G12,IF(cal!$S$7=8,TS!G12,IF(cal!$S$7=9,ExtraTaal1!G12,IF(cal!$S$7=10,ExtraTaal2!G12,IF(cal!$S$7=11,ExtraTaal3!G12,)))))))))))","v":"Relative humidity"},null,null,null,{"$f":"'Briza Net Zero'!K11","v":0.5}]
[]
[null,null,null,{"$f":"IF($W$4=1,1,IF($W$4=2,3.412141633))","v":1},{"$f":"IF($W$4=1,1,IF($W$4=2,0.004403))","v":1},{"$f":"IF($W$4=1,1,IF($W$4=2,4.0147))","v":1},{"$f":"IF($W$4=1,1,IF($W$4=2,3.412141633))","v":1},1,{"$f":"IF($W$4=1,1,IF($W$4=2,0.004403))","v":1},{"$f":"IF($W$4=1,1,IF($W$4=2,4.0147))","v":1},{"$f":"IF($W$4=1,0.000334444444444444,IF($W$4=2,0.000568224721372))","v":3.3444444444444401E-4},null,{"$f":"IF($W$4=1,1,IF($W$4=2,1.8))","v":1},{"$f":"IF($W$4=1,1,IF($W$4=2,0.588575))","v":1},{"$f":"IF($W$4=1,0,IF($W$4=2,32))","v":0}]
[null,{"$f":"IF($S$7=1,NL!B15,IF(cal!$S$7=2,EN!B15,IF(cal!$S$7=3,DE!B15,IF(cal!$S$7=4,FR!B15,IF(cal!$S$7=5,NR!B15,IF(cal!$S$7=6,SP!B15,IF(cal!$S$7=7,SW!B15,IF(cal!$S$7=8,TS!B15,IF(cal!$S$7=9,ExtraTaal1!B15,IF(cal!$S$7=10,ExtraTaal2!B15,IF(cal!$S$7=11,ExtraTaal3!B15,)))))))))))","v":"Speed level"},{"$f":"IF($S$7=1,NL!C15,IF(cal!$S$7=2,EN!C15,IF(cal!$S$7=3,DE!C15,IF(cal!$S$7=4,FR!C15,IF(cal!$S$7=5,NR!C15,IF(cal!$S$7=6,SP!C15,IF(cal!$S$7=7,SW!C15,IF(cal!$S$7=8,TS!C15,IF(cal!$S$7=9,ExtraTaal1!C15,IF(cal!$S$7=10,ExtraTaal2!C15,IF(cal!$S$7=11,ExtraTaal3!C15,)))))))))))","v":"Control voltage [V]"},{"$f":"IF($S$7=1,NL!D15,IF(cal!$S$7=2,EN!D15,IF(cal!$S$7=3,DE!D15,IF(cal!$S$7=4,FR!D15,IF(cal!$S$7=5,NR!D15,IF(cal!$S$7=6,SP!D15,IF(cal!$S$7=7,SW!D15,IF(cal!$S$7=8,TS!D15,IF(cal!$S$7=9,ExtraTaal1!D15,IF(cal!$S$7=10,ExtraTaal2!D15,IF(cal!$S$7=11,ExtraTaal3!D15,)))))))))))","v":"Heat output  45/35/20 [W]"},{"$f":"IF($S$7=1,NL!E15,IF(cal!$S$7=2,EN!E15,IF(cal!$S$7=3,DE!E15,IF(cal!$S$7=4,FR!E15,IF(cal!$S$7=5,NR!E15,IF(cal!$S$7=6,SP!E15,IF(cal!$S$7=7,SW!E15,IF(cal!$S$7=8,TS!E15,IF(cal!$S$7=9,ExtraTaal1!E15,IF(cal!$S$7=10,ExtraTaal2!E15,IF(cal!$S$7=11,ExtraTaal3!E15,)))))))))))","v":"Water flowrate, heating [l/h]"},{"$f":"IF($S$7=1,NL!F15,IF(cal!$S$7=2,EN!F15,IF(cal!$S$7=3,DE!F15,IF(cal!$S$7=4,FR!F15,IF(cal!$S$7=5,NR!F15,IF(cal!$S$7=6,SP!F15,IF(cal!$S$7=7,SW!F15,IF(cal!$S$7=8,TS!F15,IF(cal!$S$7=9,ExtraTaal1!F15,IF(cal!$S$7=10,ExtraTaal2!F15,IF(cal!$S$7=11,ExtraTaal3!F15,)))))))))))","v":"Watersided pressure loss [kPa]"},{"$f":"IF($S$7=1,NL!G15,IF(cal!$S$7=2,EN!G15,IF(cal!$S$7=3,DE!G15,IF(cal!$S$7=4,FR!G15,IF(cal!$S$7=5,NR!G15,IF(cal!$S$7=6,SP!G15,IF(cal!$S$7=7,SW!G15,IF(cal!$S$7=8,TS!G15,IF(cal!$S$7=9,ExtraTaal1!G15,IF(cal!$S$7=10,ExtraTaal2!G15,IF(cal!$S$7=11,ExtraTaal3!G15,)))))))))))","v":"Sens. cooling capacity  16/18/27 [W]"},{"$f":"IF($S$7=1,NL!H15,IF(cal!$S$7=2,EN!H15,IF(cal!$S$7=3,DE!H15,IF(cal!$S$7=4,FR!H15,IF(cal!$S$7=5,NR!H15,IF(cal!$S$7=6,SP!H15,IF(cal!$S$7=7,SW!H15,IF(cal!$S$7=8,TS!H15,IF(cal!$S$7=9,ExtraTaal1!H15,IF(cal!$S$7=10,ExtraTaal2!H15,IF(cal!$S$7=11,ExtraTaal3!H15,)))))))))))","v":"Tot. cooling capacity 16/18/27 [W]"},{"$f":"IF($S$7=1,NL!I15,IF(cal!$S$7=2,EN!I15,IF(cal!$S$7=3,DE!I15,IF(cal!$S$7=4,FR!I15,IF(cal!$S$7=5,NR!I15,IF(cal!$S$7=6,SP!I15,IF(cal!$S$7=7,SW!I15,IF(cal!$S$7=8,TS!I15,IF(cal!$S$7=9,ExtraTaal1!I15,IF(cal!$S$7=10,ExtraTaal2!I15,IF(cal!$S$7=11,ExtraTaal3!I15,)))))))))))","v":"Water flowrate, cooling [l/h]"},{"$f":"IF($S$7=1,NL!J15,IF(cal!$S$7=2,EN!J15,IF(cal!$S$7=3,DE!J15,IF(cal!$S$7=4,FR!J15,IF(cal!$S$7=5,NR!J15,IF(cal!$S$7=6,SP!J15,IF(cal!$S$7=7,SW!J15,IF(cal!$S$7=8,TS!J15,IF(cal!$S$7=9,ExtraTaal1!J15,IF(cal!$S$7=10,ExtraTaal2!J15,IF(cal!$S$7=11,ExtraTaal3!J15,)))))))))))","v":"Watersided pressure loss [kPa]"},{"$f":"IF($S$7=1,NL!K15,IF(cal!$S$7=2,EN!K15,IF(cal!$S$7=3,DE!K15,IF(cal!$S$7=4,FR!K15,IF(cal!$S$7=5,NR!K15,IF(cal!$S$7=6,SP!K15,IF(cal!$S$7=7,SW!K15,IF(cal!$S$7=8,TS!K15,IF(cal!$S$7=9,ExtraTaal1!K15,IF(cal!$S$7=10,ExtraTaal2!K15,IF(cal!$S$7=11,ExtraTaal3!K15,)))))))))))","v":"Sound pressure ** [dB(A)]"},{"$f":"IF($S$7=1,NL!L15,IF(cal!$S$7=2,EN!L15,IF(cal!$S$7=3,DE!L15,IF(cal!$S$7=4,FR!L15,IF(cal!$S$7=5,NR!L15,IF(cal!$S$7=6,SP!L15,IF(cal!$S$7=7,SW!L15,IF(cal!$S$7=8,TS!L15,IF(cal!$S$7=9,ExtraTaal1!L15,IF(cal!$S$7=10,ExtraTaal2!L15,IF(cal!$S$7=11,ExtraTaal3!L15,)))))))))))","v":"Sound power * [dB(A)]"},{"$f":"IF($S$7=1,NL!M15,IF(cal!$S$7=2,EN!M15,IF(cal!$S$7=3,DE!M15,IF(cal!$S$7=4,FR!M15,IF(cal!$S$7=5,NR!M15,IF(cal!$S$7=6,SP!M15,IF(cal!$S$7=7,SW!M15,IF(cal!$S$7=8,TS!M15,IF(cal!$S$7=9,ExtraTaal1!M15,IF(cal!$S$7=10,ExtraTaal2!M15,IF(cal!$S$7=11,ExtraTaal3!M15,)))))))))))","v":"Electrical power [W]"},{"$f":"IF($S$7=1,NL!N15,IF(cal!$S$7=2,EN!N15,IF(cal!$S$7=3,DE!N15,IF(cal!$S$7=4,FR!N15,IF(cal!$S$7=5,NR!N15,IF(cal!$S$7=6,SP!N15,IF(cal!$S$7=7,SW!N15,IF(cal!$S$7=8,TS!N15,IF(cal!$S$7=9,ExtraTaal1!N15,IF(cal!$S$7=10,ExtraTaal2!N15,IF(cal!$S$7=11,ExtraTaal3!N15,)))))))))))","v":"Air flowrate [m³/h]"},{"$f":"IF($S$7=1,NL!O15,IF(cal!$S$7=2,EN!O15,IF(cal!$S$7=3,DE!O15,IF(cal!$S$7=4,FR!O15,IF(cal!$S$7=5,NR!O15,IF(cal!$S$7=6,SP!O15,IF(cal!$S$7=7,SW!O15,IF(cal!$S$7=8,TS!O15,IF(cal!$S$7=9,ExtraTaal1!O15,IF(cal!$S$7=10,ExtraTaal2!O15,IF(cal!$S$7=11,ExtraTaal3!O15,)))))))))))","v":"Air exhaust temp. heating  [°C]"},{"$f":"IF($S$7=1,NL!P15,IF(cal!$S$7=2,EN!P15,IF(cal!$S$7=3,DE!P15,IF(cal!$S$7=4,FR!P15,IF(cal!$S$7=5,NR!P15,IF(cal!$S$7=6,SP!P15,IF(cal!$S$7=7,SW!P15,IF(cal!$S$7=8,TS!P15,IF(cal!$S$7=9,ExtraTaal1!P15,IF(cal!$S$7=10,ExtraTaal2!P15,IF(cal!$S$7=11,ExtraTaal3!P15,)))))))))))","v":"Air exhaust temp. cooling  [°C]"},null,null,null,null,null,null,"Q_verw","KV","Q_voelb_c","dP_cool","Geluid_P","P_elek","V_air",null,"Q_verw","KV","Q_voelb_c","kV","Geluid_P","P_elek","V_air","Q_verw","KV","Q_voelb_c","KV","Geluid_P","P_elek","V_air","Q_verw","KV","Q_voelb_c","KV","Geluid_P","P_elek","V_air","Q_verw","KV","Q_voelb_c","KV","Geluid_P","P_elek","V_air","Q_verw","dP_verw","Q_voelb_c","dP_cool","Geluid_P","P_elek","V_air","Q_verw","dP_verw","Q_voelb_c","dP_cool","Geluid_P","P_elek","V_air","Q_verw","dP_verw","Q_voelb_c","dP_cool","Geluid_P","P_elek","V_air","Q_verw","dP_verw","Q_voelb_c","dP_cool","Geluid_P","P_elek","V_air"]
[null,{"$f":"IF($S$7=1,NL!B16,IF(cal!$S$7=2,EN!B16,IF(cal!$S$7=3,DE!B16,IF(cal!$S$7=4,FR!B16,IF(cal!$S$7=5,NR!B16,IF(cal!$S$7=6,SP!B16,IF(cal!$S$7=7,SW!B16,IF(cal!$S$7=8,TS!B16,IF(cal!$S$7=9,ExtraTaal1!B16,IF(cal!$S$7=10,ExtraTaal2!B16,IF(cal!$S$7=11,ExtraTaal3!B16,)))))))))))","v":"Briza Net Zero S height 55,8 cm width 11 cm length 75 cm (Type 1)"},null,null,null,null,null,null,null,null,null,null,null,null,null,null,null,null,"n-value",null,null,null,{"$f":"IF('Briza Net Zero'!$K$4=cal!$X2,1,IF('Briza Net Zero'!$K$4=cal!$X3,2,IF('Briza Net Zero'!$K$4=cal!$X4,3,IF('Briza Net Zero'!$K$4=cal!$X5,4,IF('Briza Net Zero'!$K$4=cal!$X6,5,IF('Briza Net Zero'!$K$4=cal!$X7,6,IF('Briza Net Zero'!$K$4=cal!$X8,7,IF('Briza Net Zero'!$K$4=cal!$X9,8,))))))))","v":2},null,null,null,null,null,null,null,"Briza Net Zero XS",null,null,null,null,null,null,"Briza Net Zero S",null,null,null,null,null,null,"Briza Net Zero M H41 2P",null,null,null,null,null,null,"Briza Net Zero M H41 4P",null,null,null,null,null,null,"Briza Net Zero M H55 2P",null,null,null,null,null,null,"Briza Net Zero M H55 4P",null,null,null,null,null,null,"unused",null,null,null,null,null,null,"unused"]
[null,0.2,2,{"$f":"(($W$17*$C17^4+$W$18*$C17^3+$W$19*$C17^2+$W$20*$C17+$W$21)*((((Tv_heat-Tr_heat)/LN((Tv_heat-Tl_heat)/(Tr_heat-Tl_heat)))/((75-65)/LN((75-20)/(65-20))))^$S17))*$D$14*$AA$11","v":76.234447489331004},{"$f":"ROUND(((D17/$D$14)/((Tv_heat-Tr_heat)*1.163))*$E$14,IF($W$4=1,0,IF($W$4=2,2)))","v":7},{"$f":"IF($AA$1=1,IF((POWER(((E17/$I$14)/1000)/$X$18,2)*100)*$J$14<0.01,0.01,(POWER(((E17/$I$14)/1000)/$X$18,2)*100)*$J$14),($X$18*(E17/$E$14)^$X$20)*$F$14)","v":0.01},{"$f":"(($Y$17*$C17^4+$Y$18*$C17^3+$Y$19*$C17^2+$Y$20*$C17+$Y$21)*((((Tv_cool-Tr_cool)/LN((Tv_cool-Tl_cool)/(Tr_cool-Tl_cool)))/((16-18)/LN((16-27)/(18-27))))^S17))*$G$14*$AA$11","v":27.188896114947411},{"$f":"((G17/$G$14)/(IF((237.3*LN((RH*EXP(17.27*(Tl_cool/(Tl_cool+237.3))))))/(17.27-LN((RH*EXP(17.27*(Tl_cool/(Tl_cool+237.3))))))<((Tv_cool+Tr_cool)/2),1,IF(1/(1+((2258*((0.622/((p_atm/(1*611*EXP(17.27*(((Tv_cool+Tr_cool)/2)/(((Tv_cool+Tr_cool)/2)+237.3))))))-1)*1000-(0.622/((p_atm/(RH*611*EXP(17.27*(Tl_cool/(Tl_cool+237.3))))))-1)*1000))/(1005*(((Tv_cool+Tr_cool)/2)-Tl_cool))))*1.039+((-0.000729*$C17+0.001448)*(Tl_cool-((Tv_cool+Tr_cool)/2))+(0.016908*$C17-0.033574))*1.039>1,1,1/(1+((2258*((0.622/((p_atm/(1*611*EXP(17.27*(((Tv_cool+Tr_cool)/2)/(((Tv_cool+Tr_cool)/2)+237.3))))))-1)*1000-(0.622/((p_atm/(RH*611*EXP(17.27*(Tl_cool/(Tl_cool+237.3))))))-1)*1000))/(1005*(((Tv_cool+Tr_cool)/2)-Tl_cool))))*1.039+((-0.000729*$C17+0.001448)*(Tl_cool-((Tv_cool+Tr_cool)/2))+(0.016908*$C17-0.033574))*1.039))))*$H$14","v":27.188896114947411},{"$f":"ROUND(((H17/$H$14)/((Tr_cool-Tv_cool)*1.163))*$I$14,IF($W$4=1,0,IF($W$4=2,2)))","v":11},{"$f":"IF($AA$1=1,IF((POWER(((I17/$I$14)/1000)/$X$18,2)*100)*$J$14<0.01,0.01,(POWER(((I17/$I$14)/1000)/$X$18,2)*100)*$J$14),($Z$18*(I17/$I$14)^$Z$20)*$J$14)","v":0.01},{"$f":"IF(AA17<28,\"<20\",L17-8)","v":"<20"},{"$f":"IF(AA17<20,\"<20\",AA17)","v":25},{"$f":"AB17","v":1},{"$f":"AC17*$N$14","v":32},{"$f":"(Tl_heat+(($D17/$G$14)/(1006*$N17*$K$14)))*$M$14+$O$14","v":27.080750829367439},{"$f":"(Tl_cool-(($G17/$G$14)/(1006*$N17*$K$14)))*$M$14+$O$14","v":24.474661323643197},null,null,1,null,null,null,{"$f":"IF($W$16=1,AE17,IF($W$16=2,AL17,IF($W$16=3,AS17,IF($W$16=4,AZ17,IF($W$16=5,BG17,IF($W$16=6,BN17,IF($W$16=7,BU17,IF($W$16=8,CB17))))))))","v":2.8199751689787116E-4},{"$f":"IF($W$16=1,AF17,IF($W$16=2,AM17,IF($W$16=3,AT17,IF($W$16=4,BA17,IF($W$16=5,BH17,IF($W$16=6,BO17,IF($W$16=7,BV17,IF($W$16=8,CC17))))))))","v":"a"},{"$f":"IF($W$16=1,AG17,IF($W$16=2,AN17,IF($W$16=3,AU17,IF($W$16=4,BB17,IF($W$16=5,BI17,IF($W$16=6,BP17,IF($W$16=7,BW17,IF($W$16=8,CD17))))))))","v":-3.0601293465752058E-4},{"$f":"IF($W$16=1,AH17,IF($W$16=2,AO17,IF($W$16=3,AV17,IF($W$16=4,BC17,IF($W$16=5,BJ17,IF($W$16=6,BQ17,IF($W$16=7,BX17,IF($W$16=8,CE17))))))))","v":"a"},{"$f":"IF($W$16=1,AI17,IF($W$16=2,AP17,IF($W$16=3,AW17,IF($W$16=4,BD17,IF($W$16=5,BK17,IF($W$16=6,BR17,IF($W$16=7,BY17,IF($W$16=8,CF17))))))))","v":25},{"$f":"IF($W$16=1,AJ17,IF($W$16=2,AQ17,IF($W$16=3,AX17,IF($W$16=4,BE17,IF($W$16=5,BL17,IF($W$16=6,BS17,IF($W$16=7,BZ17,IF($W$16=8,CG17))))))))","v":1},{"$f":"IF($W$16=1,AK17,IF($W$16=2,AR17,IF($W$16=3,AY17,IF($W$16=4,BF17,IF($W$16=5,BM17,IF($W$16=6,BT17,IF($W$16=7,CA17,IF($W$16=8,CH17))))))))","v":32},"c",0,"a",null,"a",11,0.5,25,2.8199751689787116E-4,"a",-3.0601293465752058E-4,"a",25,1,32,7.4263626519463083E-3,"a",null,"a",26.5,1.6,64,-0.30147360997762745,"a",null,"a",26.5,1.8,29,null,"a",-1.0144326001132824E-3,"a",27.2,2,81,-0.24292209682737784,"a",null,"a",27.2,1.6,27]
[null,0.4,4,{"$f":"(($W$17*$C18^4+$W$18*$C18^3+$W$19*$C18^2+$W$20*$C18+$W$21)*((((Tv_heat-Tr_heat)/LN((Tv_heat-Tl_heat)/(Tr_heat-Tl_heat)))/((75-65)/LN((75-20)/(65-20))))^1))*$D$14*$AA$11","v":295.37886453387819},{"$f":"ROUND(((D18/$D$14)/((Tv_heat-Tr_heat)*1.163))*$E$14,IF($W$4=1,0,IF($W$4=2,2)))","v":25},{"$f":"IF($AA$1=1,IF((POWER(((E18/$I$14)/1000)/$X$18,2)*100)*$J$14<0.01,0.01,(POWER(((E18/$I$14)/1000)/$X$18,2)*100)*$J$14),($X$18*(E18/$E$14)^$X$20)*$F$14)","v":2.9374999999999821E-2},{"$f":"(($Y$17*$C18^4+$Y$18*$C18^3+$Y$19*$C18^2+$Y$20*$C18+$Y$21)*((((Tv_cool-Tr_cool)/LN((Tv_cool-Tl_cool)/(Tr_cool-Tl_cool)))/((16-18)/LN((16-27)/(18-27))))^S18))*$G$14*$AA$11","v":149.15679843682747},{"$f":"((G18/$G$14)/(IF((237.3*LN((RH*EXP(17.27*(Tl_cool/(Tl_cool+237.3))))))/(17.27-LN((RH*EXP(17.27*(Tl_cool/(Tl_cool+237.3))))))<((Tv_cool+Tr_cool)/2),1,IF(1/(1+((2258*((0.622/((p_atm/(1*611*EXP(17.27*(((Tv_cool+Tr_cool)/2)/(((Tv_cool+Tr_cool)/2)+237.3))))))-1)*1000-(0.622/((p_atm/(RH*611*EXP(17.27*(Tl_cool/(Tl_cool+237.3))))))-1)*1000))/(1005*(((Tv_cool+Tr_cool)/2)-Tl_cool))))*1.039+((-0.000729*$C18+0.001448)*(Tl_cool-((Tv_cool+Tr_cool)/2))+(0.016908*$C18-0.033574))*1.039>1,1,1/(1+((2258*((0.622/((p_atm/(1*611*EXP(17.27*(((Tv_cool+Tr_cool)/2)/(((Tv_cool+Tr_cool)/2)+237.3))))))-1)*1000-(0.622/((p_atm/(RH*611*EXP(17.27*(Tl_cool/(Tl_cool+237.3))))))-1)*1000))/(1005*(((Tv_cool+Tr_cool)/2)-Tl_cool))))*1.039+((-0.000729*$C18+0.001448)*(Tl_cool-((Tv_cool+Tr_cool)/2))+(0.016908*$C18-0.033574))*1.039))))*$H$14","v":149.15679843682747},{"$f":"ROUND(((H18/$H$14)/((Tr_cool-Tv_cool)*1.163))*$I$14,IF($W$4=1,0,IF($W$4=2,2)))","v":58},{"$f":"IF($AA$1=1,IF((POWER(((I18/$I$14)/1000)/$X$18,2)*100)*$J$14<0.01,0.01,(POWER(((I18/$I$14)/1000)/$X$18,2)*100)*$J$14),($Z$18*(I18/$I$14)^$Z$20)*$J$14)","v":0.15810799999999903},{"$f":"IF(AA18<28,\"<20\",L18-8)","v":23.5},{"$f":"IF(AA18<20,\"<20\",AA18)","v":31.5},{"$f":"AB18","v":1.4},{"$f":"AC18*$N$14","v":63},{"$f":"(Tl_heat+(($D18/$G$14)/(1006*$N18*$K$14)))*$M$14+$O$14","v":33.935318536520725},{"$f":"(Tl_cool-(($G18/$G$14)/(1006*$N18*$K$14)))*$M$14+$O$14","v":19.963113656134965},null,null,1,null,null,null,{"$f":"IF($W$16=1,AE18,IF($W$16=2,AL18,IF($W$16=3,AS18,IF($W$16=4,AZ18,IF($W$16=5,BG18,IF($W$16=6,BN18,IF($W$16=7,BU18,IF($W$16=8,CB18))))))))","v":-1.1828263872689105E-2},{"$f":"IF($W$16=1,AF18,IF($W$16=2,AM18,IF($W$16=3,AT18,IF($W$16=4,BA18,IF($W$16=5,BH18,IF($W$16=6,BO18,IF($W$16=7,BV18,IF($W$16=8,CC18))))))))","v":1.45864991497895},{"$f":"IF($W$16=1,AG18,IF($W$16=2,AN18,IF($W$16=3,AU18,IF($W$16=4,BB18,IF($W$16=5,BI18,IF($W$16=6,BP18,IF($W$16=7,BW18,IF($W$16=8,CD18))))))))","v":-8.5029112474804521E-4},{"$f":"IF($W$16=1,AH18,IF($W$16=2,AO18,IF($W$16=3,AV18,IF($W$16=4,BC18,IF($W$16=5,BJ18,IF($W$16=6,BQ18,IF($W$16=7,BX18,IF($W$16=8,CE18))))))))","v":1.45864991497895},31.5,1.4,63,"d",0,1.903,null,{"$f":"AF18","v":1.903},21,0.8,34,-1.1828263872689105E-2,1.45864991497895,-8.5029112474804521E-4,1.45864991497895,31.5,1.4,63,0.21173876801715211,6.2276819636539519E-5,-3.0099755140858282E-2,6.2276819636539519E-5,37.4,2.6,101,8.050935653010697,6.2276819636539519E-5,null,6.2276819636539519E-5,37.4,3,61,null,1.3263547865279744E-4,-2.0070321215289355E-3,1.3263547865279744E-4,33.200000000000003,3.2,118,6.2288044399788918,6.2276819636539519E-5,-0.10047556370896396,1.3263547865279744E-4,33.200000000000003,2.2000000000000002,67]
[null,0.6,6,{"$f":"(($W$17*$C19^4+$W$18*$C19^3+$W$19*$C19^2+$W$20*$C19+$W$21)*((((Tv_heat-Tr_heat)/LN((Tv_heat-Tl_heat)/(Tr_heat-Tl_heat)))/((75-65)/LN((75-20)/(65-20))))^1))*$D$14*$AA$11","v":482.18475559167626},{"$f":"ROUND(((D19/$D$14)/((Tv_heat-Tr_heat)*1.163))*$E$14,IF($W$4=1,0,IF($W$4=2,2)))","v":41},7.9006999999999522E-2,{"$f":"(($Y$17*$C19^4+$Y$18*$C19^3+$Y$19*$C19^2+$Y$20*$C19+$Y$21)*((((Tv_cool-Tr_cool)/LN((Tv_cool-Tl_cool)/(Tr_cool-Tl_cool)))/((16-18)/LN((16-27)/(18-27))))^S19))*$G$14*$AA$11","v":247.43291632072007},{"$f":"((G19/$G$14)/(IF((237.3*LN((RH*EXP(17.27*(Tl_cool/(Tl_cool+237.3))))))/(17.27-LN((RH*EXP(17.27*(Tl_cool/(Tl_cool+237.3))))))<((Tv_cool+Tr_cool)/2),1,IF(1/(1+((2258*((0.622/((p_atm/(1*611*EXP(17.27*(((Tv_cool+Tr_cool)/2)/(((Tv_cool+Tr_cool)/2)+237.3))))))-1)*1000-(0.622/((p_atm/(RH*611*EXP(17.27*(Tl_cool/(Tl_cool+237.3))))))-1)*1000))/(1005*(((Tv_cool+Tr_cool)/2)-Tl_cool))))*1.039+((-0.000729*$C19+0.001448)*(Tl_cool-((Tv_cool+Tr_cool)/2))+(0.016908*$C19-0.033574))*1.039>1,1,1/(1+((2258*((0.622/((p_atm/(1*611*EXP(17.27*(((Tv_cool+Tr_cool)/2)/(((Tv_cool+Tr_cool)/2)+237.3))))))-1)*1000-(0.622/((p_atm/(RH*611*EXP(17.27*(Tl_cool/(Tl_cool+237.3))))))-1)*1000))/(1005*(((Tv_cool+Tr_cool)/2)-Tl_cool))))*1.039+((-0.000729*$C19+0.001448)*(Tl_cool-((Tv_cool+Tr_cool)/2))+(0.016908*$C19-0.033574))*1.039))))*$H$14","v":247.43291632072007},{"$f":"ROUND(((H19/$H$14)/((Tr_cool-Tv_cool)*1.163))*$I$14,IF($W$4=1,0,IF($W$4=2,2)))","v":96},0.43315199999999732,28.5,36.5,2.4,95,{"$f":"(Tl_heat+(($D19/$G$14)/(1006*$N19*$K$14)))*$M$14+$O$14","v":35.085784646292872},{"$f":"(Tl_cool-(($G19/$G$14)/(1006*$N19*$K$14)))*$M$14+$O$14","v":19.258735584789967},null,null,1,null,null,null,-10.176345337508607,"b",-2.956590447494051,"b",36.5,2.4,95,"e",9.3799999999999994E-2,"b",-0.85929999999999995,"b",30.5,1.3,47,-10.176345337508607,"b",-2.956590447494051,"b",36.5,2.4,95,0.19489833199562701,"b",0.93056078652448071,"b",39.299999999999997,4.3,141,-70.674841607023481,"b",0.21600510650865656,"b",39.299999999999997,4.8,86,-0.35663575157485938,"b",-7.2116473746031196E-2,"b",40.200000000000003,5.5,154,-50.901906972048394,"b",1.8516402222660224,"b",40.200000000000003,3.6,107]
[null,0.8,8,{"$f":"(($W$17*$C20^4+$W$18*$C20^3+$W$19*$C20^2+$W$20*$C20+$W$21)*((((Tv_heat-Tr_heat)/LN((Tv_heat-Tl_heat)/(Tr_heat-Tl_heat)))/((75-65)/LN((75-20)/(65-20))))^1))*$D$14*$AA$11","v":636.53543303018887},{"$f":"ROUND(((D20/$D$14)/((Tv_heat-Tr_heat)*1.163))*$E$14,IF($W$4=1,0,IF($W$4=2,2)))","v":55},0.14217499999999914,{"$f":"(($Y$17*$C20^4+$Y$18*$C20^3+$Y$19*$C20^2+$Y$20*$C20+$Y$21)*((((Tv_cool-Tr_cool)/LN((Tv_cool-Tl_cool)/(Tr_cool-Tl_cool)))/((16-18)/LN((16-27)/(18-27))))^S20))*$G$14*$AA$11","v":321.68667321442121},{"$f":"((G20/$G$14)/(IF((237.3*LN((RH*EXP(17.27*(Tl_cool/(Tl_cool+237.3))))))/(17.27-LN((RH*EXP(17.27*(Tl_cool/(Tl_cool+237.3))))))<((Tv_cool+Tr_cool)/2),1,IF(1/(1+((2258*((0.622/((p_atm/(1*611*EXP(17.27*(((Tv_cool+Tr_cool)/2)/(((Tv_cool+Tr_cool)/2)+237.3))))))-1)*1000-(0.622/((p_atm/(RH*611*EXP(17.27*(Tl_cool/(Tl_cool+237.3))))))-1)*1000))/(1005*(((Tv_cool+Tr_cool)/2)-Tl_cool))))*1.039+((-0.000729*$C20+0.001448)*(Tl_cool-((Tv_cool+Tr_cool)/2))+(0.016908*$C20-0.033574))*1.039>1,1,1/(1+((2258*((0.622/((p_atm/(1*611*EXP(17.27*(((Tv_cool+Tr_cool)/2)/(((Tv_cool+Tr_cool)/2)+237.3))))))-1)*1000-(0.622/((p_atm/(RH*611*EXP(17.27*(Tl_cool/(Tl_cool+237.3))))))-1)*1000))/(1005*(((Tv_cool+Tr_cool)/2)-Tl_cool))))*1.039+((-0.000729*$C20+0.001448)*(Tl_cool-((Tv_cool+Tr_cool)/2))+(0.016908*$C20-0.033574))*1.039))))*$H$14","v":321.68667321442121},{"$f":"ROUND(((H20/$H$14)/((Tr_cool-Tv_cool)*1.163))*$I$14,IF($W$4=1,0,IF($W$4=2,2)))","v":124},0.72267199999999554,35,43,3.8,123,{"$f":"(Tl_heat+(($D20/$G$14)/(1006*$N20*$K$14)))*$M$14+$O$14","v":35.381387222331426},{"$f":"(Tl_cool-(($G20/$G$14)/(1006*$N20*$K$14)))*$M$14+$O$14","v":19.22668994022845},null,null,1,null,null,null,340.28151023795266,0,79.523748818849384,2,43,3.8,123,"f",77.5,null,25.375,{"$f":"AF20","v":0},37,2.1,61,340.28151023795266,{"$f":"AF20","v":0},79.523748818849384,2,43,3.8,123,57.973284405042172,1.8358350093844202,4.9047030669294314,1.8358350093844202,45.3,7.2,178,305.78049129814406,1.8358350093844202,7.2063340139581697,1.8358350093844202,45.3,8,116,152.87981581044934,1.8136893271096062,22.687985802451447,1.8136893271096062,46.1,9.6,193,203.12988403023203,1.8358350093844202,4.1514201576003273,1.8136893271096062,46.1,6.3,137]
[null,1,10,{"$f":"(($W$17*$C21^4+$W$18*$C21^3+$W$19*$C21^2+$W$20*$C21+$W$21)*((((Tv_heat-Tr_heat)/LN((Tv_heat-Tl_heat)/(Tr_heat-Tl_heat)))/((75-65)/LN((75-20)/(65-20))))^1))*$D$14*$AA$11","v":758.35674826722777},{"$f":"ROUND(((D21/$D$14)/((Tv_heat-Tr_heat)*1.163))*$E$14,IF($W$4=1,0,IF($W$4=2,2)))","v":65},0.19857499999999881,{"$f":"(($Y$17*$C21^4+$Y$18*$C21^3+$Y$19*$C21^2+$Y$20*$C21+$Y$21)*((((Tv_cool-Tr_cool)/LN((Tv_cool-Tl_cool)/(Tr_cool-Tl_cool)))/((16-18)/LN((16-27)/(18-27))))^S21))*$G$14*$AA$11","v":371.4713918809756},{"$f":"((G21/$G$14)/(IF((237.3*LN((RH*EXP(17.27*(Tl_cool/(Tl_cool+237.3))))))/(17.27-LN((RH*EXP(17.27*(Tl_cool/(Tl_cool+237.3))))))<((Tv_cool+Tr_cool)/2),1,IF(1/(1+((2258*((0.622/((p_atm/(1*611*EXP(17.27*(((Tv_cool+Tr_cool)/2)/(((Tv_cool+Tr_cool)/2)+237.3))))))-1)*1000-(0.622/((p_atm/(RH*611*EXP(17.27*(Tl_cool/(Tl_cool+237.3))))))-1)*1000))/(1005*(((Tv_cool+Tr_cool)/2)-Tl_cool))))*1.039+((-0.000729*$C21+0.001448)*(Tl_cool-((Tv_cool+Tr_cool)/2))+(0.016908*$C21-0.033574))*1.039>1,1,1/(1+((2258*((0.622/((p_atm/(1*611*EXP(17.27*(((Tv_cool+Tr_cool)/2)/(((Tv_cool+Tr_cool)/2)+237.3))))))-1)*1000-(0.622/((p_atm/(RH*611*EXP(17.27*(Tl_cool/(Tl_cool+237.3))))))-1)*1000))/(1005*(((Tv_cool+Tr_cool)/2)-Tl_cool))))*1.039+((-0.000729*$C21+0.001448)*(Tl_cool-((Tv_cool+Tr_cool)/2))+(0.016908*$C21-0.033574))*1.039))))*$H$14","v":371.4713918809756},{"$f":"ROUND(((H21/$H$14)/((Tr_cool-Tv_cool)*1.163))*$I$14,IF($W$4=1,0,IF($W$4=2,2)))","v":144},0.9745919999999938,40.5,48.5,6.5,160,{"$f":"(Tl_heat+(($D21/$G$14)/(1006*$N21*$K$14)))*$M$14+$O$14","v":34.087424651437431},{"$f":"(Tl_cool-(($G21/$G$14)/(1006*$N21*$K$14)))*$M$14+$O$14","v":20.09945450443356},null,null,1,null,null,null,-445.70576074243365,0,-119.69074437130477,0,48.5,6.5,160,"g",26.625,null,-29.312000000000001,null,43.5,3,77,-445.70576074243365,null,-119.69074437130477,null,48.5,6.5,160,784.09312058876696,null,102.07589640134984,null,50.5,13,214,309.52771297860744,null,77.128705162163683,null,50.5,13.7,143,1095.2128520064889,null,124.68763734693975,null,50.5,16.8,228,361.3522797245796,null,122.85501458041243,null,50.5,10.3,171]
[null,{"$f":"IF($S$7=1,NL!B22,IF(cal!$S$7=2,EN!B22,IF(cal!$S$7=3,DE!B22,IF(cal!$S$7=4,FR!B22,IF(cal!$S$7=5,NR!B22,IF(cal!$S$7=6,SP!B22,IF(cal!$S$7=7,SW!B22,IF(cal!$S$7=8,TS!B22,IF(cal!$S$7=9,ExtraTaal1!B22,IF(cal!$S$7=10,ExtraTaal2!B22,IF(cal!$S$7=11,ExtraTaal3!B22,)))))))))))","v":"Briza Net Zero S height 55,8 cm width 11 cm length 110 cm (Type 2)"},null,null,null,null,null,null,null,null,null,null,null,null,null,null,null,null,"n-value",null,null,null,"H",{"$f":"IF($W$16=1,AF22,IF($W$16=2,AM22,IF($W$16=3,AT22,IF($W$16=4,BA22,IF($W$16=5,BH22,IF($W$16=6,BO22,IF($W$16=7,BV22,IF($W$16=8,CC22))))))))*IF($W$4=1,1,IF($W$4=2,1/2.54))","v":55.8},"B",{"$f":"IF($W$16=1,AH22,IF($W$16=2,AO22,IF($W$16=3,AV22,IF($W$16=4,BC22,IF($W$16=5,BJ22,IF($W$16=6,BQ22,IF($W$16=7,BX22,IF($W$16=8,CE22))))))))*IF($W$4=1,1,IF($W$4=2,1/2.54))","v":11},"L",{"$f":"IF($W$16=1,AJ22,IF($W$16=2,AQ22,IF($W$16=3,AX22,IF($W$16=4,BE22,IF($W$16=5,BL22,IF($W$16=6,BS22,IF($W$16=7,BZ22,IF($W$16=8,CG22))))))))*IF($W$4=1,1,IF($W$4=2,1/2.54))","v":75},null,null,"H",{"$f":"IF(AI1=AH2,AL4,AM4)","v":52.1},"B",{"$f":"IF(AI1=AH2,AL3,AM3)","v":8.5},"L",{"$f":"IF(AI1=AH2,AL5,AM5)","v":86},36,"H",{"$f":"IF(AI1=AH2,AN4,AO4)","v":55.8},"B",{"$f":"IF(AI1=AH2,AN3,AO3)","v":11},"L",{"$f":"IF(AI1=AH2,AN5,AO5)","v":75},null,"H",{"$f":"IF(AI1=AH2,AP4,AQ4)","v":42},"B",{"$f":"IF(AI1=AH2,AP3,AQ3)","v":14},"L",{"$f":"IF(AI1=AH2,AP5,AQ5)","v":75},null,"H",{"$f":"AT22","v":42},"B",{"$f":"AV22","v":14},"L",{"$f":"AX22","v":75},null,"H",{"$f":"IF(AI1=AH3,AR4,AS4)","v":56},"B",{"$f":"IF(AI1=AH2,AR3,AS3)","v":14},"L",{"$f":"IF(AI1=AH2,AR5,AS5)","v":75},null,"H",{"$f":"BH22","v":56},{"$f":"BI22","v":"B"},14,"L",75]
[null,0.2,2,{"$f":"(($W$23*$C23^4+$W$24*$C23^3+$W$25*$C23^2+$W$26*$C23+$W$27)*((((Tv_heat-Tr_heat)/LN((Tv_heat-Tl_heat)/(Tr_heat-Tl_heat)))/((75-65)/LN((75-20)/(65-20))))^1))*$D$14*$AA$11","v":152.4292863836942},{"$f":"ROUND(((D23/$D$14)/((Tv_heat-Tr_heat)*1.163))*$E$14,IF($W$4=1,0,IF($W$4=2,2)))","v":13},{"$f":"IF($AA$1=1,IF((POWER(((E23/$I$14)/1000)/$X$24,2)*100)*$J$14<0.01,0.01,(POWER(((E23/$I$14)/1000)/$X$24,2)*100)*$J$14),($X$24*(E23/$E$14)^$X$26)*$F$14)","v":1.0832899999999965E-2},{"$f":"(($Y$23*$C23^4+$Y$24*$C23^3+$Y$25*$C23^2+$Y$26*$C23+$Y$27)*((((Tv_cool-Tr_cool)/LN((Tv_cool-Tl_cool)/(Tr_cool-Tl_cool)))/((16-18)/LN((16-27)/(18-27))))^S23))*$G$14*$AA$11","v":54.428252795029167},{"$f":"((G23/$G$14)/(IF((237.3*LN((RH*EXP(17.27*(Tl_cool/(Tl_cool+237.3))))))/(17.27-LN((RH*EXP(17.27*(Tl_cool/(Tl_cool+237.3))))))<((Tv_cool+Tr_cool)/2),1,IF(1/(1+((2258*((0.622/((p_atm/(1*611*EXP(17.27*(((Tv_cool+Tr_cool)/2)/(((Tv_cool+Tr_cool)/2)+237.3))))))-1)*1000-(0.622/((p_atm/(RH*611*EXP(17.27*(Tl_cool/(Tl_cool+237.3))))))-1)*1000))/(1005*(((Tv_cool+Tr_cool)/2)-Tl_cool))))*1.039+((-0.000729*$C23+0.001448)*(Tl_cool-((Tv_cool+Tr_cool)/2))+(0.016908*$C23-0.033574))*1.039>1,1,1/(1+((2258*((0.622/((p_atm/(1*611*EXP(17.27*(((Tv_cool+Tr_cool)/2)/(((Tv_cool+Tr_cool)/2)+237.3))))))-1)*1000-(0.622/((p_atm/(RH*611*EXP(17.27*(Tl_cool/(Tl_cool+237.3))))))-1)*1000))/(1005*(((Tv_cool+Tr_cool)/2)-Tl_cool))))*1.039+((-0.000729*$C23+0.001448)*(Tl_cool-((Tv_cool+Tr_cool)/2))+(0.016908*$C23-0.033574))*1.039))))*$H$14","v":54.428252795029167},{"$f":"ROUND(((H23/$H$14)/((Tr_cool-Tv_cool)*1.163))*$I$14,IF($W$4=1,0,IF($W$4=2,2)))","v":21},{"$f":"IF($AA$1=1,IF((POWER(((I23/$I$14)/1000)/$X$24,2)*100)*$J$14<0.01,0.01,(POWER(((I23/$I$14)/1000)/$X$24,2)*100)*$J$14),($Z$24*(I23/$I$14)^$Z$26)*$J$14)","v":2.8268099999999911E-2},{"$f":"IF(AA23<28,\"<20\",L23-8)","v":22},{"$f":"IF(AA23<20,\"<20\",AA23)","v":30},{"$f":"AB23","v":1.1000000000000001},{"$f":"AC23*$N$14","v":55},{"$f":"(Tl_heat+(($D23/$G$14)/(1006*$N23*$K$14)))*$M$14+$O$14","v":28.237278698412062},{"$f":"(Tl_cool-((G23/$G$14)/(1006*N23*$K$14)))*$M$14+$O$14","v":24.058697196733441},null,null,1,null,null,null,{"$f":"IF($W$16=1,AE23,IF($W$16=2,AL23,IF($W$16=3,AS23,IF($W$16=4,AZ23,IF($W$16=5,BG23,IF($W$16=6,BN23,IF($W$16=7,BU23,IF($W$16=8,CB23))))))))","v":-5.5671686104592712E-5},{"$f":"IF($W$16=1,AF23,IF($W$16=2,AM23,IF($W$16=3,AT23,IF($W$16=4,BA23,IF($W$16=5,BH23,IF($W$16=6,BO23,IF($W$16=7,BV23,IF($W$16=8,CC23))))))))","v":"a"},{"$f":"IF($W$16=1,AG23,IF($W$16=2,AN23,IF($W$16=3,AU23,IF($W$16=4,BB23,IF($W$16=5,BI23,IF($W$16=6,BP23,IF($W$16=7,BW23,IF($W$16=8,CD23))))))))","v":-7.0467345058072893E-4},{"$f":"IF($W$16=1,AH23,IF($W$16=2,AO23,IF($W$16=3,AV23,IF($W$16=4,BC23,IF($W$16=5,BJ23,IF($W$16=6,BQ23,IF($W$16=7,BX23,IF($W$16=8,CE23))))))))","v":"a"},{"$f":"IF($W$16=1,AI23,IF($W$16=2,AP23,IF($W$16=3,AW23,IF($W$16=4,BD23,IF($W$16=5,BK23,IF($W$16=6,BR23,IF($W$16=7,BY23,IF($W$16=8,CF23))))))))","v":30},{"$f":"IF($W$16=1,AJ23,IF($W$16=2,AQ23,IF($W$16=3,AX23,IF($W$16=4,BE23,IF($W$16=5,BL23,IF($W$16=6,BS23,IF($W$16=7,BZ23,IF($W$16=8,CG23))))))))","v":1.1000000000000001},{"$f":"IF($W$16=1,AK23,IF($W$16=2,AR23,IF($W$16=3,AY23,IF($W$16=4,BF23,IF($W$16=5,BM23,IF($W$16=6,BT23,IF($W$16=7,CA23,IF($W$16=8,CH23))))))))","v":55},"c",0,"a",0,"a",15,0.6,26,-5.5671686104592712E-5,"a",-7.0467345058072893E-4,"a",30,1.1000000000000001,55,-1.8027755792474383,"a",null,"a",32,2.5,108,null,"a",null,"a",32,2,52,null,"a",null,"a",31,2.2000000000000002,116,-0.18030344638520918,"a",null,"a",31,2.1,72]
[null,0.4,4,{"$f":"(($W$23*$C24^4+$W$24*$C24^3+$W$25*$C24^2+$W$26*$C24+$W$27)*((((Tv_heat-Tr_heat)/LN((Tv_heat-Tl_heat)/(Tr_heat-Tl_heat)))/((75-65)/LN((75-20)/(65-20))))^1))*$D$14*$AA$11","v":590.83879287855223},{"$f":"ROUND(((D24/$D$14)/((Tv_heat-Tr_heat)*1.163))*$E$14,IF($W$4=1,0,IF($W$4=2,2)))","v":51},{"$f":"IF($AA$1=1,IF((POWER(((E24/$I$14)/1000)/$X$24,2)*100)*$J$14<0.01,0.01,(POWER(((E24/$I$14)/1000)/$X$24,2)*100)*$J$14), ($X$24*(E24/$E$14)^$X$26)*$F$14)","v":0.16672409999999943},{"$f":"(($Y$23*$C24^4+$Y$24*$C24^3+$Y$25*$C24^2+$Y$26*$C24+$Y$27)*((((Tv_cool-Tr_cool)/LN((Tv_cool-Tl_cool)/(Tr_cool-Tl_cool)))/((16-18)/LN((16-27)/(18-27))))^S24))*$G$14*$AA$11","v":298.54767325287094},{"$f":"((G24/$G$14)/(IF((237.3*LN((RH*EXP(17.27*(Tl_cool/(Tl_cool+237.3))))))/(17.27-LN((RH*EXP(17.27*(Tl_cool/(Tl_cool+237.3))))))<((Tv_cool+Tr_cool)/2),1,IF(1/(1+((2258*((0.622/((p_atm/(1*611*EXP(17.27*(((Tv_cool+Tr_cool)/2)/(((Tv_cool+Tr_cool)/2)+237.3))))))-1)*1000-(0.622/((p_atm/(RH*611*EXP(17.27*(Tl_cool/(Tl_cool+237.3))))))-1)*1000))/(1005*(((Tv_cool+Tr_cool)/2)-Tl_cool))))*1.039+((-0.000729*$C24+0.001448)*(Tl_cool-((Tv_cool+Tr_cool)/2))+(0.016908*$C24-0.033574))*1.039>1,1,1/(1+((2258*((0.622/((p_atm/(1*611*EXP(17.27*(((Tv_cool+Tr_cool)/2)/(((Tv_cool+Tr_cool)/2)+237.3))))))-1)*1000-(0.622/((p_atm/(RH*611*EXP(17.27*(Tl_cool/(Tl_cool+237.3))))))-1)*1000))/(1005*(((Tv_cool+Tr_cool)/2)-Tl_cool))))*1.039+((-0.000729*$C24+0.001448)*(Tl_cool-((Tv_cool+Tr_cool)/2))+(0.016908*$C24-0.033574))*1.039))))*$H$14","v":298.54767325287094},{"$f":"ROUND(((H24/$H$14)/((Tr_cool-Tv_cool)*1.163))*$I$14,IF($W$4=1,0,IF($W$4=2,2)))","v":116},{"$f":"IF($AA$1=1,IF((POWER(((I24/$I$14)/1000)/$X$24,2)*100)*$J$14<0.01,0.01,(POWER(((I24/$I$14)/1000)/$X$24,2)*100)*$J$14),($Z$24*(I24/$I$14)^$Z$26)*$J$14)","v":0.86252959999999712},{"$f":"IF(AA24<28,\"<20\",L24-8)","v":30},{"$f":"IF(AA24<20,\"<20\",AA24)","v":38},1.9,100,{"$f":"(Tl_heat+(($D24/$G$14)/(1006*$N24*$K$14)))*$M$14+$O$14","v":37.560910734618787},{"$f":"(Tl_cool-((G24/$G$14)/(1006*N24*$K$14)))*$M$14+$O$14","v":18.126565988534431},null,null,1,null,null,null,{"$f":"IF($W$16=1,AE24,IF($W$16=2,AL24,IF($W$16=3,AS24,IF($W$16=4,AZ24,IF($W$16=5,BG24,IF($W$16=6,BN24,IF($W$16=7,BU24,IF($W$16=8,CB24))))))))","v":6.7997560216527308E-5},1.2490245804211,{"$f":"IF($W$16=1,AG24,IF($W$16=2,AN24,IF($W$16=3,AU24,IF($W$16=4,BB24,IF($W$16=5,BI24,IF($W$16=6,BP24,IF($W$16=7,BW24,IF($W$16=8,CD24))))))))","v":7.5682225521125869E-3},1.2490245804211,38,1.9,100,"d",0,1.7735440000000002,0,{"$f":"AF24","v":1.7735440000000002},24,1.3,56,6.7997560216527308E-5,1.2490245804211,7.5682225521125869E-3,1.2490245804211,38,1.9,100,44.485461171044086,8.9125876915269658E-5,1.4766388390629539E-2,8.9125876915269658E-5,38,4.3,172,0.96857796417835151,8.9125876915269658E-5,0.13604657691485619,8.9125876915269658E-5,38,3.4,92,-0.36935046666650995,1.6747942882275273E-4,-0.14605906212444036,1.6747942882275273E-4,35.799999999999997,3.6,176,5.1948232625655573,8.9125876915269658E-5,-0.10565020591365754,1.6747942882275273E-4,35.799999999999997,3.4,123]
[null,0.6,6,{"$f":"(($W$23*$C25^4+$W$24*$C25^3+$W$25*$C25^2+$W$26*$C25+$W$27)*((((Tv_heat-Tr_heat)/LN((Tv_heat-Tl_heat)/(Tr_heat-Tl_heat)))/((75-65)/LN((75-20)/(65-20))))^1))*$D$14*$AA$11","v":964.3736908289485},{"$f":"ROUND(((D25/$D$14)/((Tv_heat-Tr_heat)*1.163))*$E$14,IF($W$4=1,0,IF($W$4=2,2)))","v":83},0.44158489999999867,{"$f":"(($Y$23*$C25^4+$Y$24*$C25^3+$Y$25*$C25^2+$Y$26*$C25+$Y$27)*((((Tv_cool-Tr_cool)/LN((Tv_cool-Tl_cool)/(Tr_cool-Tl_cool)))/((16-18)/LN((16-27)/(18-27))))^S25))*$G$14*$AA$11","v":494.93477068487698},{"$f":"((G25/$G$14)/(IF((237.3*LN((RH*EXP(17.27*(Tl_cool/(Tl_cool+237.3))))))/(17.27-LN((RH*EXP(17.27*(Tl_cool/(Tl_cool+237.3))))))<((Tv_cool+Tr_cool)/2),1,IF(1/(1+((2258*((0.622/((p_atm/(1*611*EXP(17.27*(((Tv_cool+Tr_cool)/2)/(((Tv_cool+Tr_cool)/2)+237.3))))))-1)*1000-(0.622/((p_atm/(RH*611*EXP(17.27*(Tl_cool/(Tl_cool+237.3))))))-1)*1000))/(1005*(((Tv_cool+Tr_cool)/2)-Tl_cool))))*1.039+((-0.000729*$C25+0.001448)*(Tl_cool-((Tv_cool+Tr_cool)/2))+(0.016908*$C25-0.033574))*1.039>1,1,1/(1+((2258*((0.622/((p_atm/(1*611*EXP(17.27*(((Tv_cool+Tr_cool)/2)/(((Tv_cool+Tr_cool)/2)+237.3))))))-1)*1000-(0.622/((p_atm/(RH*611*EXP(17.27*(Tl_cool/(Tl_cool+237.3))))))-1)*1000))/(1005*(((Tv_cool+Tr_cool)/2)-Tl_cool))))*1.039+((-0.000729*$C25+0.001448)*(Tl_cool-((Tv_cool+Tr_cool)/2))+(0.016908*$C25-0.033574))*1.039))))*$H$14","v":494.93477068487698},{"$f":"ROUND(((H25/$H$14)/((Tr_cool-Tv_cool)*1.163))*$I$14,IF($W$4=1,0,IF($W$4=2,2)))","v":192},2.3629823999999924,35.5,43.5,4.0999999999999996,170,{"$f":"(Tl_heat+(($D25/$G$14)/(1006*$N25*$K$14)))*$M$14+$O$14","v":36.860655914931648},{"$f":"(Tl_cool-((G25/$G$14)/(1006*N25*$K$14)))*$M$14+$O$14","v":18.346793314446135},null,null,1,null,null,null,{"$f":"IF($W$16=1,AE25,IF($W$16=2,AL25,IF($W$16=3,AS25,IF($W$16=4,AZ25,IF($W$16=5,BG25,IF($W$16=6,BN25,IF($W$16=7,BU25,IF($W$16=8,CB25))))))))","v":-20.638280598544444},"b",{"$f":"IF($W$16=1,AG25,IF($W$16=2,AN25,IF($W$16=3,AU25,IF($W$16=4,BB25,IF($W$16=5,BI25,IF($W$16=6,BP25,IF($W$16=7,BW25,IF($W$16=8,CD25))))))))","v":-6.0592648545029952},"b",43.5,4.0999999999999996,170,"e",0.1875,"b",-1.7186999999999999,"b",36,2.7,86,-20.638280598544444,"b",-6.0592648545029952,"b",43.5,4.0999999999999996,170,-360.62494218047829,"b",0.95253155588610972,"b",44.8,7.2,223,-6.4342749126444518,"b",-1.8007451821026781,"b",44.8,5.7,144,4.0608619070466698,"b",2.4216316716249207,"b",42.4,5.7,238,-41.886569073423779,"b",1.9707367773017559,"b",42.4,5.9,168]
[null,0.8,8,{"$f":"(($W$23*$C26^4+$W$24*$C26^3+$W$25*$C26^2+$W$26*$C26+$W$27)*((((Tv_heat-Tr_heat)/LN((Tv_heat-Tl_heat)/(Tr_heat-Tl_heat)))/((75-65)/LN((75-20)/(65-20))))^1))*$D$14*$AA$11","v":1273.0142673567282},{"$f":"ROUND(((D26/$D$14)/((Tv_heat-Tr_heat)*1.163))*$E$14,IF($W$4=1,0,IF($W$4=2,2)))","v":109},0.76157209999999753,{"$f":"(($Y$23*$C26^4+$Y$24*$C26^3+$Y$25*$C26^2+$Y$26*$C26+$Y$27)*((((Tv_cool-Tr_cool)/LN((Tv_cool-Tl_cool)/(Tr_cool-Tl_cool)))/((16-18)/LN((16-27)/(18-27))))^S26))*$G$14*$AA$11","v":643.2800869373558},{"$f":"((G26/$G$14)/(IF((237.3*LN((RH*EXP(17.27*(Tl_cool/(Tl_cool+237.3))))))/(17.27-LN((RH*EXP(17.27*(Tl_cool/(Tl_cool+237.3))))))<((Tv_cool+Tr_cool)/2),1,IF(1/(1+((2258*((0.622/((p_atm/(1*611*EXP(17.27*(((Tv_cool+Tr_cool)/2)/(((Tv_cool+Tr_cool)/2)+237.3))))))-1)*1000-(0.622/((p_atm/(RH*611*EXP(17.27*(Tl_cool/(Tl_cool+237.3))))))-1)*1000))/(1005*(((Tv_cool+Tr_cool)/2)-Tl_cool))))*1.039+((-0.000729*$C26+0.001448)*(Tl_cool-((Tv_cool+Tr_cool)/2))+(0.016908*$C26-0.033574))*1.039>1,1,1/(1+((2258*((0.622/((p_atm/(1*611*EXP(17.27*(((Tv_cool+Tr_cool)/2)/(((Tv_cool+Tr_cool)/2)+237.3))))))-1)*1000-(0.622/((p_atm/(RH*611*EXP(17.27*(Tl_cool/(Tl_cool+237.3))))))-1)*1000))/(1005*(((Tv_cool+Tr_cool)/2)-Tl_cool))))*1.039+((-0.000729*$C26+0.001448)*(Tl_cool-((Tv_cool+Tr_cool)/2))+(0.016908*$C26-0.033574))*1.039))))*$H$14","v":643.2800869373558},{"$f":"ROUND(((H26/$H$14)/((Tr_cool-Tv_cool)*1.163))*$I$14,IF($W$4=1,0,IF($W$4=2,2)))","v":249},3.9742640999999872,41.5,49.5,7.7,228,{"$f":"(Tl_heat+(($D26/$G$14)/(1006*$N26*$K$14)))*$M$14+$O$14","v":36.594969447479272},{"$f":"(Tl_cool-((G26/$G$14)/(1006*N26*$K$14)))*$M$14+$O$14","v":18.614223294556535},null,null,1,null,null,null,{"$f":"IF($W$16=1,AE26,IF($W$16=2,AL26,IF($W$16=3,AS26,IF($W$16=4,AZ26,IF($W$16=5,BG26,IF($W$16=6,BN26,IF($W$16=7,BU26,IF($W$16=8,CB26))))))))","v":681.84022464223233},0,{"$f":"IF($W$16=1,AG26,IF($W$16=2,AN26,IF($W$16=3,AU26,IF($W$16=4,BB26,IF($W$16=5,BI26,IF($W$16=6,BP26,IF($W$16=7,BW26,IF($W$16=8,CD26))))))))","v":159.76851409190598},2,49.5,7.7,228,"f",155,null,50.75,{"$f":"AF26","v":0},40.5,4.5999999999999996,116,681.84022464223233,{"$f":"AF26","v":0},159.76851409190598,2,49.5,7.7,228,1211.686145735049,1.8148096460023067,6.8788639604089941,1.8148096460023067,49.5,11.5,287,80.732145519360756,1.8148096460023067,21.493052785950599,1.8148096460023067,49.5,8.4,194,251.43285822089797,1.8208138694468972,20.927015387969359,1.8208138694468972,47.9,9.6,291,185.13171418104602,1.8148096460023067,12.859546260831442,1.8208138694468972,47.9,10,228]
[null,1,10,{"$f":"(($W$23*$C27^4+$W$24*$C27^3+$W$25*$C27^2+$W$26*$C27+$W$27)*((((Tv_heat-Tr_heat)/LN((Tv_heat-Tl_heat)/(Tr_heat-Tl_heat)))/((75-65)/LN((75-20)/(65-20))))^1))*$D$14*$AA$11","v":1516.7324115641925},{"$f":"ROUND(((D27/$D$14)/((Tv_heat-Tr_heat)*1.163))*$E$14,IF($W$4=1,0,IF($W$4=2,2)))","v":130},1.0832899999999968,{"$f":"(($Y$23*$C27^4+$Y$24*$C27^3+$Y$25*$C27^2+$Y$26*$C27+$Y$27)*((((Tv_cool-Tr_cool)/LN((Tv_cool-Tl_cool)/(Tr_cool-Tl_cool)))/((16-18)/LN((16-27)/(18-27))))^S27))*$G$14*$AA$11","v":743.00681218329464},{"$f":"((G27/$G$14)/(IF((237.3*LN((RH*EXP(17.27*(Tl_cool/(Tl_cool+237.3))))))/(17.27-LN((RH*EXP(17.27*(Tl_cool/(Tl_cool+237.3))))))<((Tv_cool+Tr_cool)/2),1,IF(1/(1+((2258*((0.622/((p_atm/(1*611*EXP(17.27*(((Tv_cool+Tr_cool)/2)/(((Tv_cool+Tr_cool)/2)+237.3))))))-1)*1000-(0.622/((p_atm/(RH*611*EXP(17.27*(Tl_cool/(Tl_cool+237.3))))))-1)*1000))/(1005*(((Tv_cool+Tr_cool)/2)-Tl_cool))))*1.039+((-0.000729*$C27+0.001448)*(Tl_cool-((Tv_cool+Tr_cool)/2))+(0.016908*$C27-0.033574))*1.039>1,1,1/(1+((2258*((0.622/((p_atm/(1*611*EXP(17.27*(((Tv_cool+Tr_cool)/2)/(((Tv_cool+Tr_cool)/2)+237.3))))))-1)*1000-(0.622/((p_atm/(RH*611*EXP(17.27*(Tl_cool/(Tl_cool+237.3))))))-1)*1000))/(1005*(((Tv_cool+Tr_cool)/2)-Tl_cool))))*1.039+((-0.000729*$C27+0.001448)*(Tl_cool-((Tv_cool+Tr_cool)/2))+(0.016908*$C27-0.033574))*1.039))))*$H$14","v":743.00681218329464},{"$f":"ROUND(((H27/$H$14)/((Tr_cool-Tv_cool)*1.163))*$I$14,IF($W$4=1,0,IF($W$4=2,2)))","v":287},5.2798528999999821,46,54,13.2,281,{"$f":"(Tl_heat+(($D27/$G$14)/(1006*$N27*$K$14)))*$M$14+$O$14","v":36.04281888865404},{"$f":"(Tl_cool-((G27/$G$14)/(1006*N27*$K$14)))*$M$14+$O$14","v":19.141050306560086},null,null,1,null,null,null,{"$f":"IF($W$16=1,AE27,IF($W$16=2,AL27,IF($W$16=3,AS27,IF($W$16=4,AZ27,IF($W$16=5,BG27,IF($W$16=6,BN27,IF($W$16=7,BU27,IF($W$16=8,CB27))))))))","v":-893.10427896241674},0,{"$f":"IF($W$16=1,AG27,IF($W$16=2,AN27,IF($W$16=3,AU27,IF($W$16=4,BB27,IF($W$16=5,BI27,IF($W$16=6,BP27,IF($W$16=7,BW27,IF($W$16=8,CD27))))))))","v":-240.26078124661026},0,54,13.2,281,"g",53.25,null,-58.625,null,48,7.1,145,-893.10427896241674,null,-240.26078124661026,null,54,13.2,281,237.14568715178913,null,173.56390044315711,null,52.5,18,346,1067.2269380900811,null,110.71690101532077,null,52.5,14.4,229,1733.6902910445228,null,244.82210443399327,null,51.5,15.6,332,758.53531193271272,null,192.26108685256855,null,51.5,15.6,257]
[null,{"$f":"IF($S$7=1,NL!B28,IF(cal!$S$7=2,EN!B28,IF(cal!$S$7=3,DE!B28,IF(cal!$S$7=4,FR!B28,IF(cal!$S$7=5,NR!B28,IF(cal!$S$7=6,SP!B28,IF(cal!$S$7=7,SW!B28,IF(cal!$S$7=8,TS!B28,IF(cal!$S$7=9,ExtraTaal1!B28,IF(cal!$S$7=10,ExtraTaal2!B28,IF(cal!$S$7=11,ExtraTaal3!B28,)))))))))))","v":"Briza Net Zero S height 55,8 cm width 11 cm length 155 cm (Type 3)"},null,null,null,null,null,null,null,null,null,null,null,null,null,null,null,null,"n-value",null,null,null,"H",{"$f":"IF($W$16=1,AF28,IF($W$16=2,AM28,IF($W$16=3,AT28,IF($W$16=4,BA28,IF($W$16=5,BH28,IF($W$16=6,BO28,IF($W$16=7,BV28,IF($W$16=8,CC28))))))))*IF($W$4=1,1,IF($W$4=2,1/2.54))","v":55.8},"B",{"$f":"IF($W$16=1,AH28,IF($W$16=2,AO28,IF($W$16=3,AV28,IF($W$16=4,BC28,IF($W$16=5,BJ28,IF($W$16=6,BQ28,IF($W$16=7,BX28,IF($W$16=8,CE28))))))))*IF($W$4=1,1,IF($W$4=2,1/2.54))","v":11},"L",{"$f":"IF($W$16=1,AJ28,IF($W$16=2,AQ28,IF($W$16=3,AX28,IF($W$16=4,BE28,IF($W$16=5,BL28,IF($W$16=6,BS28,IF($W$16=7,BZ28,IF($W$16=8,CG28))))))))*IF($W$4=1,1,IF($W$4=2,1/2.54))","v":110},null,null,"H",{"$f":"IF(AI1=AH2,AL4,AM4)","v":52.1},"B",{"$f":"IF(AI1=AH2,AL3,AM3)","v":8.5},"L",{"$f":"IF(AI1=AH2,AL6,AM6)","v":122},72,"H",{"$f":"IF(AI1=AH2,AN4,AO4)","v":55.8},"B",{"$f":"IF(AI1=AH2,AN3,AO3)","v":11},"L",{"$f":"IF(AI1=AH2,AN6,AO6)","v":110},null,"H",{"$f":"IF(AI1=AH2,AP4,AQ4)","v":42},"B",{"$f":"IF(AI1=AH2,AP3,AQ3)","v":14},"L",{"$f":"IF(AI1=AH2,AP6,AQ6)","v":95},null,"H",{"$f":"AT28","v":42},{"$f":"AU28","v":"B"},14,"L",95,null,"H",{"$f":"IF(AI1=AH3,AR4,AS4)","v":56},"B",{"$f":"IF(AI1=AH2,AR3,AS3)","v":14},"L",{"$f":"IF(AI1=AH2,AR6,AS6)","v":95},null,"H",{"$f":"BH28","v":56},{"$f":"BI28","v":"B"},14,"L",95]
[null,0.2,2,{"$f":"(($W$29*$C29^4+$W$30*$C29^3+$W$31*$C29^2+$W$32*$C29+$W$33)*((((Tv_heat-Tr_heat)/LN((Tv_heat-Tl_heat)/(Tr_heat-Tl_heat)))/((75-65)/LN((75-20)/(65-20))))^1))*$D$14*$AA$11","v":239.27515841161488},{"$f":"ROUND(((D29/$D$14)/((Tv_heat-Tr_heat)*1.163))*$E$14,IF($W$4=1,0,IF($W$4=2,2)))","v":21},{"$f":"IF($AA$1=1,IF((POWER(((E29/$I$14)/1000)/$X$30,2)*100)*$J$14<0.01,0.01,(POWER(((E29/$I$14)/1000)/$X$30,2)*100)*$J$14),($X$30*(E29/$E$14)^$X$32)*$F$14)","v":3.6779399999999803E-2},{"$f":"(($Y$29*$C29^4+$Y$30*$C29^3+$Y$31*$C29^2+$Y$32*$C29+$Y$33)*((((Tv_cool-Tr_cool)/LN((Tv_cool-Tl_cool)/(Tr_cool-Tl_cool)))/((16-18)/LN((16-27)/(18-27))))^S29))*$G$14*$AA$11","v":85.308970779744428},{"$f":"((G29/$G$14)/(IF((237.3*LN((RH*EXP(17.27*(Tl_cool/(Tl_cool+237.3))))))/(17.27-LN((RH*EXP(17.27*(Tl_cool/(Tl_cool+237.3))))))<((Tv_cool+Tr_cool)/2),1,IF(1/(1+((2258*((0.622/((p_atm/(1*611*EXP(17.27*(((Tv_cool+Tr_cool)/2)/(((Tv_cool+Tr_cool)/2)+237.3))))))-1)*1000-(0.622/((p_atm/(RH*611*EXP(17.27*(Tl_cool/(Tl_cool+237.3))))))-1)*1000))/(1005*(((Tv_cool+Tr_cool)/2)-Tl_cool))))*1.039+((-0.000729*$C29+0.001448)*(Tl_cool-((Tv_cool+Tr_cool)/2))+(0.016908*$C29-0.033574))*1.039>1,1,1/(1+((2258*((0.622/((p_atm/(1*611*EXP(17.27*(((Tv_cool+Tr_cool)/2)/(((Tv_cool+Tr_cool)/2)+237.3))))))-1)*1000-(0.622/((p_atm/(RH*611*EXP(17.27*(Tl_cool/(Tl_cool+237.3))))))-1)*1000))/(1005*(((Tv_cool+Tr_cool)/2)-Tl_cool))))*1.039+((-0.000729*$C29+0.001448)*(Tl_cool-((Tv_cool+Tr_cool)/2))+(0.016908*$C29-0.033574))*1.039))))*$H$14","v":85.308970779744428},{"$f":"ROUND(((H29/$H$14)/((Tr_cool-Tv_cool)*1.163))*$I$14,IF($W$4=1,0,IF($W$4=2,2)))","v":33},{"$f":"IF($AA$1=1,IF((POWER(((I29/$I$14)/1000)/$X$30,2)*100)*$J$14<0.01,0.01,(POWER(((I29/$I$14)/1000)/$X$30,2)*100)*$J$14),($Z$30*(I29/$I$14)^$Z$32)*$J$14)","v":9.0822599999999531E-2},{"$f":"IF(AA29<28,\"<20\",L29-8)","v":22.5},{"$f":"IF(AA29<20,\"<20\",AA29)","v":30.5},{"$f":"AB29","v":2},{"$f":"AC29*$N$14","v":56},{"$f":"(Tl_heat+(($D29/$G$14)/(1006*$N29*$K$14)))*$M$14+$O$14","v":32.699529128648471},{"$f":"(Tl_cool-((G29/$G$14)/(1006*N29*$K$14)))*$M$14+$O$14","v":22.472226341655208},null,null,1,null,null,null,{"$f":"IF($W$16=1,AE29,IF($W$16=2,AL29,IF($W$16=3,AS29,IF($W$16=4,AZ29,IF($W$16=5,BG29,IF($W$16=6,BN29,IF($W$16=7,BU29,IF($W$16=8,CB29))))))))","v":1.0995266671270435E-3},{"$f":"IF($W$16=1,AF29,IF($W$16=2,AM29,IF($W$16=3,AT29,IF($W$16=4,BA29,IF($W$16=5,BH29,IF($W$16=6,BO29,IF($W$16=7,BV29,IF($W$16=8,CC29))))))))","v":"a"},{"$f":"IF($W$16=1,AG29,IF($W$16=2,AN29,IF($W$16=3,AU29,IF($W$16=4,BB29,IF($W$16=5,BI29,IF($W$16=6,BP29,IF($W$16=7,BW29,IF($W$16=8,CD29))))))))","v":-7.8840863498130201E-4},{"$f":"IF($W$16=1,AH29,IF($W$16=2,AO29,IF($W$16=3,AV29,IF($W$16=4,BC29,IF($W$16=5,BJ29,IF($W$16=6,BQ29,IF($W$16=7,BX29,IF($W$16=8,CE29))))))))","v":"a"},{"$f":"IF($W$16=1,AI29,IF($W$16=2,AP29,IF($W$16=3,AW29,IF($W$16=4,BD29,IF($W$16=5,BK29,IF($W$16=6,BR29,IF($W$16=7,BY29,IF($W$16=8,CF29))))))))","v":30.5},{"$f":"IF($W$16=1,AJ29,IF($W$16=2,AQ29,IF($W$16=3,AX29,IF($W$16=4,BE29,IF($W$16=5,BL29,IF($W$16=6,BS29,IF($W$16=7,BZ29,IF($W$16=8,CG29))))))))","v":2},{"$f":"IF($W$16=1,AK29,IF($W$16=2,AR29,IF($W$16=3,AY29,IF($W$16=4,BF29,IF($W$16=5,BM29,IF($W$16=6,BT29,IF($W$16=7,CA29,IF($W$16=8,CH29))))))))","v":56},"c",0,"a",null,"a",23.5,1.1000000000000001,39,1.0995266671270435E-3,"a",-7.8840863498130201E-4,"a",30.5,2,56,-2.6386736307091345E-3,"a",null,"a",32.6,2.6,146,null,"a",null,"a",32.6,2.2999999999999998,73,null,"a",null,"a",31.1,2.8,153,-0.26784940737322377,"a",null,"a",31.1,2.2999999999999998,112]
[null,0.4,4,{"$f":"(($W$29*$C30^4+$W$30*$C30^3+$W$31*$C30^2+$W$32*$C30+$W$33)*((((Tv_heat-Tr_heat)/LN((Tv_heat-Tl_heat)/(Tr_heat-Tl_heat)))/((75-65)/LN((75-20)/(65-20))))^1))*$D$14*$AA$11","v":927.2106617910033},{"$f":"ROUND(((D30/$D$14)/((Tv_heat-Tr_heat)*1.163))*$E$14,IF($W$4=1,0,IF($W$4=2,2)))","v":80},{"$f":"IF($AA$1=1,IF((POWER(((E30/$I$14)/1000)/$X$30,2)*100)*$J$14<0.01,0.01,(POWER(((E30/$I$14)/1000)/$X$30,2)*100)*$J$14),($X$30*(E30/$E$14)^$X$32)*$F$14)","v":0.53375999999999713},{"$f":"(($Y$29*$C30^4+$Y$30*$C30^3+$Y$31*$C30^2+$Y$32*$C30+$Y$33)*((((Tv_cool-Tr_cool)/LN((Tv_cool-Tl_cool)/(Tr_cool-Tl_cool)))/((16-18)/LN((16-27)/(18-27))))^S30))*$G$14*$AA$11","v":468.30913485848373},{"$f":"((G30/$G$14)/(IF((237.3*LN((RH*EXP(17.27*(Tl_cool/(Tl_cool+237.3))))))/(17.27-LN((RH*EXP(17.27*(Tl_cool/(Tl_cool+237.3))))))<((Tv_cool+Tr_cool)/2),1,IF(1/(1+((2258*((0.622/((p_atm/(1*611*EXP(17.27*(((Tv_cool+Tr_cool)/2)/(((Tv_cool+Tr_cool)/2)+237.3))))))-1)*1000-(0.622/((p_atm/(RH*611*EXP(17.27*(Tl_cool/(Tl_cool+237.3))))))-1)*1000))/(1005*(((Tv_cool+Tr_cool)/2)-Tl_cool))))*1.039+((-0.000729*$C30+0.001448)*(Tl_cool-((Tv_cool+Tr_cool)/2))+(0.016908*$C30-0.033574))*1.039>1,1,1/(1+((2258*((0.622/((p_atm/(1*611*EXP(17.27*(((Tv_cool+Tr_cool)/2)/(((Tv_cool+Tr_cool)/2)+237.3))))))-1)*1000-(0.622/((p_atm/(RH*611*EXP(17.27*(Tl_cool/(Tl_cool+237.3))))))-1)*1000))/(1005*(((Tv_cool+Tr_cool)/2)-Tl_cool))))*1.039+((-0.000729*$C30+0.001448)*(Tl_cool-((Tv_cool+Tr_cool)/2))+(0.016908*$C30-0.033574))*1.039))))*$H$14","v":468.30913485848373},{"$f":"ROUND(((H30/$H$14)/((Tr_cool-Tv_cool)*1.163))*$I$14,IF($W$4=1,0,IF($W$4=2,2)))","v":181},{"$f":"IF($AA$1=1,IF((POWER(((I30/$I$14)/1000)/$X$30,2)*100)*$J$14<0.01,0.01,(POWER(((I30/$I$14)/1000)/$X$30,2)*100)*$J$14),($Z$30*(I30/$I$14)^$Z$32)*$J$14)","v":2.7322673999999854},{"$f":"IF(AA30<28,\"<20\",L30-8)","v":30},{"$f":"IF(AA30<20,\"<20\",AA30)","v":38},3.4,130,{"$f":"(Tl_heat+(($D30/$G$14)/(1006*$N30*$K$14)))*$M$14+$O$14","v":41.19888884459418},{"$f":"(Tl_cool-((G30/$G$14)/(1006*N30*$K$14)))*$M$14+$O$14","v":16.293012145053623},null,null,1,null,null,null,-3.667333078701452E-2,1.09500719969601,-1.42406001391585E-3,1.09500719969601,38,3.4,130,"d",0,1.638736,null,{"$f":"AF30","v":1.638736},26,2.1,65,-3.667333078701452E-2,1.09500719969601,-1.42406001391585E-3,1.09500719969601,38,3.4,130,1.4785661107548795,1.2048931502827451E-4,9.571949914823337E-2,1.2048931502827451E-4,38.200000000000003,4.8,221,1.0636516905207274,1.2048931502827451E-4,0.17123517161163615,1.2048931502827451E-4,38.200000000000003,4.0999999999999996,149,-0.88150849635886974,2.364386444169621E-4,-0.26156927868117719,2.364386444169621E-4,37.1,5.4,236,7.5452088334921381,1.2048931502827451E-4,-0.20123481722729702,2.364386444169621E-4,37.1,4.2,183]
[null,0.6,6,{"$f":"(($W$29*$C31^4+$W$30*$C31^3+$W$31*$C31^2+$W$32*$C31+$W$33)*((((Tv_heat-Tr_heat)/LN((Tv_heat-Tl_heat)/(Tr_heat-Tl_heat)))/((75-65)/LN((75-20)/(65-20))))^1))*$D$14*$AA$11","v":1513.5360374034033},{"$f":"ROUND(((D31/$D$14)/((Tv_heat-Tr_heat)*1.163))*$E$14,IF($W$4=1,0,IF($W$4=2,2)))","v":130},1.4094599999999924,{"$f":"(($Y$29*$C31^4+$Y$30*$C31^3+$Y$31*$C31^2+$Y$32*$C31+$Y$33)*((((Tv_cool-Tr_cool)/LN((Tv_cool-Tl_cool)/(Tr_cool-Tl_cool)))/((16-18)/LN((16-27)/(18-27))))^S31))*$G$14*$AA$11","v":776.69046995967869},{"$f":"((G31/$G$14)/(IF((237.3*LN((RH*EXP(17.27*(Tl_cool/(Tl_cool+237.3))))))/(17.27-LN((RH*EXP(17.27*(Tl_cool/(Tl_cool+237.3))))))<((Tv_cool+Tr_cool)/2),1,IF(1/(1+((2258*((0.622/((p_atm/(1*611*EXP(17.27*(((Tv_cool+Tr_cool)/2)/(((Tv_cool+Tr_cool)/2)+237.3))))))-1)*1000-(0.622/((p_atm/(RH*611*EXP(17.27*(Tl_cool/(Tl_cool+237.3))))))-1)*1000))/(1005*(((Tv_cool+Tr_cool)/2)-Tl_cool))))*1.039+((-0.000729*$C31+0.001448)*(Tl_cool-((Tv_cool+Tr_cool)/2))+(0.016908*$C31-0.033574))*1.039>1,1,1/(1+((2258*((0.622/((p_atm/(1*611*EXP(17.27*(((Tv_cool+Tr_cool)/2)/(((Tv_cool+Tr_cool)/2)+237.3))))))-1)*1000-(0.622/((p_atm/(RH*611*EXP(17.27*(Tl_cool/(Tl_cool+237.3))))))-1)*1000))/(1005*(((Tv_cool+Tr_cool)/2)-Tl_cool))))*1.039+((-0.000729*$C31+0.001448)*(Tl_cool-((Tv_cool+Tr_cool)/2))+(0.016908*$C31-0.033574))*1.039))))*$H$14","v":776.69046995967869},{"$f":"ROUND(((H31/$H$14)/((Tr_cool-Tv_cool)*1.163))*$I$14,IF($W$4=1,0,IF($W$4=2,2)))","v":301},7.5561233999999606,36.5,44.5,6.5,227,{"$f":"(Tl_heat+(($D31/$G$14)/(1006*$N31*$K$14)))*$M$14+$O$14","v":39.817320900261265},{"$f":"(Tl_cool-((G31/$G$14)/(1006*N31*$K$14)))*$M$14+$O$14","v":16.830487082572667},null,null,1,null,null,null,-32.00210784125337,"b",-9.344563299573192,"b",44.5,6.5,227,"e",0.29430000000000001,"b",-2.6974,"b",35.5,4,111,-32.00210784125337,"b",-9.344563299573192,"b",44.5,6.5,227,-6.6767123139735007,"b",0.78279583120261287,"b",45,8,298,-4.2358848975583312,"b",-1.4664081399657958,"b",45,7.4,220,10.601704948047237,"b",4.6734617843004802,"b",44.5,10,321,-62.125133979184696,"b",3.3370194060807656,"b",44.5,7.5,260]
[null,0.8,8,{"$f":"(($W$29*$C32^4+$W$30*$C32^3+$W$31*$C32^2+$W$32*$C32+$W$33)*((((Tv_heat-Tr_heat)/LN((Tv_heat-Tl_heat)/(Tr_heat-Tl_heat)))/((75-65)/LN((75-20)/(65-20))))^1))*$D$14*$AA$11","v":1997.974424539804},{"$f":"ROUND(((D32/$D$14)/((Tv_heat-Tr_heat)*1.163))*$E$14,IF($W$4=1,0,IF($W$4=2,2)))","v":172},2.4673055999999867,{"$f":"(($Y$29*$C32^4+$Y$30*$C32^3+$Y$31*$C32^2+$Y$32*$C32+$Y$33)*((((Tv_cool-Tr_cool)/LN((Tv_cool-Tl_cool)/(Tr_cool-Tl_cool)))/((16-18)/LN((16-27)/(18-27))))^S32))*$G$14*$AA$11","v":1009.637638819612},{"$f":"((G32/$G$14)/(IF((237.3*LN((RH*EXP(17.27*(Tl_cool/(Tl_cool+237.3))))))/(17.27-LN((RH*EXP(17.27*(Tl_cool/(Tl_cool+237.3))))))<((Tv_cool+Tr_cool)/2),1,IF(1/(1+((2258*((0.622/((p_atm/(1*611*EXP(17.27*(((Tv_cool+Tr_cool)/2)/(((Tv_cool+Tr_cool)/2)+237.3))))))-1)*1000-(0.622/((p_atm/(RH*611*EXP(17.27*(Tl_cool/(Tl_cool+237.3))))))-1)*1000))/(1005*(((Tv_cool+Tr_cool)/2)-Tl_cool))))*1.039+((-0.000729*$C32+0.001448)*(Tl_cool-((Tv_cool+Tr_cool)/2))+(0.016908*$C32-0.033574))*1.039>1,1,1/(1+((2258*((0.622/((p_atm/(1*611*EXP(17.27*(((Tv_cool+Tr_cool)/2)/(((Tv_cool+Tr_cool)/2)+237.3))))))-1)*1000-(0.622/((p_atm/(RH*611*EXP(17.27*(Tl_cool/(Tl_cool+237.3))))))-1)*1000))/(1005*(((Tv_cool+Tr_cool)/2)-Tl_cool))))*1.039+((-0.000729*$C32+0.001448)*(Tl_cool-((Tv_cool+Tr_cool)/2))+(0.016908*$C32-0.033574))*1.039))))*$H$14","v":1009.637638819612},{"$f":"ROUND(((H32/$H$14)/((Tr_cool-Tv_cool)*1.163))*$I$14,IF($W$4=1,0,IF($W$4=2,2)))","v":391},12.750275399999932,42.5,50.5,11.5,331,{"$f":"(Tl_heat+(($D32/$G$14)/(1006*$N32*$K$14)))*$M$14+$O$14","v":37.940723956147949},{"$f":"(Tl_cool-((G32/$G$14)/(1006*N32*$K$14)))*$M$14+$O$14","v":17.934002982559797},null,null,1,null,null,null,1068.508954252284,0,250.02480896377855,2,50.5,11.5,331,"f",243.26,null,79.649000000000001,{"$f":"AF32","v":0},42.5,6.6,148,1068.508954252284,{"$f":"AF32","v":0},250.02480896377855,2,50.5,11.5,331,142.06849285698914,1.8145625016160318,9.4024328441996587,1.8145625016160318,50.5,14,381,114.94135317144828,1.8145625016160318,22.25052488649974,1.8145625016160318,50.5,12.6,278,390.82080301438873,1.8120794599034276,26.676957361613045,1.8120794599034276,50.5,18,398,307.8019217888039,1.8145625016160318,23.256603866829582,1.8120794599034276,50.5,12.8,328]
[null,1,10,{"$f":"(($W$29*$C33^4+$W$30*$C33^3+$W$31*$C33^2+$W$32*$C33+$W$33)*((((Tv_heat-Tr_heat)/LN((Tv_heat-Tl_heat)/(Tr_heat-Tl_heat)))/((75-65)/LN((75-20)/(65-20))))^1))*$D$14*$AA$11","v":2380.4148250163921},{"$f":"ROUND(((D33/$D$14)/((Tv_heat-Tr_heat)*1.163))*$E$14,IF($W$4=1,0,IF($W$4=2,2)))","v":205},3.5048849999999812,{"$f":"(($Y$29*$C33^4+$Y$30*$C33^3+$Y$31*$C33^2+$Y$32*$C33+$Y$33)*((((Tv_cool-Tr_cool)/LN((Tv_cool-Tl_cool)/(Tr_cool-Tl_cool)))/((16-18)/LN((16-27)/(18-27))))^S33))*$G$14*$AA$11","v":1166.0361835426631},{"$f":"((G33/$G$14)/(IF((237.3*LN((RH*EXP(17.27*(Tl_cool/(Tl_cool+237.3))))))/(17.27-LN((RH*EXP(17.27*(Tl_cool/(Tl_cool+237.3))))))<((Tv_cool+Tr_cool)/2),1,IF(1/(1+((2258*((0.622/((p_atm/(1*611*EXP(17.27*(((Tv_cool+Tr_cool)/2)/(((Tv_cool+Tr_cool)/2)+237.3))))))-1)*1000-(0.622/((p_atm/(RH*611*EXP(17.27*(Tl_cool/(Tl_cool+237.3))))))-1)*1000))/(1005*(((Tv_cool+Tr_cool)/2)-Tl_cool))))*1.039+((-0.000729*$C33+0.001448)*(Tl_cool-((Tv_cool+Tr_cool)/2))+(0.016908*$C33-0.033574))*1.039>1,1,1/(1+((2258*((0.622/((p_atm/(1*611*EXP(17.27*(((Tv_cool+Tr_cool)/2)/(((Tv_cool+Tr_cool)/2)+237.3))))))-1)*1000-(0.622/((p_atm/(RH*611*EXP(17.27*(Tl_cool/(Tl_cool+237.3))))))-1)*1000))/(1005*(((Tv_cool+Tr_cool)/2)-Tl_cool))))*1.039+((-0.000729*$C33+0.001448)*(Tl_cool-((Tv_cool+Tr_cool)/2))+(0.016908*$C33-0.033574))*1.039))))*$H$14","v":1166.0361835426631},{"$f":"ROUND(((H33/$H$14)/((Tr_cool-Tv_cool)*1.163))*$I$14,IF($W$4=1,0,IF($W$4=2,2)))","v":451},16.96364339999991,48,56,19.7,392,{"$f":"(Tl_heat+(($D33/$G$14)/(1006*$N33*$K$14)))*$M$14+$O$14","v":38.048645398902565},{"$f":"(Tl_cool-((G33/$G$14)/(1006*N33*$K$14)))*$M$14+$O$14","v":18.158947012982797},null,null,1,null,null,null,-1399.6368650421423,0,-376.30360318598724,0,56,19.7,392,"g",83.572999999999993,null,-92.009,null,50.5,10.1,188,-1399.6368650421423,null,-376.30360318598724,null,56,19.7,392,2161.5461388359286,null,290.7155392231125,null,55,24,448,1703.0145175312946,null,199.95460885224878,null,55,20.9,364,2743.7411285852236,null,404.43855949026653,null,54.5,28.8,467,1146.7350020499362,null,292.49539559526102,null,54.5,22.3,385]
[null,{"$f":"IF($S$7=1,NL!B34,IF(cal!$S$7=2,EN!B34,IF(cal!$S$7=3,DE!B34,IF(cal!$S$7=4,FR!B34,IF(cal!$S$7=5,NR!B34,IF(cal!$S$7=6,SP!B34,IF(cal!$S$7=7,SW!B34,IF(cal!$S$7=8,TS!B34,IF(cal!$S$7=9,ExtraTaal1!B34,IF(cal!$S$7=10,ExtraTaal2!B34,IF(cal!$S$7=11,ExtraTaal3!B34,)))))))))))","v":"Briza Net Zero S height 55,8 cm width 11 cm length 190 cm (Type 4)"},null,null,null,null,null,null,null,null,null,null,null,null,null,null,null,null,"n-value",null,null,null,"H",{"$f":"IF($W$16=1,AF34,IF($W$16=2,AM34,IF($W$16=3,AT34,IF($W$16=4,BA34,IF($W$16=5,BH34,IF($W$16=6,BO34,IF($W$16=7,BV34,IF($W$16=8,CC34))))))))*IF($W$4=1,1,IF($W$4=2,1/2.54))","v":55.8},"B",{"$f":"IF($W$16=1,AH34,IF($W$16=2,AO34,IF($W$16=3,AV34,IF($W$16=4,BC34,IF($W$16=5,BJ34,IF($W$16=6,BQ34,IF($W$16=7,BX34,IF($W$16=8,CE34))))))))*IF($W$4=1,1,IF($W$4=2,1/2.54))","v":11},"L",{"$f":"IF($W$16=1,AJ34,IF($W$16=2,AQ34,IF($W$16=3,AX34,IF($W$16=4,BE34,IF($W$16=5,BL34,IF($W$16=6,BS34,IF($W$16=7,BZ34,IF($W$16=8,CG34))))))))*IF($W$4=1,1,IF($W$4=2,1/2.54))","v":155},null,null,"H",{"$f":"IF(AI1=AH2,AL4,AM4)","v":52.1},"B",{"$f":"IF(AI1=AH2,AL3,AM3)","v":8.5},"L",{"$f":"IF(AI1=AH2,AL7,AM7)","v":163},113,"H",{"$f":"IF(AI1=AH2,AN4,AO4)","v":55.8},"B",{"$f":"IF(AI1=AH2,AN3,AO3)","v":11},"L",{"$f":"IF(AI1=AH2,AN7,AO7)","v":155},null,"H",{"$f":"IF(AI1=AH2,AP4,AQ4)","v":42},"B",{"$f":"IF(AI1=AH2,AP3,AQ3)","v":14},"L",{"$f":"IF(AI1=AH2,AP7,AQ7)","v":125},null,"H",{"$f":"AT34","v":42},{"$f":"AU34","v":"B"},14,"L",125,null,"H",{"$f":"IF(AI1=AH3,AR4,AS4)","v":56},"B",{"$f":"IF(AI1=AH2,AR3,AS3)","v":14},"L",{"$f":"IF(AI1=AH2,AR7,AS7)","v":125},null,"H",{"$f":"BH34","v":56},{"$f":"BI34","v":"B"},14,"L",125]
[null,0.2,2,{"$f":"(($W$35*$C35^4+$W$36*$C35^3+$W$37*$C35^2+$W$38*$C35+$W$39)*((((Tv_heat-Tr_heat)/LN((Tv_heat-Tl_heat)/(Tr_heat-Tl_heat)))/((75-65)/LN((75-20)/(65-20))))^1))*$D$14*$AA$11","v":315.50096472998041},{"$f":"ROUND(((D35/$D$14)/((Tv_heat-Tr_heat)*1.163))*$E$14,IF($W$4=1,0,IF($W$4=2,2)))","v":27},{"$f":"IF($AA$1=1,IF((POWER(((E35/$I$14)/1000)/$X$36,2)*100)*$J$14<0.01,0.01,(POWER(((E35/$I$14)/1000)/$X$36,2)*100)*$J$14),($X$36*(E35/$E$14)^$X$38)*$F$14)","v":7.3118699999999967E-2},{"$f":"(($Y$35*$C35^4+$Y$36*$C35^3+$Y$37*$C35^2+$Y$38*$C35+$Y$39)*((((Tv_cool-Tr_cool)/LN((Tv_cool-Tl_cool)/(Tr_cool-Tl_cool)))/((16-18)/LN((16-27)/(18-27))))^S35))*$G$14*$AA$11","v":112.48229895138553},{"$f":"((G35/$G$14)/(IF((237.3*LN((RH*EXP(17.27*(Tl_cool/(Tl_cool+237.3))))))/(17.27-LN((RH*EXP(17.27*(Tl_cool/(Tl_cool+237.3))))))<((Tv_cool+Tr_cool)/2),1,IF(1/(1+((2258*((0.622/((p_atm/(1*611*EXP(17.27*(((Tv_cool+Tr_cool)/2)/(((Tv_cool+Tr_cool)/2)+237.3))))))-1)*1000-(0.622/((p_atm/(RH*611*EXP(17.27*(Tl_cool/(Tl_cool+237.3))))))-1)*1000))/(1005*(((Tv_cool+Tr_cool)/2)-Tl_cool))))*1.039+((-0.000729*$C35+0.001448)*(Tl_cool-((Tv_cool+Tr_cool)/2))+(0.016908*$C35-0.033574))*1.039>1,1,1/(1+((2258*((0.622/((p_atm/(1*611*EXP(17.27*(((Tv_cool+Tr_cool)/2)/(((Tv_cool+Tr_cool)/2)+237.3))))))-1)*1000-(0.622/((p_atm/(RH*611*EXP(17.27*(Tl_cool/(Tl_cool+237.3))))))-1)*1000))/(1005*(((Tv_cool+Tr_cool)/2)-Tl_cool))))*1.039+((-0.000729*$C35+0.001448)*(Tl_cool-((Tv_cool+Tr_cool)/2))+(0.016908*$C35-0.033574))*1.039))))*$H$14","v":112.48229895138553},{"$f":"ROUND(((H35/$H$14)/((Tr_cool-Tv_cool)*1.163))*$I$14,IF($W$4=1,0,IF($W$4=2,2)))","v":44},{"$f":"IF($AA$1=1,IF((POWER(((I35/$I$14)/1000)/$X$36,2)*100)*$J$14<0.01,0.01,(POWER(((I35/$I$14)/1000)/$X$36,2)*100)*$J$14),($Z$36*(I35/$I$14)^$Z$38)*$J$14)","v":0.19418079999999993},{"$f":"IF(AA35<28,\"<20\",L35-8)","v":24},{"$f":"IF(AA35<20,\"<20\",AA35)","v":32},{"$f":"AB35","v":2.1},{"$f":"AC35*$N$14","v":60},{"$f":"(Tl_heat+(($D35/$G$14)/(1006*$N35*$K$14)))*$M$14+$O$14","v":35.628866240925582},{"$f":"(Tl_cool-((G35/$G$14)/(1006*N35*$K$14)))*$M$14+$O$14","v":21.428001808845313},null,null,1,null,null,null,{"$f":"IF($W$16=1,AE35,IF($W$16=2,AL35,IF($W$16=3,AS35,IF($W$16=4,AZ35,IF($W$16=5,BG35,IF($W$16=6,BN35,IF($W$16=7,BU35,IF($W$16=8,CB35))))))))","v":7.6991717687673511E-4},{"$f":"IF($W$16=1,AF35,IF($W$16=2,AM35,IF($W$16=3,AT35,IF($W$16=4,BA35,IF($W$16=5,BH35,IF($W$16=6,BO35,IF($W$16=7,BV35,IF($W$16=8,CC35))))))))","v":"a"},{"$f":"IF($W$16=1,AG35,IF($W$16=2,AN35,IF($W$16=3,AU35,IF($W$16=4,BB35,IF($W$16=5,BI35,IF($W$16=6,BP35,IF($W$16=7,BW35,IF($W$16=8,CD35))))))))","v":-1.0160190827721899E-3},{"$f":"IF($W$16=1,AH35,IF($W$16=2,AO35,IF($W$16=3,AV35,IF($W$16=4,BC35,IF($W$16=5,BJ35,IF($W$16=6,BQ35,IF($W$16=7,BX35,IF($W$16=8,CE35))))))))","v":"a"},{"$f":"IF($W$16=1,AI35,IF($W$16=2,AP35,IF($W$16=3,AW35,IF($W$16=4,BD35,IF($W$16=5,BK35,IF($W$16=6,BR35,IF($W$16=7,BY35,IF($W$16=8,CF35))))))))","v":32},{"$f":"IF($W$16=1,AJ35,IF($W$16=2,AQ35,IF($W$16=3,AX35,IF($W$16=4,BE35,IF($W$16=5,BL35,IF($W$16=6,BS35,IF($W$16=7,BZ35,IF($W$16=8,CG35))))))))","v":2.1},{"$f":"IF($W$16=1,AK35,IF($W$16=2,AR35,IF($W$16=3,AY35,IF($W$16=4,BF35,IF($W$16=5,BM35,IF($W$16=6,BT35,IF($W$16=7,CA35,IF($W$16=8,CH35))))))))","v":60},"c",0,"a",null,"a",21,1.2,43,7.6991717687673511E-4,"a",-1.0160190827721899E-3,"a",32,2.1,60,null,"a",null,"a",33.700000000000003,2.8,173,null,"a",null,"a",33.700000000000003,2.5,89,null,"a",null,"a",33,2.8,182,null,"a",null,"a",33,2.7,126]
[null,0.4,4,{"$f":"(($W$35*$C36^4+$W$36*$C36^3+$W$37*$C36^2+$W$38*$C36+$W$39)*((((Tv_heat-Tr_heat)/LN((Tv_heat-Tl_heat)/(Tr_heat-Tl_heat)))/((75-65)/LN((75-20)/(65-20))))^1))*$D$14*$AA$11","v":1222.6208945391088},{"$f":"ROUND(((D36/$D$14)/((Tv_heat-Tr_heat)*1.163))*$E$14,IF($W$4=1,0,IF($W$4=2,2)))","v":105},{"$f":"IF($AA$1=1,IF((POWER(((E36/$I$14)/1000)/$X$36,2)*100)*$J$14<0.01,0.01,(POWER(((E36/$I$14)/1000)/$X$36,2)*100)*$J$14),($X$36*(E36/$E$14)^$X$38)*$F$14)","v":1.1058074999999996},{"$f":"(($Y$35*$C36^4+$Y$36*$C36^3+$Y$37*$C36^2+$Y$38*$C36+$Y$39)*((((Tv_cool-Tr_cool)/LN((Tv_cool-Tl_cool)/(Tr_cool-Tl_cool)))/((16-18)/LN((16-27)/(18-27))))^S36))*$G$14*$AA$11","v":617.52393346788472},{"$f":"((G36/$G$14)/(IF((237.3*LN((RH*EXP(17.27*(Tl_cool/(Tl_cool+237.3))))))/(17.27-LN((RH*EXP(17.27*(Tl_cool/(Tl_cool+237.3))))))<((Tv_cool+Tr_cool)/2),1,IF(1/(1+((2258*((0.622/((p_atm/(1*611*EXP(17.27*(((Tv_cool+Tr_cool)/2)/(((Tv_cool+Tr_cool)/2)+237.3))))))-1)*1000-(0.622/((p_atm/(RH*611*EXP(17.27*(Tl_cool/(Tl_cool+237.3))))))-1)*1000))/(1005*(((Tv_cool+Tr_cool)/2)-Tl_cool))))*1.039+((-0.000729*$C36+0.001448)*(Tl_cool-((Tv_cool+Tr_cool)/2))+(0.016908*$C36-0.033574))*1.039>1,1,1/(1+((2258*((0.622/((p_atm/(1*611*EXP(17.27*(((Tv_cool+Tr_cool)/2)/(((Tv_cool+Tr_cool)/2)+237.3))))))-1)*1000-(0.622/((p_atm/(RH*611*EXP(17.27*(Tl_cool/(Tl_cool+237.3))))))-1)*1000))/(1005*(((Tv_cool+Tr_cool)/2)-Tl_cool))))*1.039+((-0.000729*$C36+0.001448)*(Tl_cool-((Tv_cool+Tr_cool)/2))+(0.016908*$C36-0.033574))*1.039))))*$H$14","v":617.52393346788472},{"$f":"ROUND(((H36/$H$14)/((Tr_cool-Tv_cool)*1.163))*$I$14,IF($W$4=1,0,IF($W$4=2,2)))","v":239},{"$f":"IF($AA$1=1,IF((POWER(((I36/$I$14)/1000)/$X$36,2)*100)*$J$14<0.01,0.01,(POWER(((I36/$I$14)/1000)/$X$36,2)*100)*$J$14),)","v":5.7292362999999984},{"$f":"IF(AA36<28,\"<20\",L36-8)","v":31},{"$f":"IF(AA36<20,\"<20\",AA36)","v":39},3.8,176,{"$f":"(Tl_heat+(($D36/$G$14)/(1006*$N36*$K$14)))*$M$14+$O$14","v":40.647010512528865},{"$f":"(Tl_cool-((G36/$G$14)/(1006*N36*$K$14)))*$M$14+$O$14","v":16.571564494768456},null,null,1,null,null,null,-3.1152458018706249E-2,0.99850336658458894,-1.6377226323009122E-3,0.99850336658458894,39,3.8,176,"d",0,1.5314559999999999,null,{"$f":"AF36","v":1.5314559999999999},28.5,2.5,71,-3.1152458018706249E-2,0.99850336658458894,-1.6377226323009122E-3,0.99850336658458894,39,3.8,176,1.5118660666407935,1.2932915211001514E-4,0.18632215403912855,1.2932915211001514E-4,38.5,5.5,268,1.4267610870824441,1.2932915211001514E-4,0.21151846586988798,1.2932915211001514E-4,38.5,4.5,158,-1.7032731680051472,2.7169905751214276E-4,-0.31193329602618908,2.7169905751214276E-4,38.799999999999997,5.5,270,1.1344894569539592,1.2932915211001514E-4,-0.33780933907453081,2.7169905751214276E-4,38.799999999999997,5.2,228]
[null,0.6,6,{"$f":"(($W$35*$C37^4+$W$36*$C37^3+$W$37*$C37^2+$W$38*$C37+$W$39)*((((Tv_heat-Tr_heat)/LN((Tv_heat-Tl_heat)/(Tr_heat-Tl_heat)))/((75-65)/LN((75-20)/(65-20))))^1))*$D$14*$AA$11","v":1995.7186295037375},{"$f":"ROUND(((D37/$D$14)/((Tv_heat-Tr_heat)*1.163))*$E$14,IF($W$4=1,0,IF($W$4=2,2)))","v":172},2.9672751999999991,{"$f":"(($Y$35*$C37^4+$Y$36*$C37^3+$Y$37*$C37^2+$Y$38*$C37+$Y$39)*((((Tv_cool-Tr_cool)/LN((Tv_cool-Tl_cool)/(Tr_cool-Tl_cool)))/((16-18)/LN((16-27)/(18-27))))^S37))*$G$14*$AA$11","v":1024.1361147388939},{"$f":"((G37/$G$14)/(IF((237.3*LN((RH*EXP(17.27*(Tl_cool/(Tl_cool+237.3))))))/(17.27-LN((RH*EXP(17.27*(Tl_cool/(Tl_cool+237.3))))))<((Tv_cool+Tr_cool)/2),1,IF(1/(1+((2258*((0.622/((p_atm/(1*611*EXP(17.27*(((Tv_cool+Tr_cool)/2)/(((Tv_cool+Tr_cool)/2)+237.3))))))-1)*1000-(0.622/((p_atm/(RH*611*EXP(17.27*(Tl_cool/(Tl_cool+237.3))))))-1)*1000))/(1005*(((Tv_cool+Tr_cool)/2)-Tl_cool))))*1.039+((-0.000729*$C37+0.001448)*(Tl_cool-((Tv_cool+Tr_cool)/2))+(0.016908*$C37-0.033574))*1.039>1,1,1/(1+((2258*((0.622/((p_atm/(1*611*EXP(17.27*(((Tv_cool+Tr_cool)/2)/(((Tv_cool+Tr_cool)/2)+237.3))))))-1)*1000-(0.622/((p_atm/(RH*611*EXP(17.27*(Tl_cool/(Tl_cool+237.3))))))-1)*1000))/(1005*(((Tv_cool+Tr_cool)/2)-Tl_cool))))*1.039+((-0.000729*$C37+0.001448)*(Tl_cool-((Tv_cool+Tr_cool)/2))+(0.016908*$C37-0.033574))*1.039))))*$H$14","v":1024.1361147388939},{"$f":"ROUND(((H37/$H$14)/((Tr_cool-Tv_cool)*1.163))*$I$14,IF($W$4=1,0,IF($W$4=2,2)))","v":396},15.728644799999996,37.5,45.5,8.1999999999999993,299,{"$f":"(Tl_heat+(($D37/$G$14)/(1006*$N37*$K$14)))*$M$14+$O$14","v":39.83837777735156},{"$f":"(Tl_cool-((G37/$G$14)/(1006*N37*$K$14)))*$M$14+$O$14","v":16.819607413961258},null,null,1,null,null,null,-42.348882815007279,"b",-12.331668705017123,"b",45.5,8.1999999999999993,299,"e",0.38800000000000001,"b",-3.5568,"b",36,5.4,131,-42.348882815007279,"b",-12.331668705017123,"b",45.5,8.1999999999999993,299,-6.7861908639932995,"b",-0.25188697625825573,"b",45.3,10.3,373,-10.163656045029517,"b",-2.3124323057321829,"b",45.3,9,227,26.268050048769958,"b",5.5712720658712023,"b",45.5,10,360,-6.6531513749360087,"b",6.5041472755333203,"b",45.5,9.1,304]
[null,0.8,8,{"$f":"(($W$35*$C38^4+$W$36*$C38^3+$W$37*$C38^2+$W$38*$C38+$W$39)*((((Tv_heat-Tr_heat)/LN((Tv_heat-Tl_heat)/(Tr_heat-Tl_heat)))/((75-65)/LN((75-20)/(65-20))))^1))*$D$14*$AA$11","v":2634.497108023611},{"$f":"ROUND(((D38/$D$14)/((Tv_heat-Tr_heat)*1.163))*$E$14,IF($W$4=1,0,IF($W$4=2,2)))","v":227},5.1683586999999989,{"$f":"(($Y$35*$C38^4+$Y$36*$C38^3+$Y$37*$C38^2+$Y$38*$C38+$Y$39)*((((Tv_cool-Tr_cool)/LN((Tv_cool-Tl_cool)/(Tr_cool-Tl_cool)))/((16-18)/LN((16-27)/(18-27))))^S38))*$G$14*$AA$11","v":1331.2774852534549},{"$f":"((G38/$G$14)/(IF((237.3*LN((RH*EXP(17.27*(Tl_cool/(Tl_cool+237.3))))))/(17.27-LN((RH*EXP(17.27*(Tl_cool/(Tl_cool+237.3))))))<((Tv_cool+Tr_cool)/2),1,IF(1/(1+((2258*((0.622/((p_atm/(1*611*EXP(17.27*(((Tv_cool+Tr_cool)/2)/(((Tv_cool+Tr_cool)/2)+237.3))))))-1)*1000-(0.622/((p_atm/(RH*611*EXP(17.27*(Tl_cool/(Tl_cool+237.3))))))-1)*1000))/(1005*(((Tv_cool+Tr_cool)/2)-Tl_cool))))*1.039+((-0.000729*$C38+0.001448)*(Tl_cool-((Tv_cool+Tr_cool)/2))+(0.016908*$C38-0.033574))*1.039>1,1,1/(1+((2258*((0.622/((p_atm/(1*611*EXP(17.27*(((Tv_cool+Tr_cool)/2)/(((Tv_cool+Tr_cool)/2)+237.3))))))-1)*1000-(0.622/((p_atm/(RH*611*EXP(17.27*(Tl_cool/(Tl_cool+237.3))))))-1)*1000))/(1005*(((Tv_cool+Tr_cool)/2)-Tl_cool))))*1.039+((-0.000729*$C38+0.001448)*(Tl_cool-((Tv_cool+Tr_cool)/2))+(0.016908*$C38-0.033574))*1.039))))*$H$14","v":1331.2774852534549},{"$f":"ROUND(((H38/$H$14)/((Tr_cool-Tv_cool)*1.163))*$I$14,IF($W$4=1,0,IF($W$4=2,2)))","v":515},26.602067499999993,44,52,15.4,403,{"$f":"(Tl_heat+(($D38/$G$14)/(1006*$N38*$K$14)))*$M$14+$O$14","v":39.429906609502964},{"$f":"(Tl_cool-((G38/$G$14)/(1006*N38*$K$14)))*$M$14+$O$14","v":17.181580715716322},null,null,1,null,null,null,1409.4515830987593,0,329.74164387622085,2,52,15.4,403,"f",320.76,null,105.02,{"$f":"AF38","v":0},44.5,9.1,182,1409.4515830987593,{"$f":"AF38","v":0},329.74164387622085,2,52,15.4,403,199.5924373904281,1.829330158620641,15.664455358346679,1.829330158620641,51,18.5,466,191.91978998142477,1.829330158620641,34.907583473887243,1.829330158620641,51,17,289,398.10102592026755,1.8154391549649329,34.97111415527813,1.8154391549649329,50.8,18,455,140.53405061422265,1.829330158620641,9.2616573879342088,1.8154391549649329,50.8,16,393]
[null,1,10,{"$f":"(($W$35*$C39^4+$W$36*$C39^3+$W$37*$C39^2+$W$38*$C39+$W$39)*((((Tv_heat-Tr_heat)/LN((Tv_heat-Tl_heat)/(Tr_heat-Tl_heat)))/((75-65)/LN((75-20)/(65-20))))^1))*$D$14*$AA$11","v":3138.7754097535849},{"$f":"ROUND(((D39/$D$14)/((Tv_heat-Tr_heat)*1.163))*$E$14,IF($W$4=1,0,IF($W$4=2,2)))","v":270},7.3118699999999981,{"$f":"(($Y$35*$C39^4+$Y$36*$C39^3+$Y$37*$C39^2+$Y$38*$C39+$Y$39)*((((Tv_cool-Tr_cool)/LN((Tv_cool-Tl_cool)/(Tr_cool-Tl_cool)))/((16-18)/LN((16-27)/(18-27))))^S39))*$G$14*$AA$11","v":1537.5212119279431},{"$f":"((G39/$G$14)/(IF((237.3*LN((RH*EXP(17.27*(Tl_cool/(Tl_cool+237.3))))))/(17.27-LN((RH*EXP(17.27*(Tl_cool/(Tl_cool+237.3))))))<((Tv_cool+Tr_cool)/2),1,IF(1/(1+((2258*((0.622/((p_atm/(1*611*EXP(17.27*(((Tv_cool+Tr_cool)/2)/(((Tv_cool+Tr_cool)/2)+237.3))))))-1)*1000-(0.622/((p_atm/(RH*611*EXP(17.27*(Tl_cool/(Tl_cool+237.3))))))-1)*1000))/(1005*(((Tv_cool+Tr_cool)/2)-Tl_cool))))*1.039+((-0.000729*$C39+0.001448)*(Tl_cool-((Tv_cool+Tr_cool)/2))+(0.016908*$C39-0.033574))*1.039>1,1,1/(1+((2258*((0.622/((p_atm/(1*611*EXP(17.27*(((Tv_cool+Tr_cool)/2)/(((Tv_cool+Tr_cool)/2)+237.3))))))-1)*1000-(0.622/((p_atm/(RH*611*EXP(17.27*(Tl_cool/(Tl_cool+237.3))))))-1)*1000))/(1005*(((Tv_cool+Tr_cool)/2)-Tl_cool))))*1.039+((-0.000729*$C39+0.001448)*(Tl_cool-((Tv_cool+Tr_cool)/2))+(0.016908*$C39-0.033574))*1.039))))*$H$14","v":1537.5212119279431},{"$f":"ROUND(((H39/$H$14)/((Tr_cool-Tv_cool)*1.163))*$I$14,IF($W$4=1,0,IF($W$4=2,2)))","v":595},35.508707499999986,49,57,26.4,503,{"$f":"(Tl_heat+(($D39/$G$14)/(1006*$N39*$K$14)))*$M$14+$O$14","v":38.546855553391474},{"$f":"(Tl_cool-((G39/$G$14)/(1006*N39*$K$14)))*$M$14+$O$14","v":17.914869621034249},null,null,1,null,null,null,-1846.1341487293191,0,-496.28056416041005,0,57,26.4,503,"g",110.2,null,-121.32,null,50,14.1,206,-1846.1341487293191,null,-496.28056416041005,null,57,26.4,503,2614.5642089837888,null,379.76208308685494,null,55,28.8,510,2025.6470693484523,null,228.6064063053341,null,55,28.8,382,3621.1755888499029,null,500.42990714727654,null,54.5,28.8,531,1716.3174609491957,null,414.98793571736508,null,54.5,27.3,462]
[null,{"$f":"IF($S$7=1,NL!B40,IF(cal!$S$7=2,EN!B40,IF(cal!$S$7=3,DE!B40,IF(cal!$S$7=4,FR!B40,IF(cal!$S$7=5,NR!B40,IF(cal!$S$7=6,SP!B40,IF(cal!$S$7=7,SW!B40,IF(cal!$S$7=8,TS!B40,IF(cal!$S$7=9,ExtraTaal1!B40,IF(cal!$S$7=10,ExtraTaal2!B40,IF(cal!$S$7=11,ExtraTaal3!B40,)))))))))))","v":"*Sound power according to ISO 3741:2010"},{"$f":"IF($S$7=1,NL!C40,IF(cal!$S$7=2,EN!C40,IF(cal!$S$7=3,DE!C40,IF(cal!$S$7=4,FR!C40,IF(cal!$S$7=5,NR!C40,IF(cal!$S$7=6,SP!C40,))))))","v":0},{"$f":"IF($S$7=1,NL!D40,IF(cal!$S$7=2,EN!D40,IF(cal!$S$7=3,DE!D40,IF(cal!$S$7=4,FR!D40,IF(cal!$S$7=5,NR!D40,IF(cal!$S$7=6,SP!D40,))))))","v":0},{"$f":"IF($S$7=1,NL!E40,IF(cal!$S$7=2,EN!E40,IF(cal!$S$7=3,DE!E40,IF(cal!$S$7=4,FR!E40,IF(cal!$S$7=5,NR!E40,IF(cal!$S$7=6,SP!E40,))))))","v":0},{"$f":"IF($S$7=1,NL!F40,IF(cal!$S$7=2,EN!F40,IF(cal!$S$7=3,DE!F40,IF(cal!$S$7=4,FR!F40,IF(cal!$S$7=5,NR!F40,IF(cal!$S$7=6,SP!F40,))))))","v":0},{"$f":"IF($S$7=1,NL!G40,IF(cal!$S$7=2,EN!G40,IF(cal!$S$7=3,DE!G40,IF(cal!$S$7=4,FR!G40,IF(cal!$S$7=5,NR!G40,IF(cal!$S$7=6,SP!G40,))))))","v":0},{"$f":"IF($S$7=1,NL!H40,IF(cal!$S$7=2,EN!H40,IF(cal!$S$7=3,DE!H40,IF(cal!$S$7=4,FR!H40,IF(cal!$S$7=5,NR!H40,IF(cal!$S$7=6,SP!H40,))))))","v":0},{"$f":"IF($S$7=1,NL!I40,IF(cal!$S$7=2,EN!I40,IF(cal!$S$7=3,DE!I40,IF(cal!$S$7=4,FR!I40,IF(cal!$S$7=5,NR!I40,IF(cal!$S$7=6,SP!I40,))))))","v":0},{"$f":"IF($S$7=1,NL!J40,IF(cal!$S$7=2,EN!J40,IF(cal!$S$7=3,DE!J40,IF(cal!$S$7=4,FR!J40,IF(cal!$S$7=5,NR!J40,IF(cal!$S$7=6,SP!J40,))))))","v":0},{"$f":"IF($S$7=1,NL!K40,IF(cal!$S$7=2,EN!K40,IF(cal!$S$7=3,DE!K40,IF(cal!$S$7=4,FR!K40,IF(cal!$S$7=5,NR!K40,IF(cal!$S$7=6,SP!K40,))))))","v":0},{"$f":"IF($S$7=1,NL!L40,IF(cal!$S$7=2,EN!L40,IF(cal!$S$7=3,DE!L40,IF(cal!$S$7=4,FR!L40,IF(cal!$S$7=5,NR!L40,IF(cal!$S$7=6,SP!L40,))))))","v":0},{"$f":"IF($S$7=1,NL!M40,IF(cal!$S$7=2,EN!M40,IF(cal!$S$7=3,DE!M40,IF(cal!$S$7=4,FR!M40,IF(cal!$S$7=5,NR!M40,IF(cal!$S$7=6,SP!M40,))))))","v":0},{"$f":"IF($S$7=1,NL!N40,IF(cal!$S$7=2,EN!N40,IF(cal!$S$7=3,DE!N40,IF(cal!$S$7=4,FR!N40,IF(cal!$S$7=5,NR!N40,IF(cal!$S$7=6,SP!N40,))))))","v":"v2023-10-02"},{"$f":"IF($S$7=1,NL!O40,IF(cal!$S$7=2,EN!O40,IF(cal!$S$7=3,DE!O40,IF(cal!$S$7=4,FR!O40,IF(cal!$S$7=5,NR!O40,IF(cal!$S$7=6,SP!O40,))))))","v":0},{"$f":"IF($S$7=1,NL!P40,IF(cal!$S$7=2,EN!P40,IF(cal!$S$7=3,DE!P40,IF(cal!$S$7=4,FR!P40,IF(cal!$S$7=5,NR!P40,IF(cal!$S$7=6,SP!P40,))))))","v":0},null,null,"n-value",null,null,null,"H",{"$f":"IF($W$16=1,AF40,IF($W$16=2,AM40,IF($W$16=3,AT40,IF($W$16=4,BA40,IF($W$16=5,BH40,IF($W$16=6,BO40,IF($W$16=7,BV40,IF($W$16=8,CC40))))))))*IF($W$4=1,1,IF($W$4=2,1/2.54))","v":55.8},"B",{"$f":"IF($W$16=1,AH40,IF($W$16=2,AO40,IF($W$16=3,AV40,IF($W$16=4,BC40,IF($W$16=5,BJ40,IF($W$16=6,BQ40,IF($W$16=7,BX40,IF($W$16=8,CE40))))))))*IF($W$4=1,1,IF($W$4=2,1/2.54))","v":11},"L",{"$f":"IF($W$16=1,AJ40,IF($W$16=2,AQ40,IF($W$16=3,AX40,IF($W$16=4,BE40,IF($W$16=5,BL40,IF($W$16=6,BS40,IF($W$16=7,BZ40,IF($W$16=8,CG40))))))))*IF($W$4=1,1,IF($W$4=2,1/2.54))","v":190},null,null,"H",{"$f":"IF(AI1=AH2,AL4,AM4)","v":52.1},"B",{"$f":"IF(AI1=AH2,AL3,AM3)","v":8.5},"L",{"$f":"IF(AI1=AH2,AL8,AM8)","v":199},149,"H",{"$f":"IF(AI1=AH2,AN4,AO4)","v":55.8},"B",{"$f":"IF(AI1=AH2,AN3,AO3)","v":11},"L",{"$f":"IF(AI1=AH2,AN8,AO8)","v":190},null,"H",{"$f":"IF(AI1=AH2,AP4,AQ4)","v":42},"B",{"$f":"IF(AI1=AH2,AP3,AQ3)","v":14},"L",{"$f":"IF(AI1=AH2,AP8,AQ8)","v":145},null,"H",{"$f":"AT40","v":42},{"$f":"AU40","v":"B"},14,"L",145,null,"H",{"$f":"IF(AI1=AH3,AR4,AS4)","v":56},"B",{"$f":"IF(AI1=AH2,AR3,AS3)","v":14},"L",{"$f":"IF(AI1=AH2,AS8,AS8)","v":145},null,"H",{"$f":"BH40","v":56},{"$f":"BI40","v":"B"},14,"L",145]
[null,0.2,2,{"$f":"(($W$41*$C41^4+$W$42*$C41^3+$W$43*$C41^2+$W$44*$C41+$W$45)*((((Tv_heat-Tr_heat)/LN((Tv_heat-Tl_heat)/(Tr_heat-Tl_heat)))/((75-65)/LN((75-20)/(65-20))))^1))*$D$14*$AA$11","v":0},{"$f":"ROUND(((D41/$D$14)/((Tv_heat-Tr_heat)*1.163))*$E$14,IF($W$4=1,0,IF($W$4=2,2)))","v":0},{"$f":"($X$42*(E41/$E$14)^$X$44)*$F$14","v":{"$error":"#NUM!"}},{"$f":"(($Y$35*$C41^4+$Y$36*$C41^3+$Y$37*$C41^2+$Y$38*$C41+$Y$39)*((((Tv_cool-Tr_cool)/LN((Tv_cool-Tl_cool)/(Tr_cool-Tl_cool)))/((16-18)/LN((16-27)/(18-27))))^S41))*$G$14*$AA$11","v":112.48229895138553},{"$f":"((G41/$G$14)/(IF((237.3*LN((RH*EXP(17.27*(Tl_cool/(Tl_cool+237.3))))))/(17.27-LN((RH*EXP(17.27*(Tl_cool/(Tl_cool+237.3))))))<((Tv_cool+Tr_cool)/2),1,IF(1/(1+((2258*((0.622/((p_atm/(1*611*EXP(17.27*(((Tv_cool+Tr_cool)/2)/(((Tv_cool+Tr_cool)/2)+237.3))))))-1)*1000-(0.622/((p_atm/(RH*611*EXP(17.27*(Tl_cool/(Tl_cool+237.3))))))-1)*1000))/(1005*(((Tv_cool+Tr_cool)/2)-Tl_cool))))*1.039+((-0.000729*$C41+0.001448)*(Tl_cool-((Tv_cool+Tr_cool)/2))+(0.016908*$C41-0.033574))*1.039>1,1,1/(1+((2258*((0.622/((p_atm/(1*611*EXP(17.27*(((Tv_cool+Tr_cool)/2)/(((Tv_cool+Tr_cool)/2)+237.3))))))-1)*1000-(0.622/((p_atm/(RH*611*EXP(17.27*(Tl_cool/(Tl_cool+237.3))))))-1)*1000))/(1005*(((Tv_cool+Tr_cool)/2)-Tl_cool))))*1.039+((-0.000729*$C41+0.001448)*(Tl_cool-((Tv_cool+Tr_cool)/2))+(0.016908*$C41-0.033574))*1.039))))*$H$14","v":112.48229895138553},{"$f":"ROUND(((H41/$H$14)/((Tr_cool-Tv_cool)*1.163))*$I$14,IF($W$4=1,0,IF($W$4=2,2)))","v":44},{"$f":"($Z$36*(I41/$I$14)^$Z$38)*$J$14","v":1933.1025177077643},{"$f":"L41-8","v":-8},{"$f":"AA41","v":0},{"$f":"AB41","v":0},{"$f":"AC41*$N$14","v":0},{"$f":"(Tl_heat+(($D41/$G$14)/(1006*$N41*$K$14)))*(0.05*$C41+0.7)*$M$14+$O$14","v":{"$error":"#DIV/0!"}},{"$f":"(Tl_cool-((G41/$G$14)/(1006*N41*$K$14)))*$M$14+$O$14","v":{"$error":"#DIV/0!"}},null,null,1,null,null,null,{"$f":"IF($W$16=1,AE41,IF($W$16=2,AL41,IF($W$16=3,AS41,IF($W$16=4,AZ41,IF($W$16=5,BG41,IF($W$16=6,BN41,IF($W$16=7,BU41,IF($W$16=8,CB41))))))))","v":0},{"$f":"IF($W$16=1,AF41,IF($W$16=2,AM41,IF($W$16=3,AT41,IF($W$16=4,BA41,IF($W$16=5,BH41,IF($W$16=6,BO41,IF($W$16=7,BV41,IF($W$16=8,CC41))))))))","v":0},{"$f":"IF($W$16=1,AG41,IF($W$16=2,AN41,IF($W$16=3,AU41,IF($W$16=4,BB41,IF($W$16=5,BI41,IF($W$16=6,BP41,IF($W$16=7,BW41,IF($W$16=8,CD41))))))))","v":0},{"$f":"IF($W$16=1,AH41,IF($W$16=2,AO41,IF($W$16=3,AV41,IF($W$16=4,BC41,IF($W$16=5,BJ41,IF($W$16=6,BQ41,IF($W$16=7,BX41,IF($W$16=8,CE41))))))))","v":0},{"$f":"IF($W$16=1,AI41,IF($W$16=2,AP41,IF($W$16=3,AW41,IF($W$16=4,BD41,IF($W$16=5,BK41,IF($W$16=6,BR41,IF($W$16=7,BY41,IF($W$16=8,CF41))))))))","v":0},{"$f":"IF($W$16=1,AJ41,IF($W$16=2,AQ41,IF($W$16=3,AX41,IF($W$16=4,BE41,IF($W$16=5,BL41,IF($W$16=6,BS41,IF($W$16=7,BZ41,IF($W$16=8,CG41))))))))","v":0},{"$f":"IF($W$16=1,AK41,IF($W$16=2,AR41,IF($W$16=3,AY41,IF($W$16=4,BF41,IF($W$16=5,BM41,IF($W$16=6,BT41,IF($W$16=7,CA41,IF($W$16=8,CH41))))))))","v":0},"c"]
[null,0.4,4,{"$f":"(($W$41*$C42^4+$W$42*$C42^3+$W$43*$C42^2+$W$44*$C42+$W$45)*((((Tv_heat-Tr_heat)/LN((Tv_heat-Tl_heat)/(Tr_heat-Tl_heat)))/((75-65)/LN((75-20)/(65-20))))^1))*$D$14*$AA$11","v":0},{"$f":"ROUND(((D42/$D$14)/((Tv_heat-Tr_heat)*1.163))*$E$14,IF($W$4=1,0,IF($W$4=2,2)))","v":0},{"$f":"($X$42*(E42/$E$14)^$X$44)*$F$14","v":{"$error":"#NUM!"}},{"$f":"(($Y$35*$C42^4+$Y$36*$C42^3+$Y$37*$C42^2+$Y$38*$C42+$Y$39)*((((Tv_cool-Tr_cool)/LN((Tv_cool-Tl_cool)/(Tr_cool-Tl_cool)))/((16-18)/LN((16-27)/(18-27))))^S42))*$G$14*$AA$11","v":617.52393346788472},{"$f":"((G42/$G$14)/(IF((237.3*LN((RH*EXP(17.27*(Tl_cool/(Tl_cool+237.3))))))/(17.27-LN((RH*EXP(17.27*(Tl_cool/(Tl_cool+237.3))))))<((Tv_cool+Tr_cool)/2),1,IF(1/(1+((2258*((0.622/((p_atm/(1*611*EXP(17.27*(((Tv_cool+Tr_cool)/2)/(((Tv_cool+Tr_cool)/2)+237.3))))))-1)*1000-(0.622/((p_atm/(RH*611*EXP(17.27*(Tl_cool/(Tl_cool+237.3))))))-1)*1000))/(1005*(((Tv_cool+Tr_cool)/2)-Tl_cool))))*1.039+((-0.000729*$C42+0.001448)*(Tl_cool-((Tv_cool+Tr_cool)/2))+(0.016908*$C42-0.033574))*1.039>1,1,1/(1+((2258*((0.622/((p_atm/(1*611*EXP(17.27*(((Tv_cool+Tr_cool)/2)/(((Tv_cool+Tr_cool)/2)+237.3))))))-1)*1000-(0.622/((p_atm/(RH*611*EXP(17.27*(Tl_cool/(Tl_cool+237.3))))))-1)*1000))/(1005*(((Tv_cool+Tr_cool)/2)-Tl_cool))))*1.039+((-0.000729*$C42+0.001448)*(Tl_cool-((Tv_cool+Tr_cool)/2))+(0.016908*$C42-0.033574))*1.039))))*$H$14","v":617.52393346788472},{"$f":"ROUND(((H42/$H$14)/((Tr_cool-Tv_cool)*1.163))*$I$14,IF($W$4=1,0,IF($W$4=2,2)))","v":239},{"$f":"($Z$36*(I42/$I$14)^$Z$38)*$J$14","v":57035.510802678305},-8,0,0,0,{"$f":"(Tl_heat+(($D42/$G$14)/(1006*$N42*$K$14)))*(0.05*$C42+0.7)*$M$14+$O$14","v":{"$error":"#DIV/0!"}},{"$f":"(Tl_cool-((G42/$G$14)/(1006*N42*$K$14)))*$M$14+$O$14","v":{"$error":"#DIV/0!"}},null,null,1,null,null,null,0,0,0,0,0,0,0,"d"]
[null,0.6,6,{"$f":"(($W$41*$C43^4+$W$42*$C43^3+$W$43*$C43^2+$W$44*$C43+$W$45)*((((Tv_heat-Tr_heat)/LN((Tv_heat-Tl_heat)/(Tr_heat-Tl_heat)))/((75-65)/LN((75-20)/(65-20))))^1))*$D$14*$AA$11","v":0},{"$f":"ROUND(((D43/$D$14)/((Tv_heat-Tr_heat)*1.163))*$E$14,IF($W$4=1,0,IF($W$4=2,2)))","v":0},{"$error":"#NUM!"},{"$f":"(($Y$35*$C43^4+$Y$36*$C43^3+$Y$37*$C43^2+$Y$38*$C43+$Y$39)*((((Tv_cool-Tr_cool)/LN((Tv_cool-Tl_cool)/(Tr_cool-Tl_cool)))/((16-18)/LN((16-27)/(18-27))))^S43))*$G$14*$AA$11","v":1024.1361147388939},{"$f":"((G43/$G$14)/(IF((237.3*LN((RH*EXP(17.27*(Tl_cool/(Tl_cool+237.3))))))/(17.27-LN((RH*EXP(17.27*(Tl_cool/(Tl_cool+237.3))))))<((Tv_cool+Tr_cool)/2),1,IF(1/(1+((2258*((0.622/((p_atm/(1*611*EXP(17.27*(((Tv_cool+Tr_cool)/2)/(((Tv_cool+Tr_cool)/2)+237.3))))))-1)*1000-(0.622/((p_atm/(RH*611*EXP(17.27*(Tl_cool/(Tl_cool+237.3))))))-1)*1000))/(1005*(((Tv_cool+Tr_cool)/2)-Tl_cool))))*1.039+((-0.000729*$C43+0.001448)*(Tl_cool-((Tv_cool+Tr_cool)/2))+(0.016908*$C43-0.033574))*1.039>1,1,1/(1+((2258*((0.622/((p_atm/(1*611*EXP(17.27*(((Tv_cool+Tr_cool)/2)/(((Tv_cool+Tr_cool)/2)+237.3))))))-1)*1000-(0.622/((p_atm/(RH*611*EXP(17.27*(Tl_cool/(Tl_cool+237.3))))))-1)*1000))/(1005*(((Tv_cool+Tr_cool)/2)-Tl_cool))))*1.039+((-0.000729*$C43+0.001448)*(Tl_cool-((Tv_cool+Tr_cool)/2))+(0.016908*$C43-0.033574))*1.039))))*$H$14","v":1024.1361147388939},{"$f":"ROUND(((H43/$H$14)/((Tr_cool-Tv_cool)*1.163))*$I$14,IF($W$4=1,0,IF($W$4=2,2)))","v":396},156581.3039343289,-8,0,0,0,{"$f":"(Tl_heat+(($D43/$G$14)/(1006*$N43*$K$14)))*(0.05*$C43+0.7)*$M$14+$O$14","v":{"$error":"#DIV/0!"}},{"$f":"(Tl_cool-((G43/$G$14)/(1006*N43*$K$14)))*$M$14+$O$14","v":{"$error":"#DIV/0!"}},null,null,1,null,null,null,{"$f":"IF($W$16=1,AE43,IF($W$16=2,AL43,IF($W$16=3,AS43,IF($W$16=4,AZ43,IF($W$16=5,BG43,IF($W$16=6,BN43,IF($W$16=7,BU43,IF($W$16=8,CB43))))))))","v":0},0,0,0,0,0,0,"e"]
[null,0.8,8,{"$f":"(($W$41*$C44^4+$W$42*$C44^3+$W$43*$C44^2+$W$44*$C44+$W$45)*((((Tv_heat-Tr_heat)/LN((Tv_heat-Tl_heat)/(Tr_heat-Tl_heat)))/((75-65)/LN((75-20)/(65-20))))^1))*$D$14*$AA$11","v":0},{"$f":"ROUND(((D44/$D$14)/((Tv_heat-Tr_heat)*1.163))*$E$14,IF($W$4=1,0,IF($W$4=2,2)))","v":0},{"$error":"#NUM!"},{"$f":"(($Y$35*$C44^4+$Y$36*$C44^3+$Y$37*$C44^2+$Y$38*$C44+$Y$39)*((((Tv_cool-Tr_cool)/LN((Tv_cool-Tl_cool)/(Tr_cool-Tl_cool)))/((16-18)/LN((16-27)/(18-27))))^S44))*$G$14*$AA$11","v":1331.2774852534549},{"$f":"((G44/$G$14)/(IF((237.3*LN((RH*EXP(17.27*(Tl_cool/(Tl_cool+237.3))))))/(17.27-LN((RH*EXP(17.27*(Tl_cool/(Tl_cool+237.3))))))<((Tv_cool+Tr_cool)/2),1,IF(1/(1+((2258*((0.622/((p_atm/(1*611*EXP(17.27*(((Tv_cool+Tr_cool)/2)/(((Tv_cool+Tr_cool)/2)+237.3))))))-1)*1000-(0.622/((p_atm/(RH*611*EXP(17.27*(Tl_cool/(Tl_cool+237.3))))))-1)*1000))/(1005*(((Tv_cool+Tr_cool)/2)-Tl_cool))))*1.039+((-0.000729*$C44+0.001448)*(Tl_cool-((Tv_cool+Tr_cool)/2))+(0.016908*$C44-0.033574))*1.039>1,1,1/(1+((2258*((0.622/((p_atm/(1*611*EXP(17.27*(((Tv_cool+Tr_cool)/2)/(((Tv_cool+Tr_cool)/2)+237.3))))))-1)*1000-(0.622/((p_atm/(RH*611*EXP(17.27*(Tl_cool/(Tl_cool+237.3))))))-1)*1000))/(1005*(((Tv_cool+Tr_cool)/2)-Tl_cool))))*1.039+((-0.000729*$C44+0.001448)*(Tl_cool-((Tv_cool+Tr_cool)/2))+(0.016908*$C44-0.033574))*1.039))))*$H$14","v":1331.2774852534549},{"$f":"ROUND(((H44/$H$14)/((Tr_cool-Tv_cool)*1.163))*$I$14,IF($W$4=1,0,IF($W$4=2,2)))","v":515},264828.05540239759,-8,0,0,0,{"$f":"(Tl_heat+(($D44/$G$14)/(1006*$N44*$K$14)))*(0.05*$C44+0.7)*$M$14+$O$14","v":{"$error":"#DIV/0!"}},{"$f":"(Tl_cool-((G44/$G$14)/(1006*N44*$K$14)))*$M$14+$O$14","v":{"$error":"#DIV/0!"}},null,null,1,null,null,null,0,0,0,0,0,0,0,"f"]
[null,1,10,{"$f":"(($W$41*$C45^4+$W$42*$C45^3+$W$43*$C45^2+$W$44*$C45+$W$45)*((((Tv_heat-Tr_heat)/LN((Tv_heat-Tl_heat)/(Tr_heat-Tl_heat)))/((75-65)/LN((75-20)/(65-20))))^1))*$D$14*$AA$11","v":0},{"$f":"ROUND(((D45/$D$14)/((Tv_heat-Tr_heat)*1.163))*$E$14,IF($W$4=1,0,IF($W$4=2,2)))","v":0},{"$error":"#NUM!"},{"$f":"(($Y$35*$C45^4+$Y$36*$C45^3+$Y$37*$C45^2+$Y$38*$C45+$Y$39)*((((Tv_cool-Tr_cool)/LN((Tv_cool-Tl_cool)/(Tr_cool-Tl_cool)))/((16-18)/LN((16-27)/(18-27))))^S45))*$G$14*$AA$11","v":1537.5212119279431},{"$f":"((G45/$G$14)/(IF((237.3*LN((RH*EXP(17.27*(Tl_cool/(Tl_cool+237.3))))))/(17.27-LN((RH*EXP(17.27*(Tl_cool/(Tl_cool+237.3))))))<((Tv_cool+Tr_cool)/2),1,IF(1/(1+((2258*((0.622/((p_atm/(1*611*EXP(17.27*(((Tv_cool+Tr_cool)/2)/(((Tv_cool+Tr_cool)/2)+237.3))))))-1)*1000-(0.622/((p_atm/(RH*611*EXP(17.27*(Tl_cool/(Tl_cool+237.3))))))-1)*1000))/(1005*(((Tv_cool+Tr_cool)/2)-Tl_cool))))*1.039+((-0.000729*$C45+0.001448)*(Tl_cool-((Tv_cool+Tr_cool)/2))+(0.016908*$C45-0.033574))*1.039>1,1,1/(1+((2258*((0.622/((p_atm/(1*611*EXP(17.27*(((Tv_cool+Tr_cool)/2)/(((Tv_cool+Tr_cool)/2)+237.3))))))-1)*1000-(0.622/((p_atm/(RH*611*EXP(17.27*(Tl_cool/(Tl_cool+237.3))))))-1)*1000))/(1005*(((Tv_cool+Tr_cool)/2)-Tl_cool))))*1.039+((-0.000729*$C45+0.001448)*(Tl_cool-((Tv_cool+Tr_cool)/2))+(0.016908*$C45-0.033574))*1.039))))*$H$14","v":1537.5212119279431},{"$f":"ROUND(((H45/$H$14)/((Tr_cool-Tv_cool)*1.163))*$I$14,IF($W$4=1,0,IF($W$4=2,2)))","v":595},353495.15435510909,{"$error":"#VALUE!"},{"$f":"AA46","v":"L"},{"$f":"AB46","v":240},{"$f":"AC46*$N$14","v":0},{"$f":"(Tl_heat+(($D45/$G$14)/(1006*$N45*$K$14)))*(0.05*$C45+0.7)*$M$14+$O$14","v":{"$error":"#DIV/0!"}},{"$f":"(Tl_cool-((G45/$G$14)/(1006*N45*$K$14)))*$M$14+$O$14","v":{"$error":"#DIV/0!"}},null,null,1,null,null,null,0,0,0,0,0,0,0,"g"]
[null,{"$f":"IF($S$7=1,NL!B40,IF(cal!$S$7=2,EN!B40,IF(cal!$S$7=3,DE!B40,IF(cal!$S$7=4,FR!B40,IF(cal!$S$7=5,NR!B40,IF(cal!$S$7=6,SP!B40,IF(cal!$S$7=7,SW!B40,IF(cal!$S$7=8,TS!B40,IF(cal!$S$7=9,ExtraTaal1!B40,IF(cal!$S$7=10,ExtraTaal2!B40,IF(cal!$S$7=11,ExtraTaal3!B40,)))))))))))","v":"*Sound power according to ISO 3741:2010"},null,null,null,null,null,null,null,null,null,null,null,null,null,"v2023-10-02",null,null,null,null,null,null,"H",{"$f":"IF($W$16=1,AF46,IF($W$16=2,AM46,IF($W$16=3,AT46,IF($W$16=4,BA46,IF($W$16=5,BH46,IF($W$16=6,BO46,IF($W$16=7,BV46,IF($W$16=8,CC46))))))))","v":55.8},"B",{"$f":"IF($W$16=1,AH46,IF($W$16=2,AO46,IF($W$16=3,AV46,IF($W$16=4,BC46,IF($W$16=5,BJ46,IF($W$16=6,BQ46,IF($W$16=7,BX46,IF($W$16=8,CE46))))))))","v":10},"L",240,null,null,"H",52.1,"B",8.6,"L",198.7,216,"H",{"$f":"55.8*IF($W$4=1,1,IF($W$4=2,1/2.54))","v":55.8},"B",10,"L",{"$f":"122*IF($W$4=1,1,IF($W$4=2,1/2.54))","v":122},null,"H",{"$f":"41*IF($W$4=1,1,IF($W$4=2,1/2.54))","v":41},"B",{"$f":"14*IF($W$4=1,1,IF($W$4=2,1/2.54))","v":14},"L",{"$f":"145*IF($W$4=1,1,IF($W$4=2,1/2.54))","v":145},null,"H",{"$f":"41*IF($W$4=1,1,IF($W$4=2,1/2.54))","v":41},"B",{"$f":"14*IF($W$4=1,1,IF($W$4=2,1/2.54))","v":14},"L",{"$f":"145*IF($W$4=1,1,IF($W$4=2,1/2.54))","v":145},null,"H",{"$f":"52*IF($W$4=1,1,IF($W$4=2,1/2.54))","v":52},"B",{"$f":"12*IF($W$4=1,1,IF($W$4=2,1/2.54))","v":12},"L",{"$f":"122*IF($W$4=1,1,IF($W$4=2,1/2.54))","v":122},null,"H",{"$f":"52*IF($W$4=1,1,IF($W$4=2,1/2.54))","v":52},"B",{"$f":"12*IF($W$4=1,1,IF($W$4=2,1/2.54))","v":12},"L",{"$f":"122*IF($W$4=1,1,IF($W$4=2,1/2.54))","v":122},null,"H",{"$f":"55*IF($W$4=1,1,IF($W$4=2,1/2.54))","v":55},"B",{"$f":"14*IF($W$4=1,1,IF($W$4=2,1/2.54))","v":14},"L",{"$f":"145*IF($W$4=1,1,IF($W$4=2,1/2.54))","v":145},null,"H",{"$f":"55*IF($W$4=1,1,IF($W$4=2,1/2.54))","v":55},"B",{"$f":"14*IF($W$4=1,1,IF($W$4=2,1/2.54))","v":14},"L",{"$f":"145*IF($W$4=1,1,IF($W$4=2,1/2.54))","v":145}]
[null,{"$f":"IF($S$7=1,NL!B41,IF(cal!$S$7=2,EN!B41,IF(cal!$S$7=3,DE!B41,IF(cal!$S$7=4,FR!B41,IF(cal!$S$7=5,NR!B41,IF(cal!$S$7=6,SP!B41,IF(cal!$S$7=7,SW!B41,IF(cal!$S$7=8,TS!B41,IF(cal!$S$7=9,ExtraTaal1!B41,IF(cal!$S$7=10,ExtraTaal2!B41,IF(cal!$S$7=11,ExtraTaal3!B41,)))))))))))","v":"**Sound pressure with an assumed room damping of 8dB(A)"}]

{"sheet":"NL","index":2,"n_rows":41,"n_cols":20,"rows_kept":41,"cut":false,"hidden":true,"merged":[[33,1,33,13],[8,1,8,3],[8,6,8,9],[9,1,9,3],[9,6,9,9],[10,1,10,3],[10,6,10,9],[3,7,3,10],[4,7,4,10],[15,1,15,13],[21,1,21,13],[27,1,27,13],[8,12,8,13]]}
[]
[]
[null,"Invulformulier"]
[null,null,null,null,null,null,null,"Hydraulisch mengsel:",0,0,0]
[null,"Randvoorwaarden",null,null,null,null,null,"Toestel - Ventilator - Uitvoering:",0,0,0]
[]
[null,"Temperaturen",null,null,null,null,null,null,null,null,null,null,null,null,null,null,"Kopieer alle data"]
[null,"Verwarmen:",null,null,null,null,"Koelen:",null,null,null,null,null,null,null,null,null,"SI-eenheden"]
[null,{"$f":"\"Water aanvoer\"","v":"Water aanvoer"},null,null,{"$f":"cal!E9","v":45},null,{"$f":"B9","v":"Water aanvoer"},null,null,null,{"$f":"cal!K9","v":15.999999999999998},null,"Eenheidsstelsel",null,null,null,"Imperiale-eenheden"]
[null,{"$f":"\"Water retour\"","v":"Water retour"},null,null,{"$f":"cal!E10","v":35},null,{"$f":"B10","v":"Water retour"},null,null,null,{"$f":"cal!K10","v":18.222222222222221}]
[null,{"$f":"\"Ruimte\"","v":"Ruimte"},null,null,{"$f":"cal!E11","v":20},null,{"$f":"B11","v":"Ruimte"},null,null,null,{"$f":"cal!K11","v":26.999999999999996}]
[null,null,null,null,null,null,"Relatieve vochtigheid",null,null,null,{"$f":"cal!K12","v":0.5}]
[]
[]
[null,"Snelheidsniveau","Stuurspanning [V]",{"$f":"CONCATENATE(\"Warmteafgifte  \",ROUND(E9,0),\"/\",ROUND(E10,0),\"/\",ROUND(E11,0),\" [\"&IF(UnitsNo=1,\"W\",IF(UnitsNo=2,\"Btu/h\"))&\"]\")","v":"Warmteafgifte  45/35/20 [W]"},{"$f":"\"Waterdebiet, verwarming [\"&IF(UnitsNo=1,\"l/h\",IF(UnitsNo=2,\"GPM\"))&\"]\"","v":"Waterdebiet, verwarming [l/h]"},{"$f":"\"Waterzijdig drukverlies [\"&IF(UnitsNo=1,\"kPa\",IF(UnitsNo=2,\"inH2O\"))&\"]\"","v":"Waterzijdig drukverlies [kPa]"},{"$f":"CONCATENATE(\"Voelb. Koelcapaciteit  \",ROUND(K9,0),\"/\",,ROUND(K10,0),\"/\",,ROUND(K11,0),\" [\"&IF(UnitsNo=1,\"W\",IF(UnitsNo=2,\"Btu/h\"))&\"]\")","v":"Voelb. Koelcapaciteit  16/18/27 [W]"},{"$f":"CONCATENATE(\"Tot. koelcapaciteit \",,ROUND(K9,0),\"/\",,ROUND(K10,0),\"/\",,ROUND(K11,0),\" [\"&IF(UnitsNo=1,\"W\",IF(UnitsNo=2,\"Btu/h\"))&\"]\")","v":"Tot. koelcapaciteit 16/18/27 [W]"},{"$f":"\"Waterdebiet, koeling [\"&IF(UnitsNo=1,\"l/h\",IF(UnitsNo=2,\"GPM\"))&\"]\"","v":"Waterdebiet, koeling [l/h]"},{"$f":"\"Waterzijdig drukverlies [\"&IF(UnitsNo=1,\"kPa\",IF(UnitsNo=2,\"inH2O\"))&\"]\"","v":"Waterzijdig drukverlies [kPa]"},"Geluidsdruk ** [dB(A)]","Geluidsvermogen * [dB(A)]","Opgenomen elektr. vermogen [W]",{"$f":"\"Luchtdebiet [\"&IF(UnitsNo=1,\"m³/h\",IF(UnitsNo=2,\"CFM\"))&\"]\"","v":"Luchtdebiet [m³/h]"},{"$f":"\"Uitblaastemp. verwarming  [\"&IF(UnitsNo=1,\"°C\",IF(UnitsNo=2,\"°F\"))&\"]\"","v":"Uitblaastemp. verwarming  [°C]"},{"$f":"\"Uitblaastemp. koeling  [\"&IF(UnitsNo=1,\"°C\",IF(UnitsNo=2,\"°F\"))&\"]\"","v":"Uitblaastemp. koeling  [°C]"}]
[null,{"$f":"cal!$X$1&\" \"&$T$16&\" \"&ROUND(cal!X22,1)&IF(UnitsNo=1,\" cm\",IF(UnitsNo=2,\" in\"))& \" \"&$T$17&\" \"&ROUND(cal!Z22,1)&IF(UnitsNo=1,\" cm\",IF(UnitsNo=2,\" in\"))&\" \"&$T$18&\" \"&ROUND(cal!AB22,1)&IF(UnitsNo=1,\" cm\",IF(UnitsNo=2,\" in\"))&\" (Type 1)\"","v":"Briza Net Zero S hoogte 55,8 cm breedte 11 cm lengte 75 cm (Type 1)"},null,null,null,null,null,null,null,null,null,null,null,null,null,null,null,"Temp.",null,"hoogte"]
[null,null,null,null,null,null,null,null,null,null,null,null,null,null,null,null,null,"verw.!",null,"breedte"]
[null,null,null,null,null,null,null,null,null,null,null,null,null,null,null,null,null,"koelen!",null,"lengte"]
[]
[]
[]
[null,{"$f":"cal!$X$1&\" \"&$T$16&\" \"&ROUND(cal!X28,1)&IF(UnitsNo=1,\" cm\",IF(UnitsNo=2,\" in\"))& \" \"&$T$17&\" \"&ROUND(cal!Z28,1)&IF(UnitsNo=1,\" cm\",IF(UnitsNo=2,\" in\"))&\" \"&$T$18&\" \"&ROUND(cal!AB28,1)&IF(UnitsNo=1,\" cm\",IF(UnitsNo=2,\" in\"))&\" (Type 2)\"","v":"Briza Net Zero S hoogte 55,8 cm breedte 11 cm lengte 110 cm (Type 2)"}]
[]
[]
[]
[]
[]
[null,{"$f":"cal!$X$1&\" \"&$T$16&\" \"&ROUND(cal!X34,1)&IF(UnitsNo=1,\" cm\",IF(UnitsNo=2,\" in\"))& \" \"&$T$17&\" \"&ROUND(cal!Z34,1)&IF(UnitsNo=1,\" cm\",IF(UnitsNo=2,\" in\"))&\" \"&$T$18&\" \"&ROUND(cal!AB34,1)&IF(UnitsNo=1,\" cm\",IF(UnitsNo=2,\" in\"))&\" (Type 3)\"","v":"Briza Net Zero S hoogte 55,8 cm breedte 11 cm lengte 155 cm (Type 3)"}]
[]
[]
[]
[]
[]
[null,{"$f":"cal!$X$1&\" \"&$T$16&\" \"&ROUND(cal!X40,1)&IF(UnitsNo=1,\" cm\",IF(UnitsNo=2,\" in\"))& \" \"&$T$17&\" \"&ROUND(cal!Z40,1)&IF(UnitsNo=1,\" cm\",IF(UnitsNo=2,\" in\"))&\" \"&$T$18&\" \"&ROUND(cal!AB40,1)&IF(UnitsNo=1,\" cm\",IF(UnitsNo=2,\" in\"))&\" (Type 4)\"","v":"Briza Net Zero S hoogte 55,8 cm breedte 11 cm lengte 190 cm (Type 4)"}]
[]
[]
[]
[]
[]
[null,"*Geluidsvermogen gemeten volgens ISO 3741:2010",null,null,null,null,null,null,null,null,null,null,null,{"$f":"cal!P46","v":"v2023-10-02"}]
[null,"**Geluidsdruk bij een aangenomen ruimtedemping van 8 dB(A)"]

{"sheet":"EN","index":3,"n_rows":41,"n_cols":20,"rows_kept":41,"cut":false,"hidden":true,"merged":[[33,1,33,13],[8,1,8,3],[8,6,8,9],[9,1,9,3],[9,6,9,9],[10,6,10,9],[3,7,3,10],[4,7,4,10],[15,1,15,13],[21,1,21,13],[27,1,27,13],[8,12,8,13]]}
[]
[]
[null,"Formulary"]
[null,null,null,null,null,null,null,"Hydraulic mix:",0,0,0]
[null,"Conditions",null,null,null,null,null,"Device - Ventilator - Utilization:",0,0,0]
[]
[null,"Temperatures",null,null,null,null,null,null,null,null,null,null,null,null,null,null,"Copy all data"]
[null,"Heating:",null,null,null,null,"Cooling:",null,null,null,null,null,null,null,null,null,"SI-units"]
[null,"Supply water",null,null,{"$f":"cal!E9","v":45},null,{"$f":"B9","v":"Supply water"},null,null,null,{"$f":"cal!K9","v":15.999999999999998},null,"Unit conversion",null,null,null,"Imperial-units"]
[null,"Return water",null,null,{"$f":"cal!E10","v":35},null,{"$f":"B10","v":"Return water"},null,null,null,{"$f":"cal!K10","v":18.222222222222221}]
[null,"Entering air",null,null,{"$f":"cal!E11","v":20},null,{"$f":"B11","v":"Entering air"},null,null,null,{"$f":"cal!K11","v":26.999999999999996}]
[null,null,null,null,null,null,"Relative humidity",null,null,null,{"$f":"cal!K12","v":0.5}]
[]
[]
[null,"Speed level","Control voltage [V]",{"$f":"CONCATENATE(\"Heat output  \",ROUND(E9,0),\"/\",ROUND(E10,0),\"/\",ROUND(E11,0),\" [\"&IF(cal!$W$4=1,\"W\",IF(cal!$W$4=2,\"Btu/h\"))&\"]\")","v":"Heat output  45/35/20 [W]"},{"$f":"\"Water flowrate, heating [\"&IF(cal!$W$4=1,\"l/h\",IF(cal!$W$4=2,\"GPM\"))&\"]\"","v":"Water flowrate, heating [l/h]"},{"$f":"\"Watersided pressure loss [\"&IF(cal!$W$4=1,\"kPa\",IF(cal!$W$4=2,\"inH2O\"))&\"]\"","v":"Watersided pressure loss [kPa]"},{"$f":"CONCATENATE(\"Sens. cooling capacity  \",ROUND(K9,0),\"/\",ROUND(K10,0),\"/\",ROUND(K11,0),\" [\"&IF(cal!$W$4=1,\"W\",IF(cal!$W$4=2,\"Btu/h\"))&\"]\")","v":"Sens. cooling capacity  16/18/27 [W]"},{"$f":"CONCATENATE(\"Tot. cooling capacity \",ROUND(K9,0),\"/\",ROUND(K10,0),\"/\",ROUND(K11,0),\" [\"&IF(cal!$W$4=1,\"W\",IF(cal!$W$4=2,\"Btu/h\"))&\"]\")","v":"Tot. cooling capacity 16/18/27 [W]"},{"$f":"\"Water flowrate, cooling [\"&IF(cal!$W$4=1,\"l/h\",IF(cal!$W$4=2,\"GPM\"))&\"]\"","v":"Water flowrate, cooling [l/h]"},{"$f":"\"Watersided pressure loss [\"&IF(cal!$W$4=1,\"kPa\",IF(cal!$W$4=2,\"inH2O\"))&\"]\"","v":"Watersided pressure loss [kPa]"},"Sound pressure ** [dB(A)]","Sound power * [dB(A)]","Electrical power [W]",{"$f":"\"Air flowrate [\"&IF(cal!$W$4=1,\"m³/h\",IF(cal!$W$4=2,\"CFM\"))&\"]\"","v":"Air flowrate [m³/h]"},{"$f":"\"Air exhaust temp. heating  [\"&IF(cal!$W$4=1,\"°C\",IF(cal!$W$4=2,\"°F\"))&\"]\"","v":"Air exhaust temp. heating  [°C]"},{"$f":"\"Air exhaust temp. cooling  [\"&IF(cal!$W$4=1,\"°C\",IF(cal!$W$4=2,\"°F\"))&\"]\"","v":"Air exhaust temp. cooling  [°C]"}]
[null,{"$f":"cal!$X$1&\" \"&$T$16&\" \"&ROUND(cal!X22,1)&IF(UnitsNo=1,\" cm\",IF(UnitsNo=2,\" in\"))& \" \"&$T$17&\" \"&ROUND(cal!Z22,1)&IF(UnitsNo=1,\" cm\",IF(UnitsNo=2,\" in\"))&\" \"&$T$18&\" \"&ROUND(cal!AB22,1)&IF(UnitsNo=1,\" cm\",IF(UnitsNo=2,\" in\"))&\" (Type 1)\"","v":"Briza Net Zero S height 55,8 cm width 11 cm length 75 cm (Type 1)"},null,null,null,null,null,null,null,null,null,null,null,null,null,null,null,"Temp.",null,"height"]
[null,null,null,null,null,null,null,null,null,null,null,null,null,null,null,null,null,"heating!",null,"width"]
[null,null,null,null,null,null,null,null,null,null,null,null,null,null,null,null,null,"cooling!",null,"length"]
[]
[]
[]
[null,{"$f":"cal!$X$1&\" \"&$T$16&\" \"&ROUND(cal!X28,1)&IF(UnitsNo=1,\" cm\",IF(UnitsNo=2,\" in\"))& \" \"&$T$17&\" \"&ROUND(cal!Z28,1)&IF(UnitsNo=1,\" cm\",IF(UnitsNo=2,\" in\"))&\" \"&$T$18&\" \"&ROUND(cal!AB28,1)&IF(UnitsNo=1,\" cm\",IF(UnitsNo=2,\" in\"))&\" (Type 2)\"","v":"Briza Net Zero S height 55,8 cm width 11 cm length 110 cm (Type 2)"}]
[]
[]
[]
[]
[]
[null,{"$f":"cal!$X$1&\" \"&$T$16&\" \"&ROUND(cal!X34,1)&IF(UnitsNo=1,\" cm\",IF(UnitsNo=2,\" in\"))& \" \"&$T$17&\" \"&ROUND(cal!Z34,1)&IF(UnitsNo=1,\" cm\",IF(UnitsNo=2,\" in\"))&\" \"&$T$18&\" \"&ROUND(cal!AB34,1)&IF(UnitsNo=1,\" cm\",IF(UnitsNo=2,\" in\"))&\" (Type 3)\"","v":"Briza Net Zero S height 55,8 cm width 11 cm length 155 cm (Type 3)"}]
[]
[]
[]
[]
[]
[null,{"$f":"cal!$X$1&\" \"&$T$16&\" \"&ROUND(cal!X40,1)&IF(UnitsNo=1,\" cm\",IF(UnitsNo=2,\" in\"))& \" \"&$T$17&\" \"&ROUND(cal!Z40,1)&IF(UnitsNo=1,\" cm\",IF(UnitsNo=2,\" in\"))&\" \"&$T$18&\" \"&ROUND(cal!AB40,1)&IF(UnitsNo=1,\" cm\",IF(UnitsNo=2,\" in\"))&\" (Type 4)\"","v":"Briza Net Zero S height 55,8 cm width 11 cm length 190 cm (Type 4)"}]
[]
[]
[]
[]
[]
[null,"*Sound power according to ISO 3741:2010",null,null,null,null,null,null,null,null,null,null,null,{"$f":"cal!P46","v":"v2023-10-02"}]
[null,"**Sound pressure with an assumed room damping of 8dB(A)"]

{"sheet":"DE","index":4,"n_rows":41,"n_cols":20,"rows_kept":41,"cut":false,"hidden":true,"merged":[[33,1,33,13],[8,1,8,3],[8,6,8,9],[9,1,9,3],[9,6,9,9],[10,1,10,3],[10,6,10,9],[3,7,3,10],[4,7,4,10],[15,1,15,13],[21,1,21,13],[27,1,27,13],[8,12,8,13]]}
[]
[]
[null,"Eingabefelder"]
[null,null,null,null,null,null,null,"Hydraulikgemisch:"]
[null,"Auslegungsrandbedingungen",null,null,null,null,null,"Gerät - Lüfter - Ausfürhung:",0,0,0]
[]
[null,"Temperaturen",null,null,null,null,null,null,null,null,null,null,null,null,null,null,"Kopieren Sie alle daten"]
[null,"Heizen:",null,null,null,null,"Kühlen:",null,null,null,null,null,null,null,null,null,"SI-einheiten"]
[null,{"$f":"\"Vorlauf wasser\"","v":"Vorlauf wasser"},null,null,{"$f":"cal!E9","v":45},null,{"$f":"B9","v":"Vorlauf wasser"},null,null,null,{"$f":"cal!K9","v":15.999999999999998},null,"Einheiten",null,null,null,"Imperiale-einheiten"]
[null,{"$f":"\"Rücklauf wasser\"","v":"Rücklauf wasser"},null,null,{"$f":"cal!E10","v":35},null,{"$f":"B10","v":"Rücklauf wasser"},null,null,null,{"$f":"cal!K10","v":18.222222222222221}]
[null,{"$f":"\"Raum\"","v":"Raum"},null,null,{"$f":"cal!E11","v":20},null,{"$f":"B11","v":"Raum"},null,null,null,{"$f":"cal!K11","v":26.999999999999996}]
[null,null,null,null,null,null,"Relative Luftfeuchtigkeit",null,null,null,{"$f":"cal!K12","v":0.5}]
[]
[]
[null,"Drehzahlstufe","Regelspannung [V]",{"$f":"CONCATENATE(\"Wärmeleistung  \",ROUND(E9,0),\"/\",ROUND(E10,0),\"/\",ROUND(E11,0),\" [\"&IF(cal!$W$4=1,\"W\",IF(cal!$W$4=2,\"Btu/h\"))&\"]\")","v":"Wärmeleistung  45/35/20 [W]"},{"$f":"\"Heizmittelstrom [\"&IF(cal!$W$4=1,\"l/h\",IF(cal!$W$4=2,\"GPM\"))&\"]\"","v":"Heizmittelstrom [l/h]"},{"$f":"\"zug. wassers. Druckverlust [\"&IF(cal!$W$4=1,\"kPa\",IF(cal!$W$4=2,\"inH2O\"))&\"]\"","v":"zug. wassers. Druckverlust [kPa]"},{"$f":"CONCATENATE(\"Sens. Kälteleistung  \",ROUND(K9,0),\"/\",ROUND(K10,0),\"/\",ROUND(K11,0),\" [\"&IF(cal!$W$4=1,\"W\",IF(cal!$W$4=2,\"Btu/h\"))&\"]\")","v":"Sens. Kälteleistung  16/18/27 [W]"},{"$f":"CONCATENATE(\"Tot. Kälteleistung \",ROUND(K9,0),\"/\",ROUND(K10,0),\"/\",ROUND(K11,0),\" [\"&IF(cal!$W$4=1,\"W\",IF(cal!$W$4=2,\"Btu/h\"))&\"]\")","v":"Tot. Kälteleistung 16/18/27 [W]"},{"$f":"\"Kühlmittelstrom [\"&IF(cal!$W$4=1,\"l/h\",IF(cal!$W$4=2,\"GPM\"))&\"]\"","v":"Kühlmittelstrom [l/h]"},{"$f":"\"zug. wassers. Druckverlust [\"&IF(cal!$W$4=1,\"kPa\",IF(cal!$W$4=2,\"inH2O\"))&\"]\"","v":"zug. wassers. Druckverlust [kPa]"},"Schalldruckpegel ** [dB(A)]","Schallleistungspegel * [dB(A)]","Leistungsaufnahme [W]",{"$f":"\"Luftvolumenstrom [\"&IF(cal!$W$4=1,\"m³/h\",IF(cal!$W$4=2,\"CFM\"))&\"]\"","v":"Luftvolumenstrom [m³/h]"},{"$f":"\"Luftaustrittstemp. Heizung  [\"&IF(cal!$W$4=1,\"°C\",IF(cal!$W$4=2,\"°F\"))&\"]\"","v":"Luftaustrittstemp. Heizung  [°C]"},{"$f":"\"Luftaustrittstemp. Kühlung  [\"&IF(cal!$W$4=1,\"°C\",IF(cal!$W$4=2,\"°F\"))&\"]\"","v":"Luftaustrittstemp. Kühlung  [°C]"}]
[null,{"$f":"cal!$X$1&\" \"&$T$16&\" \"&ROUND(cal!X22,1)&IF(UnitsNo=1,\" cm\",IF(UnitsNo=2,\" in\"))& \" \"&$T$17&\" \"&ROUND(cal!Z22,1)&IF(UnitsNo=1,\" cm\",IF(UnitsNo=2,\" in\"))&\" \"&$T$18&\" \"&ROUND(cal!AB22,1)&IF(UnitsNo=1,\" cm\",IF(UnitsNo=2,\" in\"))&\" (Type 1)\"","v":"Briza Net Zero S höhe 55,8 cm breite 11 cm länge 75 cm (Type 1)"},null,null,null,null,null,null,null,null,null,null,null,null,null,null,null,"Temp.",null,"höhe"]
[null,null,null,null,null,null,null,null,null,null,null,null,null,null,null,null,null,"heizen!",null,"breite"]
[null,null,null,null,null,null,null,null,null,null,null,null,null,null,null,null,null,"kühlen!",null,"länge"]
[]
[]
[]
[null,{"$f":"cal!$X$1&\" \"&$T$16&\" \"&ROUND(cal!X28,1)&IF(UnitsNo=1,\" cm\",IF(UnitsNo=2,\" in\"))& \" \"&$T$17&\" \"&ROUND(cal!Z28,1)&IF(UnitsNo=1,\" cm\",IF(UnitsNo=2,\" in\"))&\" \"&$T$18&\" \"&ROUND(cal!AB28,1)&IF(UnitsNo=1,\" cm\",IF(UnitsNo=2,\" in\"))&\" (Type 2)\"","v":"Briza Net Zero S höhe 55,8 cm breite 11 cm länge 110 cm (Type 2)"}]
[]
[]
[]
[]
[]
[null,{"$f":"cal!$X$1&\" \"&$T$16&\" \"&ROUND(cal!X34,1)&IF(UnitsNo=1,\" cm\",IF(UnitsNo=2,\" in\"))& \" \"&$T$17&\" \"&ROUND(cal!Z34,1)&IF(UnitsNo=1,\" cm\",IF(UnitsNo=2,\" in\"))&\" \"&$T$18&\" \"&ROUND(cal!AB34,1)&IF(UnitsNo=1,\" cm\",IF(UnitsNo=2,\" in\"))&\" (Type 3)\"","v":"Briza Net Zero S höhe 55,8 cm breite 11 cm länge 155 cm (Type 3)"}]
[]
[]
[]
[]
[]
[null,{"$f":"cal!$X$1&\" \"&$T$16&\" \"&ROUND(cal!X40,1)&IF(UnitsNo=1,\" cm\",IF(UnitsNo=2,\" in\"))& \" \"&$T$17&\" \"&ROUND(cal!Z40,1)&IF(UnitsNo=1,\" cm\",IF(UnitsNo=2,\" in\"))&\" \"&$T$18&\" \"&ROUND(cal!AB40,1)&IF(UnitsNo=1,\" cm\",IF(UnitsNo=2,\" in\"))&\" (Type 4)\"","v":"Briza Net Zero S höhe 55,8 cm breite 11 cm länge 190 cm (Type 4)"}]
[]
[]
[]
[]
[]
[null,"*Schallleistungspegel nach ISO 3741:2010"]
[null,"**Schalldruckpegel bei angenommener Raumdämpfung von 8dB(A)"]

{"sheet":"FR","index":5,"n_rows":41,"n_cols":20,"rows_kept":41,"cut":false,"hidden":true,"merged":[[33,1,33,13],[8,1,8,3],[8,6,8,9],[9,1,9,3],[9,6,9,9],[10,1,10,3],[10,6,10,9],[3,7,3,10],[4,7,4,10],[15,1,15,13],[21,1,21,13],[27,1,27,13],[8,12,8,13]]}
[]
[]
[null,"Formulaire"]
[null,null,null,null,null,null,null,"Mélange hydraulique:"]
[null,"Conditions",null,null,null,null,null,"Appareil - Ventilateur - Version:",0,0,0]
[]
[null,"Températures",null,null,null,null,null,null,null,null,null,null,null,null,null,null,"Copier toutes des données"]
[null,"Chauffer:",null,null,null,null,"Refroidir:",null,null,null,null,null,null,null,null,null,"Unités-SI"]
[null,{"$f":"\"Entrée de l'eau\"","v":"Entrée de l'eau"},null,null,{"$f":"cal!E9","v":45},null,{"$f":"B9","v":"Entrée de l'eau"},null,null,null,{"$f":"cal!K9","v":15.999999999999998},null,"Système unitaire",null,null,null,"Unités-Impériales"]
[null,{"$f":"\"Retour de l'eau\"","v":"Retour de l'eau"},null,null,{"$f":"cal!E10","v":35},null,{"$f":"B10","v":"Retour de l'eau"},null,null,null,{"$f":"cal!K10","v":18.222222222222221}]
[null,{"$f":"\"Ambiante\"","v":"Ambiante"},null,null,{"$f":"cal!E11","v":20},null,{"$f":"B11","v":"Ambiante"},null,null,null,{"$f":"cal!K11","v":26.999999999999996}]
[null,null,null,null,null,null,"Humidité relative",null,null,null,{"$f":"cal!K12","v":0.5}]
[]
[]
[null,"Niveau de vitesse","Voltage [V]",{"$f":"CONCATENATE(\"Puissance de cha.  \",ROUND(E9,0),\"/\",ROUND(E10,0),\"/\",ROUND(E11,0),\" [\"&IF(cal!$W$4=1,\"W\",IF(cal!$W$4=2,\"Btu/h\"))&\"]\")","v":"Puissance de cha.  45/35/20 [W]"},{"$f":"\"Débit d'eau, chauffer [\"&IF(cal!$W$4=1,\"l/h\",IF(cal!$W$4=2,\"GPM\"))&\"]\"","v":"Débit d'eau, chauffer [l/h]"},{"$f":"\"Perte de charge [\"&IF(cal!$W$4=1,\"kPa\",IF(cal!$W$4=2,\"inH2O\"))&\"]\"","v":"Perte de charge [kPa]"},{"$f":"CONCATENATE(\"Puissance sens. de refr.  \",ROUND(K9,0),\"/\",ROUND(K10,0),\"/\",ROUND(K11,0),\" [\"&IF(cal!$W$4=1,\"W\",IF(cal!$W$4=2,\"Btu/h\"))&\"]\")","v":"Puissance sens. de refr.  16/18/27 [W]"},{"$f":"CONCATENATE(\"Puissance tot. de refr. \",ROUND(K9,0),\"/\",ROUND(K10,0),\"/\",ROUND(K11,0),\" [\"&IF(cal!$W$4=1,\"W\",IF(cal!$W$4=2,\"Btu/h\"))&\"]\")","v":"Puissance tot. de refr. 16/18/27 [W]"},{"$f":"\"Débit d'eau, refroidir [\"&IF(cal!$W$4=1,\"l/h\",IF(cal!$W$4=2,\"GPM\"))&\"]\"","v":"Débit d'eau, refroidir [l/h]"},{"$f":"\"Perte de charge [\"&IF(cal!$W$4=1,\"kPa\",IF(cal!$W$4=2,\"inH2O\"))&\"]\"","v":"Perte de charge [kPa]"},"Pression sonore ** [dB(A)]","Puissance sonore * [dB(A)]","Puissance absorbée [W]",{"$f":"\"Débit d'air [\"&IF(cal!$W$4=1,\"m³/h\",IF(cal!$W$4=2,\"CFM\"))&\"]\"","v":"Débit d'air [m³/h]"},{"$f":"\"Temp. de la sortie d'air cha.  [\"&IF(cal!$W$4=1,\"°C\",IF(cal!$W$4=2,\"°F\"))&\"]\"","v":"Temp. de la sortie d'air cha.  [°C]"},{"$f":"\"Temp. de la sortie d'air refr.  [\"&IF(cal!$W$4=1,\"°C\",IF(cal!$W$4=2,\"°F\"))&\"]\"","v":"Temp. de la sortie d'air refr.  [°C]"}]
[null,{"$f":"cal!$X$1&\" \"&$T$16&\" \"&ROUND(cal!X22,1)&IF(UnitsNo=1,\" cm\",IF(UnitsNo=2,\" in\"))& \" \"&$T$17&\" \"&ROUND(cal!Z22,1)&IF(UnitsNo=1,\" cm\",IF(UnitsNo=2,\" in\"))&\" \"&$T$18&\" \"&ROUND(cal!AB22,1)&IF(UnitsNo=1,\" cm\",IF(UnitsNo=2,\" in\"))&\" (Type 1)\"","v":"Briza Net Zero S hauteur 55,8 cm largeur 11 cm longueur 75 cm (Type 1)"},null,null,null,null,null,null,null,null,null,null,null,null,null,null,null,"Temp.",null,"hauteur"]
[null,null,null,null,null,null,null,null,null,null,null,null,null,null,null,null,null,"chauf.!",null,"largeur"]
[null,null,null,null,null,null,null,null,null,null,null,null,null,null,null,null,null,"refr.!",null,"longueur"]
[]
[]
[]
[null,{"$f":"cal!$X$1&\" \"&$T$16&\" \"&ROUND(cal!X28,1)&IF(UnitsNo=1,\" cm\",IF(UnitsNo=2,\" in\"))& \" \"&$T$17&\" \"&ROUND(cal!Z28,1)&IF(UnitsNo=1,\" cm\",IF(UnitsNo=2,\" in\"))&\" \"&$T$18&\" \"&ROUND(cal!AB28,1)&IF(UnitsNo=1,\" cm\",IF(UnitsNo=2,\" in\"))&\" (Type 2)\"","v":"Briza Net Zero S hauteur 55,8 cm largeur 11 cm longueur 110 cm (Type 2)"}]
[]
[]
[]
[]
[]
[null,{"$f":"cal!$X$1&\" \"&$T$16&\" \"&ROUND(cal!X34,1)&IF(UnitsNo=1,\" cm\",IF(UnitsNo=2,\" in\"))& \" \"&$T$17&\" \"&ROUND(cal!Z34,1)&IF(UnitsNo=1,\" cm\",IF(UnitsNo=2,\" in\"))&\" \"&$T$18&\" \"&ROUND(cal!AB34,1)&IF(UnitsNo=1,\" cm\",IF(UnitsNo=2,\" in\"))&\" (Type 3)\"","v":"Briza Net Zero S hauteur 55,8 cm largeur 11 cm longueur 155 cm (Type 3)"}]
[]
[]
[]
[]
[]
[null,{"$f":"cal!$X$1&\" \"&$T$16&\" \"&ROUND(cal!X40,1)&IF(UnitsNo=1,\" cm\",IF(UnitsNo=2,\" in\"))& \" \"&$T$17&\" \"&ROUND(cal!Z40,1)&IF(UnitsNo=1,\" cm\",IF(UnitsNo=2,\" in\"))&\" \"&$T$18&\" \"&ROUND(cal!AB40,1)&IF(UnitsNo=1,\" cm\",IF(UnitsNo=2,\" in\"))&\" (Type 4)\"","v":"Briza Net Zero S hauteur 55,8 cm largeur 11 cm longueur 190 cm (Type 4)"}]
[]
[]
[]
[]
[]
[null,"*Puissance sonore testé selon ISO 3741:2010",null,null,null,null,null,null,null,null,null,null,null,{"$f":"cal!P46","v":"v2023-10-02"}]
[null,"**Pression sonore avec une atténuation ambiante du 8dB(A)"]

{"sheet":"NR","index":6,"n_rows":41,"n_cols":20,"rows_kept":41,"cut":false,"hidden":true,"merged":[[3,7,3,10],[4,7,4,10],[8,1,8,3],[8,6,8,9],[9,1,9,3],[9,6,9,9],[8,12,8,13],[15,1,15,13],[21,1,21,13],[27,1,27,13],[33,1,33,13],[11,6,11,9],[10,1,10,3],[10,6,10,9]]}
[]
[]
[null,"Modell"]
[null,null,null,null,null,null,null,"Væske blanding:",0,0,0]
[null,"Conditions",null,null,null,null,null,"Modell:",0,0,0]
[]
[null,"Temperaturer",null,null,null,null,null,null,null,null,null,null,null,null,null,null,"Kopier alle data"]
[null,"Varme:",null,null,null,null,"Kjøling:",null,null,null,null,null,null,null,null,null,"SI-enheter"]
[null,"Tur vann",0,0,{"$f":"cal!E9","v":45},null,{"$f":"B9","v":"Tur vann"},null,null,null,{"$f":"cal!K9","v":15.999999999999998},null,"Enhetssystem",null,null,null,"Imperiale-enheter"]
[null,"Retur vann",0,0,{"$f":"cal!E10","v":35},null,{"$f":"B10","v":"Retur vann"},null,null,null,{"$f":"cal!K10","v":18.222222222222221}]
[null,"Rom",0,0,{"$f":"cal!E11","v":20},null,{"$f":"B11","v":"Rom"},null,null,null,{"$f":"cal!K11","v":26.999999999999996}]
[null,null,null,null,null,null,"Relativ fuktighet",null,null,null,{"$f":"cal!K12","v":0.5}]
[]
[]
[null,"Hastighet","Styresignal [V]",{"$f":"CONCATENATE(\"Varme effekt \",ROUND(E9,0),\"/\",ROUND(E10,0),\"/\",ROUND(E11,0),\" [\"&IF(cal!$W$4=1,\"W\",IF(cal!$W$4=2,\"Btu/h\"))&\"]\")","v":"Varme effekt 45/35/20 [W]"},{"$f":"\"Vannmengde, varme [\"&IF(cal!$W$4=1,\"l/h\",IF(cal!$W$4=2,\"GPM\"))&\"]\"","v":"Vannmengde, varme [l/h]"},{"$f":"\"Trykktap [\"&IF(cal!$W$4=1,\"kPa\",IF(cal!$W$4=2,\"ftH2O\"))&\"]\"","v":"Trykktap [kPa]"},{"$f":"CONCATENATE(\"Sens. Kjøling effekt * \",ROUND(K9,0),\"/\",ROUND(K10,0),\"/\",ROUND(K11,0),\" [\"&IF(cal!$W$4=1,\"W\",IF(cal!$W$4=2,\"Btu/h\"))&\"]\")","v":"Sens. Kjøling effekt * 16/18/27 [W]"},{"$f":"CONCATENATE(\"Tot. Kjøle effekt \",ROUND(K9,0),\"/\",ROUND(K10,0),\"/\",ROUND(K11,0),\" [\"&IF(cal!$W$4=1,\"W\",IF(cal!$W$4=2,\"Btu/h\"))&\"]\")","v":"Tot. Kjøle effekt 16/18/27 [W]"},{"$f":"\"Vannmengde, kjøling [\"&IF(cal!$W$4=1,\"l/h\",IF(cal!$W$4=2,\"GPM\"))&\"]\"","v":"Vannmengde, kjøling [l/h]"},{"$f":"F15","v":"Trykktap [kPa]"},"Lydtrykk ** [dB(A)]","Lydeffekt * [dB(A)]","Elektrisk effekt [W]",{"$f":"\"Luftmengde [\"&IF(cal!$W$4=1,\"m³/h\",IF(cal!$W$4=2,\"CFM\"))&\"]\"","v":"Luftmengde [m³/h]"},{"$f":"\"Uitblaastemp. verwarming  [\"&IF(cal!$W$4=1,\"°C\",IF(cal!$W$4=2,\"°F\"))&\"]\"","v":"Uitblaastemp. verwarming  [°C]"},{"$f":"\"Uitblaastemp. koeling  [\"&IF(cal!$W$4=1,\"°C\",IF(cal!$W$4=2,\"°F\"))&\"]\"","v":"Uitblaastemp. koeling  [°C]"}]
[null,{"$f":"cal!$X$1&\" \"&$T$16&\" \"&ROUND(cal!X22,1)&IF(UnitsNo=1,\" cm\",IF(UnitsNo=2,\" in\"))& \" \"&$T$17&\" \"&ROUND(cal!Z22,1)&IF(UnitsNo=1,\" cm\",IF(UnitsNo=2,\" in\"))&\" \"&$T$18&\" \"&ROUND(cal!AB22,1)&IF(UnitsNo=1,\" cm\",IF(UnitsNo=2,\" in\"))&\" (Type 1)\"","v":"Briza Net Zero S høyde 55,8 cm bredde 11 cm lengde 75 cm (Type 1)"},null,null,null,null,null,null,null,null,null,null,null,null,null,null,null,"Temp.",null,"høyde"]
[null,null,null,null,null,null,null,null,null,null,null,null,null,null,null,null,null,"varme!",null,"bredde"]
[null,null,null,null,null,null,null,null,null,null,null,null,null,null,null,null,null,"kjøling!",null,"lengde"]
[]
[]
[]
[null,{"$f":"cal!$X$1&\" \"&$T$16&\" \"&ROUND(cal!X28,1)&IF(UnitsNo=1,\" cm\",IF(UnitsNo=2,\" in\"))& \" \"&$T$17&\" \"&ROUND(cal!Z28,1)&IF(UnitsNo=1,\" cm\",IF(UnitsNo=2,\" in\"))&\" \"&$T$18&\" \"&ROUND(cal!AB28,1)&IF(UnitsNo=1,\" cm\",IF(UnitsNo=2,\" in\"))&\" (Type 2)\"","v":"Briza Net Zero S høyde 55,8 cm bredde 11 cm lengde 110 cm (Type 2)"}]
[]
[]
[]
[]
[]
[null,{"$f":"cal!$X$1&\" \"&$T$16&\" \"&ROUND(cal!X34,1)&IF(UnitsNo=1,\" cm\",IF(UnitsNo=2,\" in\"))& \" \"&$T$17&\" \"&ROUND(cal!Z34,1)&IF(UnitsNo=1,\" cm\",IF(UnitsNo=2,\" in\"))&\" \"&$T$18&\" \"&ROUND(cal!AB34,1)&IF(UnitsNo=1,\" cm\",IF(UnitsNo=2,\" in\"))&\" (Type 3)\"","v":"Briza Net Zero S høyde 55,8 cm bredde 11 cm lengde 155 cm (Type 3)"}]
[]
[]
[]
[]
[]
[null,{"$f":"cal!$X$1&\" \"&$T$16&\" \"&ROUND(cal!X40,1)&IF(UnitsNo=1,\" cm\",IF(UnitsNo=2,\" in\"))& \" \"&$T$17&\" \"&ROUND(cal!Z40,1)&IF(UnitsNo=1,\" cm\",IF(UnitsNo=2,\" in\"))&\" \"&$T$18&\" \"&ROUND(cal!AB40,1)&IF(UnitsNo=1,\" cm\",IF(UnitsNo=2,\" in\"))&\" (Type 4)\"","v":"Briza Net Zero S høyde 55,8 cm bredde 11 cm lengde 190 cm (Type 4)"}]
[]
[]
[]
[]
[]
[null,"**Sound power according to ISO 3741:2010",null,null,null,null,null,null,null,null,null,null,null,{"$f":"cal!P46","v":"v2023-10-02"}]
[null,"***Sound pressure with an assumed room damping of 8dB(A)"]

{"sheet":"SP","index":7,"n_rows":41,"n_cols":20,"rows_kept":41,"cut":false,"hidden":true,"merged":[[3,7,3,10],[4,7,4,10],[8,1,8,3],[8,6,8,9],[9,1,9,3],[9,6,9,9],[33,1,33,13],[8,12,8,13],[10,1,10,3],[10,6,10,9],[11,6,11,9],[15,1,15,13],[21,1,21,13],[27,1,27,13]]}
[]
[]
[]
[]
[]
[]
[null,"Temperaturas",null,null,null,null,null,null,null,null,null,null,null,null,null,null,"Copiar todos los datos"]
[null,"Calefacción:",null,null,null,null,"Enfriamiento:",null,null,null,null,null,null,null,null,null,"Unidades-SI"]
[null,"Agua impulsión",0,0,{"$f":"cal!E9","v":45},null,{"$f":"B9","v":"Agua impulsión"},null,null,null,{"$f":"cal!K9","v":15.999999999999998},null,"Convers. de unidades",null,null,null,"Unidades-Imperial"]
[null,"Agua retorno",0,0,{"$f":"cal!E10","v":35},null,{"$f":"B10","v":"Agua retorno"},null,null,null,{"$f":"cal!K10","v":18.222222222222221}]
[null,"Ambiente",0,0,{"$f":"cal!E11","v":20},null,{"$f":"B11","v":"Ambiente"},null,null,null,{"$f":"cal!K11","v":26.999999999999996}]
[null,null,null,null,null,null,"Humedad relativa",null,null,null,{"$f":"cal!K12","v":0.5}]
[]
[]
[null,"Nivel de velocidad"," Voltaje control [V]",{"$f":"CONCATENATE(\"Emisión calefacción \",ROUND(E9,0),\"/\",ROUND(E10,0),\"/\",ROUND(E11,0),\" [\"&IF(UnitsNo=1,\"W\",IF(UnitsNo=2,\"Btu/h\"))&\"]\")","v":"Emisión calefacción 45/35/20 [W]"},{"$f":"\"Caudal de agua, calefacción [\"&IF(1=1,\"l/h\",IF(UnitsNo=2,\"GPM\"))&\"]\"","v":"Caudal de agua, calefacción [l/h]"},{"$f":"\"Pérdida de carga del agua [\"&IF(UnitsNo=1,\"kPa\",IF(UnitsNo=2,\"ftH2O\"))&\"]\"","v":"Pérdida de carga del agua [kPa]"},{"$f":"CONCATENATE(\"Emisión sensible Frío * \",ROUND(K9,0),\"/\",ROUND(K10,0),\"/\",ROUND(K11,0),\" [\"&IF(UnitsNo=1,\"W\",IF(UnitsNo=2,\"Btu/h\"))&\"]\")","v":"Emisión sensible Frío * 16/18/27 [W]"},{"$f":"CONCATENATE(\"Emisión total Frío \",ROUND(K9,0),\"/\",ROUND(K10,0),\"/\",ROUND(K11,0),\" [\"&IF(UnitsNo=1,\"W\",IF(UnitsNo=2,\"Btu/h\"))&\"]\")","v":"Emisión total Frío 16/18/27 [W]"},{"$f":"\"Caudal de agua, Frío [\"&IF(UnitsNo=1,\"l/h\",IF(UnitsNo=2,\"GPM\"))&\"]\"","v":"Caudal de agua, Frío [l/h]"},{"$f":"F15","v":"Pérdida de carga del agua [kPa]"},"Presión sonora ** [dB(A)]","Potencia sonora * [dB(A)]","Potencia eléctrica absorbida [W]",{"$f":"\"Caudal de aire [\"&IF(UnitsNo=1,\"m³/h\",IF(UnitsNo=2,\"CFM\"))&\"]\"","v":"Caudal de aire [m³/h]"},{"$f":"\"Temperatura salida de aire calefacción [\"&IF(UnitsNo=1,\"°C\",IF(UnitsNo=2,\"°F\"))&\"]\"","v":"Temperatura salida de aire calefacción [°C]"},{"$f":"\"Temperatura salida de aire refrigeración (bulbo seco) [\"&IF(UnitsNo=1,\"°C\",IF(UnitsNo=2,\"°F\"))&\"]\"","v":"Temperatura salida de aire refrigeración (bulbo seco) [°C]"}]
[null,{"$f":"cal!$X$1&\" \"&$T$16&\" \"&ROUND(cal!X22,1)&IF(UnitsNo=1,\" cm\",IF(UnitsNo=2,\" in\"))& \" \"&$T$17&\" \"&ROUND(cal!Z22,1)&IF(UnitsNo=1,\" cm\",IF(UnitsNo=2,\" in\"))&\" \"&$T$18&\" \"&ROUND(cal!AB22,1)&IF(UnitsNo=1,\" cm\",IF(UnitsNo=2,\" in\"))&\" (Type 1)\"","v":"Briza Net Zero S altura 55,8 cm ancho 11 cm longitud 75 cm (Type 1)"},null,null,null,null,null,null,null,null,null,null,null,null,null,null,null,"Temp.",null,"altura"]
[null,null,null,null,null,null,null,null,null,null,null,null,null,null,null,null,null,"calefac.",null,"ancho"]
[null,null,null,null,null,null,null,null,null,null,null,null,null,null,null,null,null,"enfria.",null,"longitud"]
[]
[]
[]
[null,{"$f":"cal!$X$1&\" \"&$T$16&\" \"&ROUND(cal!X28,1)&IF(UnitsNo=1,\" cm\",IF(UnitsNo=2,\" in\"))& \" \"&$T$17&\" \"&ROUND(cal!Z28,1)&IF(UnitsNo=1,\" cm\",IF(UnitsNo=2,\" in\"))&\" \"&$T$18&\" \"&ROUND(cal!AB28,1)&IF(UnitsNo=1,\" cm\",IF(UnitsNo=2,\" in\"))&\" (Type 2)\"","v":"Briza Net Zero S altura 55,8 cm ancho 11 cm longitud 110 cm (Type 2)"}]
[]
[]
[]
[]
[]
[null,{"$f":"cal!$X$1&\" \"&$T$16&\" \"&ROUND(cal!X34,1)&IF(UnitsNo=1,\" cm\",IF(UnitsNo=2,\" in\"))& \" \"&$T$17&\" \"&ROUND(cal!Z34,1)&IF(UnitsNo=1,\" cm\",IF(UnitsNo=2,\" in\"))&\" \"&$T$18&\" \"&ROUND(cal!AB34,1)&IF(UnitsNo=1,\" cm\",IF(UnitsNo=2,\" in\"))&\" (Type 3)\"","v":"Briza Net Zero S altura 55,8 cm ancho 11 cm longitud 155 cm (Type 3)"}]
[]
[]
[]
[]
[]
[null,{"$f":"cal!$X$1&\" \"&$T$16&\" \"&ROUND(cal!X40,1)&IF(UnitsNo=1,\" cm\",IF(UnitsNo=2,\" in\"))& \" \"&$T$17&\" \"&ROUND(cal!Z40,1)&IF(UnitsNo=1,\" cm\",IF(UnitsNo=2,\" in\"))&\" \"&$T$18&\" \"&ROUND(cal!AB40,1)&IF(UnitsNo=1,\" cm\",IF(UnitsNo=2,\" in\"))&\" (Type 4)\"","v":"Briza Net Zero S altura 55,8 cm ancho 11 cm longitud 190 cm (Type 4)"}]
[]
[]
[]
[]
[]
[null,"**Potencia sonora de acuerdo a ISO 3741:2010",null,null,null,null,null,null,null,null,null,null,null,{"$f":"cal!P46","v":"v2023-10-02"}]
[null,"***Presión sonora asumiendo una reducción de la estancia de  8dB(A)"]

{"sheet":"SW","index":8,"n_rows":41,"n_cols":20,"rows_kept":41,"cut":false,"hidden":true,"merged":[[3,7,3,10],[4,7,4,10],[8,1,8,3],[8,6,8,9],[33,1,33,13],[8,12,8,13],[10,6,10,9],[15,1,15,13],[21,1,21,13],[27,1,27,13],[9,1,9,3],[9,6,9,9]]}
[]
[]
[null,"Formulary"]
[null,null,null,null,null,null,null,"Hydraulic mix:",0,0,0]
[null,"Conditions",null,null,null,null,null,"Device - Ventilator - Utilization:",0,0,0]
[]
[null,"Temperaturer",null,null,null,null,null,null,null,null,null,null,null,null,null,null,"Kopiera all data"]
[null,"Värme:",null,null,null,null,"Kyla:",null,null,null,null,null,null,null,null,null,"SI-enheter"]
[null,"Tillopp",null,null,{"$f":"cal!E9","v":45},null,{"$f":"B9","v":"Tillopp"},null,null,null,{"$f":"cal!K9","v":15.999999999999998},null,"Enhetssystem",null,null,null,"Imperiella-enheter"]
[null,"Retur",null,null,{"$f":"cal!E10","v":35},null,{"$f":"B10","v":"Retur"},null,null,null,{"$f":"cal!K10","v":18.222222222222221}]
[null,"Rum (torr)",null,null,{"$f":"cal!E11","v":20},null,{"$f":"B11","v":"Rum (torr)"},null,null,null,{"$f":"cal!K11","v":26.999999999999996}]
[null,null,null,null,null,null,"rel. Fuktighet",null,null,null,{"$f":"cal!K12","v":0.5}]
[]
[]
[null,"Fläkthastighet","Spänning, Fläkt [V]",{"$f":"CONCATENATE(\"Värme effekt  \",ROUND(E9,0),\"/\",ROUND(E10,0),\"/\",ROUND(E11,0),\" [\"&IF(cal!$W$4=1,\"W\",IF(cal!$W$4=2,\"Btu/h\"))&\"]\")","v":"Värme effekt  45/35/20 [W]"},{"$f":"\"Vattenflöde, värme [\"&IF(cal!$W$4=1,\"l/h\",IF(cal!$W$4=2,\"GPM\"))&\"]\"","v":"Vattenflöde, värme [l/h]"},{"$f":"\"Tryckfall, vatten [\"&IF(cal!$W$4=1,\"kPa\",IF(cal!$W$4=2,\"inH2O\"))&\"]\"","v":"Tryckfall, vatten [kPa]"},{"$f":"CONCATENATE(\"Märkbar kylkapacitet  \",ROUND(K9,0),\"/\",ROUND(K10,0),\"/\",ROUND(K11,0),\" [\"&IF(cal!$W$4=1,\"W\",IF(cal!$W$4=2,\"Btu/h\"))&\"]\")","v":"Märkbar kylkapacitet  16/18/27 [W]"},{"$f":"CONCATENATE(\"Total kylkapacitet \",ROUND(K9,0),\"/\",ROUND(K10,0),\"/\",ROUND(K11,0),\" [\"&IF(cal!$W$4=1,\"W\",IF(cal!$W$4=2,\"Btu/h\"))&\"]\")","v":"Total kylkapacitet 16/18/27 [W]"},{"$f":"\"Vattenflöde, kyla [\"&IF(cal!$W$4=1,\"l/h\",IF(cal!$W$4=2,\"GPM\"))&\"]\"","v":"Vattenflöde, kyla [l/h]"},{"$f":"F15","v":"Tryckfall, vatten [kPa]"},"Ljudtryck ** [dB(A)]","Ljudeffekt * [dB(A)]","Effektförbrukning [W]",{"$f":"\"Luftflöde [\"&IF(cal!$W$4=1,\"m³/h\",IF(cal!$W$4=2,\"CFM\"))&\"]\"","v":"Luftflöde [m³/h]"},{"$f":"\"Luftavgassystemets värming  [\"&IF(cal!$W$4=1,\"°C\",IF(cal!$W$4=2,\"°F\"))&\"]\"","v":"Luftavgassystemets värming  [°C]"},{"$f":"\"Luftavgassystemets kylning  [\"&IF(cal!$W$4=1,\"°C\",IF(cal!$W$4=2,\"°F\"))&\"]\"","v":"Luftavgassystemets kylning  [°C]"}]
[null,{"$f":"cal!$X$1&\" \"&$T$16&\" \"&ROUND(cal!X22,1)&IF(UnitsNo=1,\" cm\",IF(UnitsNo=2,\" in\"))& \" \"&$T$17&\" \"&ROUND(cal!Z22,1)&IF(UnitsNo=1,\" cm\",IF(UnitsNo=2,\" in\"))&\" \"&$T$18&\" \"&ROUND(cal!AB22,1)&IF(UnitsNo=1,\" cm\",IF(UnitsNo=2,\" in\"))&\" (Typ 1)\"","v":"Briza Net Zero S höjd 55,8 cm djup 11 cm längd 75 cm (Typ 1)"},null,null,null,null,null,null,null,null,null,null,null,null,null,null,null,"Temp.",null,"höjd"]
[null,null,null,null,null,null,null,null,null,null,null,null,null,null,null,null,null,"värme!",null,"djup"]
[null,null,null,null,null,null,null,null,null,null,null,null,null,null,null,null,null,"kyla!",null,"längd"]
[]
[]
[]
[null,{"$f":"cal!$X$1&\" \"&$T$16&\" \"&ROUND(cal!X28,1)&IF(UnitsNo=1,\" cm\",IF(UnitsNo=2,\" in\"))& \" \"&$T$17&\" \"&ROUND(cal!Z28,1)&IF(UnitsNo=1,\" cm\",IF(UnitsNo=2,\" in\"))&\" \"&$T$18&\" \"&ROUND(cal!AB28,1)&IF(UnitsNo=1,\" cm\",IF(UnitsNo=2,\" in\"))&\" (Typ 2)\"","v":"Briza Net Zero S höjd 55,8 cm djup 11 cm längd 110 cm (Typ 2)"}]
[]
[]
[]
[]
[]
[null,{"$f":"cal!$X$1&\" \"&$T$16&\" \"&ROUND(cal!X34,1)&IF(UnitsNo=1,\" cm\",IF(UnitsNo=2,\" in\"))& \" \"&$T$17&\" \"&ROUND(cal!Z34,1)&IF(UnitsNo=1,\" cm\",IF(UnitsNo=2,\" in\"))&\" \"&$T$18&\" \"&ROUND(cal!AB34,1)&IF(UnitsNo=1,\" cm\",IF(UnitsNo=2,\" in\"))&\" (Typ 3)\"","v":"Briza Net Zero S höjd 55,8 cm djup 11 cm längd 155 cm (Typ 3)"}]
[]
[]
[]
[]
[]
[null,{"$f":"cal!$X$1&\" \"&$T$16&\" \"&ROUND(cal!X40,1)&IF(UnitsNo=1,\" cm\",IF(UnitsNo=2,\" in\"))& \" \"&$T$17&\" \"&ROUND(cal!Z40,1)&IF(UnitsNo=1,\" cm\",IF(UnitsNo=2,\" in\"))&\" \"&$T$18&\" \"&ROUND(cal!AB40,1)&IF(UnitsNo=1,\" cm\",IF(UnitsNo=2,\" in\"))&\" (Typ 4)\"","v":"Briza Net Zero S höjd 55,8 cm djup 11 cm längd 190 cm (Typ 4)"}]
[]
[]
[]
[]
[]
[null,"*Ljudeffekt enligt ISO 3741: 2010",null,null,null,null,null,null,null,null,null,null,null,{"$f":"cal!P46","v":"v2023-10-02"}]
[null,"**Ljudtryck med en antagen rumsdämpning på 8dB (A)"]

{"sheet":"TS","index":9,"n_rows":41,"n_cols":20,"rows_kept":41,"cut":false,"hidden":true,"merged":[[33,1,33,13],[3,7,3,10],[4,7,4,10],[8,1,8,3],[8,6,8,9],[8,12,8,13],[9,1,9,3],[9,6,9,9],[10,1,10,3],[10,6,10,9],[15,1,15,13],[21,1,21,13],[27,1,27,13]]}
[]
[]
[null,"Invulformulier"]
[null,null,null,null,null,null,null,"Směs vody:",0,0,0]
[null,"Randvoorwaarden",null,null,null,null,null,"Těleso - Ventilátor - Verze:",0,0,0]
[]
[null,"Teploty",null,null,null,null,null,null,null,null,null,null,null,null,null,null,"Kopírovat všechna data"]
[null,"Topení:",null,null,null,null,"Chlazení:",null,null,null,null,null,null,null,null,null,"Mezinárodní (Sl)"]
[null,{"$f":"\"Voda na přívodu\"","v":"Voda na přívodu"},null,null,{"$f":"cal!E9","v":45},null,{"$f":"B9","v":"Voda na přívodu"},null,null,null,{"$f":"cal!K9","v":15.999999999999998},null,"Převod jednotek",null,null,null,"Imperiální"]
[null,{"$f":"\"Voda na zpátečce\"","v":"Voda na zpátečce"},null,null,{"$f":"cal!E10","v":35},null,{"$f":"B10","v":"Voda na zpátečce"},null,null,null,{"$f":"cal!K10","v":18.222222222222221}]
[null,"\"Suchá\" teplota vzduchu",null,null,{"$f":"cal!E11","v":20},null,{"$f":"B11","v":"\"Suchá\" teplota vzduchu"},null,null,null,{"$f":"cal!K11","v":26.999999999999996}]
[null,null,null,null,null,null,"Relativní vlhkost",null,null,null,{"$f":"cal!K12","v":0.5}]
[]
[]
[null,"Rychlost","Ovládací napětí [V]",{"$f":"CONCATENATE(\"Výkon Topení  \",ROUND(E9,0),\"/\",ROUND(E10,0),\"/\",ROUND(E11,0),\" [\"&IF(UnitsNo=1,\"W\",IF(UnitsNo=2,\"Btu/h\"))&\"]\")","v":"Výkon Topení  45/35/20 [W]"},{"$f":"\"Průtok vody, topení [\"&IF(UnitsNo=1,\"l/h\",IF(UnitsNo=2,\"GPM\"))&\"]\"","v":"Průtok vody, topení [l/h]"},{"$f":"\"Tlaková ztráta [\"&IF(UnitsNo=1,\"kPa\",IF(UnitsNo=2,\"inH2O\"))&\"]\"","v":"Tlaková ztráta [kPa]"},{"$f":"CONCATENATE(\"Výkon chlazení Znatelný  \",ROUND(K9,0),\"/\",,ROUND(K10,0),\"/\",,ROUND(K11,0),\" [\"&IF(UnitsNo=1,\"W\",IF(UnitsNo=2,\"Btu/h\"))&\"]\")","v":"Výkon chlazení Znatelný  16/18/27 [W]"},{"$f":"CONCATENATE(\"Výkon chlazení Celkový \",,ROUND(K9,0),\"/\",,ROUND(K10,0),\"/\",,ROUND(K11,0),\" [\"&IF(UnitsNo=1,\"W\",IF(UnitsNo=2,\"Btu/h\"))&\"]\")","v":"Výkon chlazení Celkový 16/18/27 [W]"},{"$f":"\"Průtok vody, chlazení [\"&IF(UnitsNo=1,\"l/h\",IF(UnitsNo=2,\"GPM\"))&\"]\"","v":"Průtok vody, chlazení [l/h]"},{"$f":"F15","v":"Tlaková ztráta [kPa]"},"Akustický tlak ** [dB(A)]","Akustický výkon * [dB(A)]","Elektrický výkon [W]",{"$f":"\"Průtok vzduchu [\"&IF(UnitsNo=1,\"m³/h\",IF(UnitsNo=2,\"CFM\"))&\"]\"","v":"Průtok vzduchu [m³/h]"},{"$f":"\"Výfuková teplota vzduchu top. [\"&IF(UnitsNo=1,\"°C\",IF(UnitsNo=2,\"°F\"))&\"]\"","v":"Výfuková teplota vzduchu top. [°C]"},{"$f":"\"Výfuková teplota vzduchu chlaz.  [\"&IF(UnitsNo=1,\"°C\",IF(UnitsNo=2,\"°F\"))&\"]\"","v":"Výfuková teplota vzduchu chlaz.  [°C]"}]
[null,{"$f":"cal!$X$1&\" \"&$T$16&\", \"&ROUND(cal!X22,1)&IF(UnitsNo=1,\" cm\",IF(UnitsNo=2,\" in\"))& \", \"&$T$17&\" \"&ROUND(cal!Z22,1)&IF(UnitsNo=1,\" cm\",IF(UnitsNo=2,\" in\"))&\", \"&$T$18&\" \"&ROUND(cal!AB22,1)&IF(UnitsNo=1,\" cm\",IF(UnitsNo=2,\" in\"))&\" (Typ 1)\"","v":"Briza Net Zero S Výška, 55,8 cm, Šířka 11 cm, Délka 75 cm (Typ 1)"},null,null,null,null,null,null,null,null,null,null,null,null,null,null,null,"Teploty",null,"Výška"]
[null,null,null,null,null,null,null,null,null,null,null,null,null,null,null,null,null,"topení!",null,"Šířka"]
[null,null,null,null,null,null,null,null,null,null,null,null,null,null,null,null,null,"chlazení!",null,"Délka"]
[]
[]
[]
[null,{"$f":"cal!$X$1&\" \"&$T$16&\" \"&ROUND(cal!X28,1)&IF(UnitsNo=1,\" cm\",IF(UnitsNo=2,\" in\"))& \" \"&$T$17&\" \"&ROUND(cal!Z28,1)&IF(UnitsNo=1,\" cm\",IF(UnitsNo=2,\" in\"))&\" \"&$T$18&\" \"&ROUND(cal!AB28,1)&IF(UnitsNo=1,\" cm\",IF(UnitsNo=2,\" in\"))&\" (Typ 2)\"","v":"Briza Net Zero S Výška 55,8 cm Šířka 11 cm Délka 110 cm (Typ 2)"}]
[]
[]
[]
[]
[]
[null,{"$f":"cal!$X$1&\" \"&$T$16&\" \"&ROUND(cal!X34,1)&IF(UnitsNo=1,\" cm\",IF(UnitsNo=2,\" in\"))& \" \"&$T$17&\" \"&ROUND(cal!Z34,1)&IF(UnitsNo=1,\" cm\",IF(UnitsNo=2,\" in\"))&\" \"&$T$18&\" \"&ROUND(cal!AB34,1)&IF(UnitsNo=1,\" cm\",IF(UnitsNo=2,\" in\"))&\" (Typ 3)\"","v":"Briza Net Zero S Výška 55,8 cm Šířka 11 cm Délka 155 cm (Typ 3)"}]
[]
[]
[]
[]
[]
[null,{"$f":"cal!$X$1&\" \"&$T$16&\" \"&ROUND(cal!X40,1)&IF(UnitsNo=1,\" cm\",IF(UnitsNo=2,\" in\"))& \" \"&$T$17&\" \"&ROUND(cal!Z40,1)&IF(UnitsNo=1,\" cm\",IF(UnitsNo=2,\" in\"))&\" \"&$T$18&\" \"&ROUND(cal!AB40,1)&IF(UnitsNo=1,\" cm\",IF(UnitsNo=2,\" in\"))&\" (Typ 4)\"","v":"Briza Net Zero S Výška 55,8 cm Šířka 11 cm Délka 190 cm (Typ 4)"}]
[]
[]
[]
[]
[]
[null,"*Akustický tlak podle ISO 3741:2010 ",null,null,null,null,null,null,null,null,null,null,null,{"$f":"cal!P46","v":"v2023-10-02"}]
[null,"**Akustický výkon s předpokládaným útlumem místnosti 8 dB (A)."]

{"sheet":"ExtraTaal1","index":10,"n_rows":41,"n_cols":20,"rows_kept":41,"cut":false,"hidden":true,"merged":[[33,1,33,13],[3,7,3,10],[4,7,4,10],[8,1,8,3],[8,6,8,9],[8,12,8,13],[9,1,9,3],[9,6,9,9],[10,6,10,9],[15,1,15,13],[21,1,21,13],[27,1,27,13]]}
[]
[]
[null,"Formulary"]
[null,null,null,null,null,null,null,"Hydraulic mix:",0,0,0]
[null,"Conditions",null,null,null,null,null,"Device - Ventilator - Utilization:",0,0,0]
[]
[null,"Temperatures",null,null,null,null,null,null,null,null,null,null,null,null,null,null,"Copy all data"]
[null,"Heating:",null,null,null,null,"Cooling:",null,null,null,null,null,null,null,null,null,"SI-units"]
[null,"Supply water",null,null,{"$f":"cal!E9","v":45},null,{"$f":"B9","v":"Supply water"},null,null,null,{"$f":"cal!K9","v":15.999999999999998},null,"Unit conversion",null,null,null,"Imperial-units"]
[null,"Return water",null,null,{"$f":"cal!E10","v":35},null,{"$f":"B10","v":"Return water"},null,null,null,{"$f":"cal!K10","v":18.222222222222221}]
[null,"Entering air",null,null,{"$f":"cal!E11","v":20},null,{"$f":"B11","v":"Entering air"},null,null,null,{"$f":"cal!K11","v":26.999999999999996}]
[null,null,null,null,null,null,"Relative humidity",null,null,null,{"$f":"cal!K12","v":0.5}]
[]
[]
[null,"Speed level","Control voltage [V]",{"$f":"CONCATENATE(\"Heat output  \",ROUND(E9,0),\"/\",ROUND(E10,0),\"/\",ROUND(E11,0),\" [\"&IF(cal!$W$4=1,\"W\",IF(cal!$W$4=2,\"Btu/h\"))&\"]\")","v":"Heat output  45/35/20 [W]"},{"$f":"\"Water flowrate, heating [\"&IF(cal!$W$4=1,\"l/h\",IF(cal!$W$4=2,\"GPM\"))&\"]\"","v":"Water flowrate, heating [l/h]"},{"$f":"\"Watersided pressure loss [\"&IF(cal!$W$4=1,\"kPa\",IF(cal!$W$4=2,\"inH2O\"))&\"]\"","v":"Watersided pressure loss [kPa]"},{"$f":"CONCATENATE(\"Sens. cooling capacity  \",ROUND(K9,0),\"/\",ROUND(K10,0),\"/\",ROUND(K11,0),\" [\"&IF(cal!$W$4=1,\"W\",IF(cal!$W$4=2,\"Btu/h\"))&\"]\")","v":"Sens. cooling capacity  16/18/27 [W]"},{"$f":"CONCATENATE(\"Tot. cooling capacity \",ROUND(K9,0),\"/\",ROUND(K10,0),\"/\",ROUND(K11,0),\" [\"&IF(cal!$W$4=1,\"W\",IF(cal!$W$4=2,\"Btu/h\"))&\"]\")","v":"Tot. cooling capacity 16/18/27 [W]"},{"$f":"\"Water flowrate, cooling [\"&IF(cal!$W$4=1,\"l/h\",IF(cal!$W$4=2,\"GPM\"))&\"]\"","v":"Water flowrate, cooling [l/h]"},{"$f":"\"Watersided pressure loss [\"&IF(cal!$W$4=1,\"kPa\",IF(cal!$W$4=2,\"inH2O\"))&\"]\"","v":"Watersided pressure loss [kPa]"},"Sound pressure ** [dB(A)]","Sound power * [dB(A)]","Electrical power [W]",{"$f":"\"Air flowrate [\"&IF(cal!$W$4=1,\"m³/h\",IF(cal!$W$4=2,\"CFM\"))&\"]\"","v":"Air flowrate [m³/h]"},{"$f":"\"Air exhaust temp. heating  [\"&IF(cal!$W$4=1,\"°C\",IF(cal!$W$4=2,\"°F\"))&\"]\"","v":"Air exhaust temp. heating  [°C]"},{"$f":"\"Air exhaust temp. cooling  [\"&IF(cal!$W$4=1,\"°C\",IF(cal!$W$4=2,\"°F\"))&\"]\"","v":"Air exhaust temp. cooling  [°C]"}]
[null,{"$f":"cal!$X$1&\" \"&$T$16&\" \"&ROUND(cal!X22,1)&IF(UnitsNo=1,\" cm\",IF(UnitsNo=2,\" in\"))& \" \"&$T$17&\" \"&ROUND(cal!Z22,1)&IF(UnitsNo=1,\" cm\",IF(UnitsNo=2,\" in\"))&\" \"&$T$18&\" \"&ROUND(cal!AB22,1)&IF(UnitsNo=1,\" cm\",IF(UnitsNo=2,\" in\"))&\" (Type 1)\"","v":"Briza Net Zero S height 55,8 cm width 11 cm length 75 cm (Type 1)"},null,null,null,null,null,null,null,null,null,null,null,null,null,null,null,"Temp.",null,"height"]
[null,null,null,null,null,null,null,null,null,null,null,null,null,null,null,null,null,"heating!",null,"width"]
[null,null,null,null,null,null,null,null,null,null,null,null,null,null,null,null,null,"cooling!",null,"length"]
[]
[]
[]
[null,{"$f":"cal!$X$1&\" \"&$T$16&\" \"&ROUND(cal!X28,1)&IF(UnitsNo=1,\" cm\",IF(UnitsNo=2,\" in\"))& \" \"&$T$17&\" \"&ROUND(cal!Z28,1)&IF(UnitsNo=1,\" cm\",IF(UnitsNo=2,\" in\"))&\" \"&$T$18&\" \"&ROUND(cal!AB28,1)&IF(UnitsNo=1,\" cm\",IF(UnitsNo=2,\" in\"))&\" (Type 2)\"","v":"Briza Net Zero S height 55,8 cm width 11 cm length 110 cm (Type 2)"}]
[]
[]
[]
[]
[]
[null,{"$f":"cal!$X$1&\" \"&$T$16&\" \"&ROUND(cal!X34,1)&IF(UnitsNo=1,\" cm\",IF(UnitsNo=2,\" in\"))& \" \"&$T$17&\" \"&ROUND(cal!Z34,1)&IF(UnitsNo=1,\" cm\",IF(UnitsNo=2,\" in\"))&\" \"&$T$18&\" \"&ROUND(cal!AB34,1)&IF(UnitsNo=1,\" cm\",IF(UnitsNo=2,\" in\"))&\" (Type 3)\"","v":"Briza Net Zero S height 55,8 cm width 11 cm length 155 cm (Type 3)"}]
[]
[]
[]
[]
[]
[null,{"$f":"cal!$X$1&\" \"&$T$16&\" \"&ROUND(cal!X40,1)&IF(UnitsNo=1,\" cm\",IF(UnitsNo=2,\" in\"))& \" \"&$T$17&\" \"&ROUND(cal!Z40,1)&IF(UnitsNo=1,\" cm\",IF(UnitsNo=2,\" in\"))&\" \"&$T$18&\" \"&ROUND(cal!AB40,1)&IF(UnitsNo=1,\" cm\",IF(UnitsNo=2,\" in\"))&\" (Type 4)\"","v":"Briza Net Zero S height 55,8 cm width 11 cm length 190 cm (Type 4)"}]
[]
[]
[]
[]
[]
[null,"*Sound power according to ISO 3741:2010",null,null,null,null,null,null,null,null,null,null,null,{"$f":"cal!P46","v":"v2023-10-02"}]
[null,"**Sound pressure with an assumed room damping of 8dB(A)"]

{"sheet":"ExtraTaal2","index":11,"n_rows":41,"n_cols":20,"rows_kept":41,"cut":false,"hidden":true,"merged":[[33,1,33,13],[3,7,3,10],[4,7,4,10],[8,1,8,3],[8,6,8,9],[8,12,8,13],[9,1,9,3],[9,6,9,9],[10,6,10,9],[15,1,15,13],[21,1,21,13],[27,1,27,13]]}
[]
[]
[null,"Formulary"]
[null,null,null,null,null,null,null,"Hydraulic mix:",0,0,0]
[null,"Conditions",null,null,null,null,null,"Device - Ventilator - Utilization:",0,0,0]
[]
[null,"Temperatures",null,null,null,null,null,null,null,null,null,null,null,null,null,null,"Copy all data"]
[null,"Heating:",null,null,null,null,"Cooling:",null,null,null,null,null,null,null,null,null,"SI-units"]
[null,"Supply water",null,null,{"$f":"cal!E9","v":45},null,{"$f":"B9","v":"Supply water"},null,null,null,{"$f":"cal!K9","v":15.999999999999998},null,"Unit conversion",null,null,null,"Imperial-units"]
[null,"Return water",null,null,{"$f":"cal!E10","v":35},null,{"$f":"B10","v":"Return water"},null,null,null,{"$f":"cal!K10","v":18.222222222222221}]
[null,"Entering air",null,null,{"$f":"cal!E11","v":20},null,{"$f":"B11","v":"Entering air"},null,null,null,{"$f":"cal!K11","v":26.999999999999996}]
[null,null,null,null,null,null,"Relative humidity",null,null,null,{"$f":"cal!K12","v":0.5}]
[]
[]
[null,"Speed level","Control voltage [V]",{"$f":"CONCATENATE(\"Heat output  \",ROUND(E9,0),\"/\",ROUND(E10,0),\"/\",ROUND(E11,0),\" [\"&IF(cal!$W$4=1,\"W\",IF(cal!$W$4=2,\"Btu/h\"))&\"]\")","v":"Heat output  45/35/20 [W]"},{"$f":"\"Water flowrate, heating [\"&IF(cal!$W$4=1,\"l/h\",IF(cal!$W$4=2,\"GPM\"))&\"]\"","v":"Water flowrate, heating [l/h]"},{"$f":"\"Watersided pressure loss [\"&IF(cal!$W$4=1,\"kPa\",IF(cal!$W$4=2,\"inH2O\"))&\"]\"","v":"Watersided pressure loss [kPa]"},{"$f":"CONCATENATE(\"Sens. cooling capacity  \",ROUND(K9,0),\"/\",ROUND(K10,0),\"/\",ROUND(K11,0),\" [\"&IF(cal!$W$4=1,\"W\",IF(cal!$W$4=2,\"Btu/h\"))&\"]\")","v":"Sens. cooling capacity  16/18/27 [W]"},{"$f":"CONCATENATE(\"Tot. cooling capacity \",ROUND(K9,0),\"/\",ROUND(K10,0),\"/\",ROUND(K11,0),\" [\"&IF(cal!$W$4=1,\"W\",IF(cal!$W$4=2,\"Btu/h\"))&\"]\")","v":"Tot. cooling capacity 16/18/27 [W]"},{"$f":"\"Water flowrate, cooling [\"&IF(cal!$W$4=1,\"l/h\",IF(cal!$W$4=2,\"GPM\"))&\"]\"","v":"Water flowrate, cooling [l/h]"},{"$f":"\"Watersided pressure loss [\"&IF(cal!$W$4=1,\"kPa\",IF(cal!$W$4=2,\"inH2O\"))&\"]\"","v":"Watersided pressure loss [kPa]"},"Sound pressure ** [dB(A)]","Sound power * [dB(A)]","Electrical power [W]",{"$f":"\"Air flowrate [\"&IF(cal!$W$4=1,\"m³/h\",IF(cal!$W$4=2,\"CFM\"))&\"]\"","v":"Air flowrate [m³/h]"},{"$f":"\"Air exhaust temp. heating  [\"&IF(cal!$W$4=1,\"°C\",IF(cal!$W$4=2,\"°F\"))&\"]\"","v":"Air exhaust temp. heating  [°C]"},{"$f":"\"Air exhaust temp. cooling  [\"&IF(cal!$W$4=1,\"°C\",IF(cal!$W$4=2,\"°F\"))&\"]\"","v":"Air exhaust temp. cooling  [°C]"}]
[null,{"$f":"cal!$X$1&\" \"&$T$16&\" \"&ROUND(cal!X22,1)&IF(UnitsNo=1,\" cm\",IF(UnitsNo=2,\" in\"))& \" \"&$T$17&\" \"&ROUND(cal!Z22,1)&IF(UnitsNo=1,\" cm\",IF(UnitsNo=2,\" in\"))&\" \"&$T$18&\" \"&ROUND(cal!AB22,1)&IF(UnitsNo=1,\" cm\",IF(UnitsNo=2,\" in\"))&\" (Type 1)\"","v":"Briza Net Zero S height 55,8 cm width 11 cm length 75 cm (Type 1)"},null,null,null,null,null,null,null,null,null,null,null,null,null,null,null,"Temp.",null,"height"]
[null,null,null,null,null,null,null,null,null,null,null,null,null,null,null,null,null,"heating!",null,"width"]
[null,null,null,null,null,null,null,null,null,null,null,null,null,null,null,null,null,"cooling!",null,"length"]
[]
[]
[]
[null,{"$f":"cal!$X$1&\" \"&$T$16&\" \"&ROUND(cal!X28,1)&IF(UnitsNo=1,\" cm\",IF(UnitsNo=2,\" in\"))& \" \"&$T$17&\" \"&ROUND(cal!Z28,1)&IF(UnitsNo=1,\" cm\",IF(UnitsNo=2,\" in\"))&\" \"&$T$18&\" \"&ROUND(cal!AB28,1)&IF(UnitsNo=1,\" cm\",IF(UnitsNo=2,\" in\"))&\" (Type 2)\"","v":"Briza Net Zero S height 55,8 cm width 11 cm length 110 cm (Type 2)"}]
[]
[]
[]
[]
[]
[null,{"$f":"cal!$X$1&\" \"&$T$16&\" \"&ROUND(cal!X34,1)&IF(UnitsNo=1,\" cm\",IF(UnitsNo=2,\" in\"))& \" \"&$T$17&\" \"&ROUND(cal!Z34,1)&IF(UnitsNo=1,\" cm\",IF(UnitsNo=2,\" in\"))&\" \"&$T$18&\" \"&ROUND(cal!AB34,1)&IF(UnitsNo=1,\" cm\",IF(UnitsNo=2,\" in\"))&\" (Type 3)\"","v":"Briza Net Zero S height 55,8 cm width 11 cm length 155 cm (Type 3)"}]
[]
[]
[]
[]
[]
[null,{"$f":"cal!$X$1&\" \"&$T$16&\" \"&ROUND(cal!X40,1)&IF(UnitsNo=1,\" cm\",IF(UnitsNo=2,\" in\"))& \" \"&$T$17&\" \"&ROUND(cal!Z40,1)&IF(UnitsNo=1,\" cm\",IF(UnitsNo=2,\" in\"))&\" \"&$T$18&\" \"&ROUND(cal!AB40,1)&IF(UnitsNo=1,\" cm\",IF(UnitsNo=2,\" in\"))&\" (Type 4)\"","v":"Briza Net Zero S height 55,8 cm width 11 cm length 190 cm (Type 4)"}]
[]
[]
[]
[]
[]
[null,"*Sound power according to ISO 3741:2010",null,null,null,null,null,null,null,null,null,null,null,{"$f":"cal!P46","v":"v2023-10-02"}]
[null,"**Sound pressure with an assumed room damping of 8dB(A)"]

{"sheet":"ExtraTaal3","index":12,"n_rows":41,"n_cols":20,"rows_kept":41,"cut":false,"hidden":true,"merged":[[33,1,33,13],[3,7,3,10],[4,7,4,10],[8,1,8,3],[8,6,8,9],[8,12,8,13],[9,1,9,3],[9,6,9,9],[10,6,10,9],[15,1,15,13],[21,1,21,13],[27,1,27,13]]}
[]
[]
[null,"Formulary"]
[null,null,null,null,null,null,null,"Hydraulic mix:",0,0,0]
[null,"Conditions",null,null,null,null,null,"Device - Ventilator - Utilization:",0,0,0]
[]
[null,"Temperatures",null,null,null,null,null,null,null,null,null,null,null,null,null,null,"Copy all data"]
[null,"Heating:",null,null,null,null,"Cooling:",null,null,null,null,null,null,null,null,null,"SI-units"]
[null,"Supply water",null,null,{"$f":"cal!E9","v":45},null,{"$f":"B9","v":"Supply water"},null,null,null,{"$f":"cal!K9","v":15.999999999999998},null,"Unit conversion",null,null,null,"Imperial-units"]
[null,"Return water",null,null,{"$f":"cal!E10","v":35},null,{"$f":"B10","v":"Return water"},null,null,null,{"$f":"cal!K10","v":18.222222222222221}]
[null,"Entering air",null,null,{"$f":"cal!E11","v":20},null,{"$f":"B11","v":"Entering air"},null,null,null,{"$f":"cal!K11","v":26.999999999999996}]
[null,null,null,null,null,null,"Relative humidity",null,null,null,{"$f":"cal!K12","v":0.5}]
[]
[]
[null,"Speed level","Control voltage [V]",{"$f":"CONCATENATE(\"Heat output  \",ROUND(E9,0),\"/\",ROUND(E10,0),\"/\",ROUND(E11,0),\" [\"&IF(cal!$W$4=1,\"W\",IF(cal!$W$4=2,\"Btu/h\"))&\"]\")","v":"Heat output  45/35/20 [W]"},{"$f":"\"Water flowrate, heating [\"&IF(cal!$W$4=1,\"l/h\",IF(cal!$W$4=2,\"GPM\"))&\"]\"","v":"Water flowrate, heating [l/h]"},{"$f":"\"Watersided pressure loss [\"&IF(cal!$W$4=1,\"kPa\",IF(cal!$W$4=2,\"inH2O\"))&\"]\"","v":"Watersided pressure loss [kPa]"},{"$f":"CONCATENATE(\"Sens. cooling capacity  \",ROUND(K9,0),\"/\",ROUND(K10,0),\"/\",ROUND(K11,0),\" [\"&IF(cal!$W$4=1,\"W\",IF(cal!$W$4=2,\"Btu/h\"))&\"]\")","v":"Sens. cooling capacity  16/18/27 [W]"},{"$f":"CONCATENATE(\"Tot. cooling capacity \",ROUND(K9,0),\"/\",ROUND(K10,0),\"/\",ROUND(K11,0),\" [\"&IF(cal!$W$4=1,\"W\",IF(cal!$W$4=2,\"Btu/h\"))&\"]\")","v":"Tot. cooling capacity 16/18/27 [W]"},{"$f":"\"Water flowrate, cooling [\"&IF(cal!$W$4=1,\"l/h\",IF(cal!$W$4=2,\"GPM\"))&\"]\"","v":"Water flowrate, cooling [l/h]"},{"$f":"\"Watersided pressure loss [\"&IF(cal!$W$4=1,\"kPa\",IF(cal!$W$4=2,\"inH2O\"))&\"]\"","v":"Watersided pressure loss [kPa]"},"Sound pressure ** [dB(A)]","Sound power * [dB(A)]","Electrical power [W]",{"$f":"\"Air flowrate [\"&IF(cal!$W$4=1,\"m³/h\",IF(cal!$W$4=2,\"CFM\"))&\"]\"","v":"Air flowrate [m³/h]"},{"$f":"\"Air exhaust temp. heating  [\"&IF(cal!$W$4=1,\"°C\",IF(cal!$W$4=2,\"°F\"))&\"]\"","v":"Air exhaust temp. heating  [°C]"},{"$f":"\"Air exhaust temp. cooling  [\"&IF(cal!$W$4=1,\"°C\",IF(cal!$W$4=2,\"°F\"))&\"]\"","v":"Air exhaust temp. cooling  [°C]"}]
[null,{"$f":"cal!$X$1&\" \"&$T$16&\" \"&ROUND(cal!X22,1)&IF(UnitsNo=1,\" cm\",IF(UnitsNo=2,\" in\"))& \" \"&$T$17&\" \"&ROUND(cal!Z22,1)&IF(UnitsNo=1,\" cm\",IF(UnitsNo=2,\" in\"))&\" \"&$T$18&\" \"&ROUND(cal!AB22,1)&IF(UnitsNo=1,\" cm\",IF(UnitsNo=2,\" in\"))&\" (Type 1)\"","v":"Briza Net Zero S height 55,8 cm width 11 cm length 75 cm (Type 1)"},null,null,null,null,null,null,null,null,null,null,null,null,null,null,null,"Temp.",null,"height"]
[null,null,null,null,null,null,null,null,null,null,null,null,null,null,null,null,null,"heating!",null,"width"]
[null,null,null,null,null,null,null,null,null,null,null,null,null,null,null,null,null,"cooling!",null,"length"]
[]
[]
[]
[null,{"$f":"cal!$X$1&\" \"&$T$16&\" \"&ROUND(cal!X28,1)&IF(UnitsNo=1,\" cm\",IF(UnitsNo=2,\" in\"))& \" \"&$T$17&\" \"&ROUND(cal!Z28,1)&IF(UnitsNo=1,\" cm\",IF(UnitsNo=2,\" in\"))&\" \"&$T$18&\" \"&ROUND(cal!AB28,1)&IF(UnitsNo=1,\" cm\",IF(UnitsNo=2,\" in\"))&\" (Type 2)\"","v":"Briza Net Zero S height 55,8 cm width 11 cm length 110 cm (Type 2)"}]
[]
[]
[]
[]
[]
[null,{"$f":"cal!$X$1&\" \"&$T$16&\" \"&ROUND(cal!X34,1)&IF(UnitsNo=1,\" cm\",IF(UnitsNo=2,\" in\"))& \" \"&$T$17&\" \"&ROUND(cal!Z34,1)&IF(UnitsNo=1,\" cm\",IF(UnitsNo=2,\" in\"))&\" \"&$T$18&\" \"&ROUND(cal!AB34,1)&IF(UnitsNo=1,\" cm\",IF(UnitsNo=2,\" in\"))&\" (Type 3)\"","v":"Briza Net Zero S height 55,8 cm width 11 cm length 155 cm (Type 3)"}]
[]
[]
[]
[]
[]
[null,{"$f":"cal!$X$1&\" \"&$T$16&\" \"&ROUND(cal!X40,1)&IF(UnitsNo=1,\" cm\",IF(UnitsNo=2,\" in\"))& \" \"&$T$17&\" \"&ROUND(cal!Z40,1)&IF(UnitsNo=1,\" cm\",IF(UnitsNo=2,\" in\"))&\" \"&$T$18&\" \"&ROUND(cal!AB40,1)&IF(UnitsNo=1,\" cm\",IF(UnitsNo=2,\" in\"))&\" (Type 4)\"","v":"Briza Net Zero S height 55,8 cm width 11 cm length 190 cm (Type 4)"}]
[]
[]
[]
[]
[]
[null,"*Sound power according to ISO 3741:2010",null,null,null,null,null,null,null,null,null,null,null,{"$f":"cal!P46","v":"v2023-10-02"}]
[null,"**Sound pressure with an assumed room damping of 8dB(A)"]