{"text_format":"1","workbook":"xlsx","n_sheets":13,"sheets":["Freedom","cal","NL","EN","DE","FR","NR","SP","SW","TS","ExtraTaal1","ExtraTaal2","ExtraTaal3"],"not_rendered":{"charts":0,"images":5,"macros":1,"external_links":0,"defined_names":16,"comments":1,"pivot_tables":0},"unopened":[],"bounds":{"document_bytes":16777216,"sheet_cells":100000,"rows_first":2000,"rows_last":500,"rows_between":2000,"halvings":0,"cell_chars":16384,"cell_head_chars":4096},"cells_cut":0,"cells_raw":0,"read":"whole","date_system":"1900"}

{"sheet":"Freedom","index":0,"n_rows":73,"n_cols":16,"rows_kept":73,"cut":false,"hidden":false,"merged":[[64,1,64,15],[16,1,16,15],[22,1,22,15],[28,1,28,15],[34,1,34,15],[40,1,40,15],[3,12,3,13],[4,12,4,13],[46,1,46,15],[52,1,52,15],[58,1,58,15],[9,1,9,3],[9,6,9,9],[7,12,7,13],[8,12,8,13],[4,1,4,3],[0,12,0,16],[1,12,1,16],[2,12,2,16],[1,1,1,11],[11,1,11,3],[11,6,11,9],[9,12,9,13],[5,10,5,13],[4,6,4,9],[3,10,4,11],[10,1,10,3],[10,6,10,9],[10,12,13,13],[12,6,12,9],[3,6,3,9],[5,6,5,9]]}
[]
[null,"Selectiontool Freedom"]
[]
[null,null,null,null,null,null,"Taal/Language/Sprache",0,0,0,"English"]
[null,null,null,null,null,null,"Langue/Språk/Lengua/Jazyk"]
[null,null,null,null,null,null,{"$f":"IF(cal!$S$7=1,\"Uitvoering\",IF(cal!$S$7=2,\"Version\",IF(cal!$S$7=3,\"Ausfürhung\",IF(cal!$S$7=4,\"Version\",IF(cal!$S$7=5,\"Modell\",IF(cal!$S$7=6,\"Version\",IF(cal!$S$7=7,\"Modell\",IF(cal!$S$7=8,\"Verze\",IF(cal!$S$7=9,\"Version\",IF(cal!$S$7=10,\"Version\",IF(cal!$S$7=11,\"Version\",)))))))))))","v":"Version"},null,null,null,"Freedom"]
[]
[null,{"$f":"cal!B7","v":"Temperatures"},null,null,null,null,null,null,null,null,null,null,{"$f":"cal!M7","v":"Altitude"}]
[null,{"$f":"cal!B8","v":"Heating:"},null,null,null,null,{"$f":"cal!G8","v":"Cooling:"},null,null," ",null,null,0,0,{"$f":"cal!O8","v":"m"}]
[null,{"$f":"cal!B9","v":"Inlet temp."},{"$f":"cal!C9","v":0},{"$f":"cal!D9","v":0},75,null,{"$f":"cal!G9","v":"Inlet temp."},{"$f":"cal!H9","v":0},{"$f":"cal!I9","v":0},{"$f":"cal!J9","v":0},16,null,{"$f":"cal!M9","v":"Unit conversion"}]
[null,{"$f":"cal!B10","v":"Return temp."},{"$f":"cal!C10","v":0},{"$f":"cal!D10","v":0},65,null,{"$f":"cal!G10","v":"Return temp."},{"$f":"cal!H10","v":0},{"$f":"cal!I10","v":0},{"$f":"cal!J10","v":0},18]
[null,{"$f":"cal!B11","v":"Room temp."},{"$f":"cal!C11","v":0},{"$f":"cal!D11","v":0},20,null,{"$f":"cal!G11","v":"Room temp."},{"$f":"cal!H11","v":0},{"$f":"cal!I11","v":0},{"$f":"cal!J11","v":0},27]
[null,null,null,null,null,null,{"$f":"cal!G12","v":"Relative humidity"},null,null,null,0.5]
[]
[null,null,null,{"$f":"cal!D14","v":0},{"$f":"cal!E14","v":1},{"$f":"cal!F14","v":1},3.4121416331000001,{"$f":"cal!H14","v":1},{"$f":"cal!I14","v":1},{"$f":"cal!J14","v":1},{"$f":"cal!K14","v":0},{"$f":"cal!L14","v":0},{"$f":"cal!M14","v":0},{"$f":"cal!N14","v":1}]
[null,{"$f":"cal!B15","v":"Speed level:"},{"$f":"cal!C15","v":"Control voltage [V]"},{"$f":"cal!D15","v":"Heat output * 75/65/20 [W]"},{"$f":"cal!E15","v":"Water flowrate, heating [l/h]"},{"$f":"cal!F15","v":"Watersided pressure loss [kPa]"},{"$f":"cal!G15","v":"Sens. cooling capacity * 16/18/27 [W]"},{"$f":"cal!H15","v":"Tot. cooling capacity 16/18/27 [W]"},{"$f":"cal!I15","v":"Water flowrate, cooling [l/h]"},{"$f":"cal!J15","v":"Watersided pressure loss [kPa]"},{"$f":"cal!K15","v":"Sound pressure *** [dB(A)]"},{"$f":"cal!L15","v":"Sound power ** [dB(A)]"},{"$f":"cal!M15","v":"Electrical power [W]"},{"$f":"cal!N15","v":"Air flowrate [m³/h]"},{"$f":"cal!O15","v":"Air exhaust temp. heating [°C]"},{"$f":"cal!P15","v":"Air exhaust temp. cooling [°C]"}]
[null,{"$f":"cal!B16","v":"Freedom height 20 cm width 19 cm length 74 cm (Type 1)"}]
[null,{"$f":"cal!B17","v":0.2},{"$f":"cal!C17","v":2},{"$f":"IF($E$10<=$E$11,cal!$AC$3,cal!D17)","v":312.70800000000003},{"$f":"IF($E$10<=$E$11,\"\",cal!E17)","v":27},{"$f":"IF($E$10<=$E$11,\"\",cal!F17)","v":0.10451976775750199},{"$f":"IF($K$10>=$K$11,cal!$AC$3,cal!G17)","v":33.989999999999995},{"$f":"IF($K$10>=$K$11,\"\",cal!H17)","v":33.989999999999995},{"$f":"IF($K$10>=$K$11,\"\",cal!I17)","v":15},{"$f":"IF($K$10>=$K$11,\"\",cal!J17)","v":3.5785331495427598E-2},{"$f":"cal!K17","v":14},{"$f":"cal!L17","v":22},{"$f":"cal!M17","v":0.5},{"$f":"cal!N17","v":24}]
[null,{"$f":"cal!B18","v":0.4},{"$f":"cal!C18","v":4},{"$f":"IF($E$10<=$E$11,cal!$AC$4,cal!D18)","v":561.96799999999996},{"$f":"IF($E$10<=$E$11,\"\",cal!E18)","v":48},{"$f":"IF($E$10<=$E$11,\"\",cal!F18)","v":0.29843785011075069},{"$f":"IF($K$10>=$K$11,cal!$AC$5,cal!G18)","v":74.777999999999977},{"$f":"IF($K$10>=$K$11,\"\",cal!H18)","v":74.777999999999977},{"$f":"IF($K$10>=$K$11,\"\",cal!I18)","v":32},{"$f":"IF($K$10>=$K$11,\"\",cal!J18)","v":0.14247830750649948},{"$f":"cal!K18","v":15},{"$f":"cal!L18","v":23},{"$f":"cal!M18","v":0.8},{"$f":"cal!N18","v":37}]
[null,{"$f":"cal!B19","v":0.6},{"$f":"cal!C19","v":6},{"$f":"IF($E$10<=$E$11,\"\",cal!D19)","v":791.96699999999998},{"$f":"IF($E$10<=$E$11,\"\",cal!E19)","v":68},{"$f":"IF($E$10<=$E$11,\"\",cal!F19)","v":0.56323919121960386},{"$f":"IF($K$10>=$K$11,\"\",cal!G19)","v":117.83199999999997},{"$f":"IF($K$10>=$K$11,\"\",cal!H19)","v":117.83199999999997},{"$f":"IF($K$10>=$K$11,\"\",cal!I19)","v":51},{"$f":"IF($K$10>=$K$11,\"\",cal!J19)","v":0.33332288556727424},{"$f":"cal!K19","v":23},{"$f":"cal!L19","v":31},{"$f":"cal!M19","v":1.3},{"$f":"cal!N19","v":52}]
[null,{"$f":"cal!B20","v":0.8},{"$f":"cal!C20","v":8},{"$f":"IF($E$10<=$E$11,\"\",cal!D20)","v":1009.503},{"$f":"IF($E$10<=$E$11,\"\",cal!E20)","v":87},{"$f":"IF($E$10<=$E$11,\"\",cal!F20)","v":0.88273000450333838},{"$f":"IF($K$10>=$K$11,\"\",cal!G20)","v":163.15199999999993},{"$f":"IF($K$10>=$K$11,\"\",cal!H20)","v":163.15199999999993},{"$f":"IF($K$10>=$K$11,\"\",cal!I20)","v":70},{"$f":"IF($K$10>=$K$11,\"\",cal!J20)","v":0.59381250082624693},{"$f":"cal!K20","v":28},{"$f":"cal!L20","v":36},{"$f":"cal!M20","v":2.1},{"$f":"cal!N20","v":68}]
[null,{"$f":"cal!B21","v":1},{"$f":"cal!C21","v":10},{"$f":"IF($E$10<=$E$11,\"\",cal!D21)","v":1217.9749999999999},{"$f":"IF($E$10<=$E$11,\"\",cal!E21)","v":105},{"$f":"IF($E$10<=$E$11,\"\",cal!F21)","v":1.2438112805866202},{"$f":"IF($K$10>=$K$11,\"\",cal!G21)","v":209.60499999999993},{"$f":"IF($K$10>=$K$11,\"\",cal!H21)","v":209.60499999999993},{"$f":"IF($K$10>=$K$11,\"\",cal!I21)","v":90},{"$f":"IF($K$10>=$K$11,\"\",cal!J21)","v":0.93902245345157098},{"$f":"cal!K21","v":34},{"$f":"cal!L21","v":42},{"$f":"cal!M21","v":3},{"$f":"cal!N21","v":79}]
[null,{"$f":"cal!B22","v":"Freedom height 20 cm width 19 cm length 110 cm (Type 2)"}]
[null,{"$f":"cal!B23","v":0.2},{"$f":"cal!C23","v":2},{"$f":"IF($E$10<=$E$11,cal!$AC$3,cal!D23)","v":625.33100000000002},{"$f":"IF($E$10<=$E$11,\"\",cal!E23)","v":54},{"$f":"IF($E$10<=$E$11,\"\",cal!F23)","v":0.57982211611847723},{"$f":"IF($K$10>=$K$11,cal!$AC$3,cal!G23)","v":68.137999999999977},{"$f":"IF($K$10>=$K$11,\"\",cal!H23)","v":68.137999999999977},{"$f":"IF($K$10>=$K$11,\"\",cal!I23)","v":29},{"$f":"IF($K$10>=$K$11,\"\",cal!J23)","v":0.18661789951710783},{"$f":"cal!K23","v":15},{"$f":"cal!L23","v":23},{"$f":"cal!M23","v":0.6},{"$f":"cal!N23","v":42}]
[null,{"$f":"cal!B24","v":0.4},{"$f":"cal!C24","v":4},{"$f":"IF($E$10<=$E$11,cal!$AC$4,cal!D24)","v":1122.079},{"$f":"IF($E$10<=$E$11,\"\",cal!E24)","v":96},{"$f":"IF($E$10<=$E$11,\"\",cal!F24)","v":1.6555802743700996},{"$f":"IF($K$10>=$K$11,cal!$AC$5,cal!G24)","v":148.36499999999995},{"$f":"IF($K$10>=$K$11,\"\",cal!H24)","v":148.36499999999995},{"$f":"IF($K$10>=$K$11,\"\",cal!I24)","v":64},{"$f":"IF($K$10>=$K$11,\"\",cal!J24)","v":0.79039664488221262},{"$f":"cal!K24","v":19},{"$f":"cal!L24","v":27},{"$f":"cal!M24","v":1.3},{"$f":"cal!N24","v":75}]
[null,{"$f":"cal!B25","v":0.6},{"$f":"cal!C25","v":6},{"$f":"IF($E$10<=$E$11,\"\",cal!D25)","v":1580.3620000000001},{"$f":"IF($E$10<=$E$11,\"\",cal!E25)","v":136},{"$f":"IF($E$10<=$E$11,\"\",cal!F25)","v":3.1245624319746947},{"$f":"IF($K$10>=$K$11,\"\",cal!G25)","v":235.18599999999992},{"$f":"IF($K$10>=$K$11,\"\",cal!H25)","v":235.18599999999992},{"$f":"IF($K$10>=$K$11,\"\",cal!I25)","v":101},{"$f":"IF($K$10>=$K$11,\"\",cal!J25)","v":1.816180542521981},{"$f":"cal!K25","v":29},{"$f":"cal!L25","v":37},{"$f":"cal!M25","v":2.7},{"$f":"cal!N25","v":98}]
[null,{"$f":"cal!B26","v":0.8},{"$f":"cal!C26","v":8},{"$f":"IF($E$10<=$E$11,\"\",cal!D26)","v":2015.566},{"$f":"IF($E$10<=$E$11,\"\",cal!E26)","v":173},{"$f":"IF($E$10<=$E$11,\"\",cal!F26)","v":4.8457355024670399},{"$f":"IF($K$10>=$K$11,\"\",cal!G26)","v":325.30399999999986},{"$f":"IF($K$10>=$K$11,\"\",cal!H26)","v":325.30399999999986},{"$f":"IF($K$10>=$K$11,\"\",cal!I26)","v":140},{"$f":"IF($K$10>=$K$11,\"\",cal!J26)","v":3.2941674880631955},{"$f":"cal!K26","v":32},{"$f":"cal!L26","v":40},{"$f":"cal!M26","v":4.5999999999999996},{"$f":"cal!N26","v":125}]
[null,{"$f":"cal!B27","v":1},{"$f":"cal!C27","v":10},{"$f":"IF($E$10<=$E$11,\"\",cal!D27)","v":2433.1860000000001},{"$f":"IF($E$10<=$E$11,\"\",cal!E27)","v":209},{"$f":"IF($E$10<=$E$11,\"\",cal!F27)","v":6.8402294226660212},{"$f":"IF($K$10>=$K$11,\"\",cal!G27)","v":418.71899999999988},{"$f":"IF($K$10>=$K$11,\"\",cal!H27)","v":418.71899999999988},{"$f":"IF($K$10>=$K$11,\"\",cal!I27)","v":180},{"$f":"IF($K$10>=$K$11,\"\",cal!J27)","v":5.2092154213954833},{"$f":"cal!K27","v":37},{"$f":"cal!L27","v":45},{"$f":"cal!M27","v":7.1},{"$f":"cal!N27","v":160}]
[null,{"$f":"cal!B28","v":"Freedom height 20 cm width 19 cm length 145 cm (Type 3)"}]
[null,{"$f":"cal!B29","v":0.2},{"$f":"cal!C29","v":2},{"$f":"IF($E$10<=$E$11,cal!$AC$3,cal!D29)","v":939.59399999999994},{"$f":"IF($E$10<=$E$11,\"\",cal!E29)","v":81},{"$f":"IF($E$10<=$E$11,\"\",cal!F29)","v":1.6934195841714439},{"$f":"IF($K$10>=$K$11,cal!$AC$3,cal!G29)","v":101.94699999999996},{"$f":"IF($K$10>=$K$11,\"\",cal!H29)","v":101.94699999999996},{"$f":"IF($K$10>=$K$11,\"\",cal!I29)","v":44},{"$f":"IF($K$10>=$K$11,\"\",cal!J29)","v":0.55651127957010016},{"$f":"cal!K29","v":16},{"$f":"cal!L29","v":24},{"$f":"cal!M29","v":1.1000000000000001},{"$f":"cal!N29","v":66}]
[null,{"$f":"cal!B30","v":0.4},{"$f":"cal!C30","v":4},{"$f":"IF($E$10<=$E$11,cal!$AC$4,cal!D30)","v":1686.8549999999998},{"$f":"IF($E$10<=$E$11,\"\",cal!E30)","v":145},{"$f":"IF($E$10<=$E$11,\"\",cal!F30)","v":4.8966677742137579},{"$f":"IF($K$10>=$K$11,cal!$AC$5,cal!G30)","v":222.81199999999993},{"$f":"IF($K$10>=$K$11,\"\",cal!H30)","v":222.81199999999993},{"$f":"IF($K$10>=$K$11,\"\",cal!I30)","v":96},{"$f":"IF($K$10>=$K$11,\"\",cal!J30)","v":2.3084203249560846},{"$f":"cal!K30","v":20},{"$f":"cal!L30","v":28},{"$f":"cal!M30","v":2.1},{"$f":"cal!N30","v":112}]
[null,{"$f":"cal!B31","v":0.6},{"$f":"cal!C31","v":6},{"$f":"IF($E$10<=$E$11,\"\",cal!D31)","v":2375.2599999999998},{"$f":"IF($E$10<=$E$11,\"\",cal!E31)","v":204},{"$f":"IF($E$10<=$E$11,\"\",cal!F31)","v":9.1255491420253509},{"$f":"IF($K$10>=$K$11,\"\",cal!G31)","v":353.13599999999991},{"$f":"IF($K$10>=$K$11,\"\",cal!H31)","v":353.13599999999991},{"$f":"IF($K$10>=$K$11,\"\",cal!I31)","v":152},{"$f":"IF($K$10>=$K$11,\"\",cal!J31)","v":5.3362748341298465},{"$f":"cal!K31","v":30},{"$f":"cal!L31","v":38},{"$f":"cal!M31","v":4},{"$f":"cal!N31","v":150}]
[null,{"$f":"cal!B32","v":0.8},{"$f":"cal!C32","v":8},{"$f":"IF($E$10<=$E$11,\"\",cal!D32)","v":3027.9309999999996},{"$f":"IF($E$10<=$E$11,\"\",cal!E32)","v":260},{"$f":"IF($E$10<=$E$11,\"\",cal!F32)","v":14.202144910847871},{"$f":"IF($K$10>=$K$11,\"\",cal!G32)","v":488.7149999999998},{"$f":"IF($K$10>=$K$11,\"\",cal!H32)","v":488.7149999999998},{"$f":"IF($K$10>=$K$11,\"\",cal!I32)","v":210},{"$f":"IF($K$10>=$K$11,\"\",cal!J32)","v":9.6208950689407811},{"$f":"cal!K32","v":35},{"$f":"cal!L32","v":43},{"$f":"cal!M32","v":6.6},{"$f":"cal!N32","v":193}]
[null,{"$f":"cal!B33","v":1},{"$f":"cal!C33","v":10},{"$f":"IF($E$10<=$E$11,\"\",cal!D33)","v":3656.4289999999996},{"$f":"IF($E$10<=$E$11,\"\",cal!E33)","v":314},{"$f":"IF($E$10<=$E$11,\"\",cal!F33)","v":20.035608188600499},{"$f":"IF($K$10>=$K$11,\"\",cal!G33)","v":628.49799999999971},{"$f":"IF($K$10>=$K$11,\"\",cal!H33)","v":628.49799999999971},{"$f":"IF($K$10>=$K$11,\"\",cal!I33)","v":270},{"$f":"IF($K$10>=$K$11,\"\",cal!J33)","v":15.213954707026911},{"$f":"cal!K33","v":39},{"$f":"cal!L33","v":47},{"$f":"cal!M33","v":10.1},{"$f":"cal!N33","v":239}]
[null,{"$f":"cal!B34","v":"Freedom height 20 cm width 19 cm length 181 cm (Type 4)"}]
[null,{"$f":"cal!B35","v":0.2},{"$f":"cal!C35","v":2},{"$f":"IF($E$10<=$E$11,cal!$AC$3,cal!D35)","v":1253.1320000000001},{"$f":"IF($E$10<=$E$11,\"\",cal!E35)","v":108},{"$f":"IF($E$10<=$E$11,\"\",cal!F35)","v":3.7770275170313137},{"$f":"IF($K$10>=$K$11,cal!$AC$3,cal!G35)","v":135.69599999999997},{"$f":"IF($K$10>=$K$11,\"\",cal!H35)","v":135.69599999999997},{"$f":"IF($K$10>=$K$11,\"\",cal!I35)","v":58},{"$f":"IF($K$10>=$K$11,\"\",cal!J35)","v":1.215650321111023},{"$f":"cal!K35","v":18},{"$f":"cal!L35","v":26},{"$f":"cal!M35","v":1.2},{"$f":"cal!N35","v":84}]
[null,{"$f":"cal!B36","v":0.4},{"$f":"cal!C36","v":4},{"$f":"IF($E$10<=$E$11,cal!$AC$4,cal!D36)","v":2249.2640000000001},{"$f":"IF($E$10<=$E$11,\"\",cal!E36)","v":193},{"$f":"IF($E$10<=$E$11,\"\",cal!F36)","v":10.88728553624024},{"$f":"IF($K$10>=$K$11,cal!$AC$5,cal!G36)","v":298.11999999999995},{"$f":"IF($K$10>=$K$11,\"\",cal!H36)","v":298.11999999999995},{"$f":"IF($K$10>=$K$11,\"\",cal!I36)","v":128},{"$f":"IF($K$10>=$K$11,\"\",cal!J36)","v":5.1487340584285928},{"$f":"cal!K36","v":22},{"$f":"cal!L36","v":30},{"$f":"cal!M36","v":2.5},{"$f":"cal!N36","v":150}]
[null,{"$f":"cal!B37","v":0.6},{"$f":"cal!C37","v":6},{"$f":"IF($E$10<=$E$11,\"\",cal!D37)","v":3168.2960000000003},{"$f":"IF($E$10<=$E$11,\"\",cal!E37)","v":272},{"$f":"IF($E$10<=$E$11,\"\",cal!F37)","v":20.353756706029522},{"$f":"IF($K$10>=$K$11,\"\",cal!G37)","v":470.8239999999999},{"$f":"IF($K$10>=$K$11,\"\",cal!H37)","v":470.8239999999999},{"$f":"IF($K$10>=$K$11,\"\",cal!I37)","v":202},{"$f":"IF($K$10>=$K$11,\"\",cal!J37)","v":11.830807577544526},{"$f":"cal!K37","v":32},{"$f":"cal!L37","v":40},{"$f":"cal!M37","v":5.4},{"$f":"cal!N37","v":196}]
[null,{"$f":"cal!B38","v":0.8},{"$f":"cal!C38","v":8},{"$f":"IF($E$10<=$E$11,\"\",cal!D38)","v":4039.0120000000002},{"$f":"IF($E$10<=$E$11,\"\",cal!E38)","v":347},{"$f":"IF($E$10<=$E$11,\"\",cal!F38)","v":31.732232524165788},{"$f":"IF($K$10>=$K$11,\"\",cal!G38)","v":651.75199999999973},{"$f":"IF($K$10>=$K$11,\"\",cal!H38)","v":651.75199999999973},{"$f":"IF($K$10>=$K$11,\"\",cal!I38)","v":280},{"$f":"IF($K$10>=$K$11,\"\",cal!J38)","v":21.458583421095753},{"$f":"cal!K38","v":37},{"$f":"cal!L38","v":45},{"$f":"cal!M38","v":9.1},{"$f":"cal!N38","v":250}]
[null,{"$f":"cal!B39","v":1},{"$f":"cal!C39","v":10},{"$f":"IF($E$10<=$E$11,\"\",cal!D39)","v":4876.8320000000003},{"$f":"IF($E$10<=$E$11,\"\",cal!E39)","v":419},{"$f":"IF($E$10<=$E$11,\"\",cal!F39)","v":44.752610931641868},{"$f":"IF($K$10>=$K$11,\"\",cal!G39)","v":838.84799999999984},{"$f":"IF($K$10>=$K$11,\"\",cal!H39)","v":838.84799999999984},{"$f":"IF($K$10>=$K$11,\"\",cal!I39)","v":361},{"$f":"IF($K$10>=$K$11,\"\",cal!J39)","v":34.10550473288},{"$f":"cal!K39","v":41},{"$f":"cal!L39","v":49},{"$f":"cal!M39","v":14.1},{"$f":"cal!N39","v":320}]
[null,{"$f":"IF(cal!$X$16=1,\"\",IF(cal!$X$16=2,\"\",cal!B40))","v":""}]
[null,{"$f":"cal!B41","v":0.2},{"$f":"cal!C41","v":2},{"$f":"IF($E$10<=$E$11,cal!$AC$3,cal!D41)","v":0},{"$f":"IF($E$10<=$E$11,\"\",cal!E41)","v":0},{"$f":"IF($E$10<=$E$11,\"\",cal!F41)","v":{"$error":"#NUM!"}},{"$f":"IF($K$10>=$K$11,cal!$AC$3,cal!G41)","v":0},{"$f":"IF($K$10>=$K$11,\"\",cal!H41)","v":0},{"$f":"IF($K$10>=$K$11,\"\",cal!I41)","v":0},{"$f":"IF($K$10>=$K$11,\"\",cal!J41)","v":{"$error":"#NUM!"}},{"$f":"IF(cal!K41=-8,\"\",cal!K41)","v":""},{"$f":"IF(cal!L41=0,\"\",cal!L41)","v":""},{"$f":"IF(cal!M41=0,\"\",cal!M41)","v":""},{"$f":"IF(cal!N41=0,\"\",cal!N41)","v":""}]
[null,{"$f":"cal!B42","v":0.4},{"$f":"cal!C42","v":4},{"$f":"IF($E$10<=$E$11,cal!$AC$4,cal!D42)","v":0},{"$f":"IF($E$10<=$E$11,\"\",cal!E42)","v":0},{"$f":"IF($E$10<=$E$11,\"\",cal!F42)","v":{"$error":"#NUM!"}},{"$f":"IF($K$10>=$K$11,cal!$AC$5,cal!G42)","v":0},{"$f":"IF($K$10>=$K$11,\"\",cal!H42)","v":0},{"$f":"IF($K$10>=$K$11,\"\",cal!I42)","v":0},{"$f":"IF($K$10>=$K$11,\"\",cal!J42)","v":{"$error":"#NUM!"}},{"$f":"IF(cal!K42=-8,\"\",cal!K42)","v":""},{"$f":"IF(cal!L42=0,\"\",cal!L42)","v":""},{"$f":"IF(cal!M42=0,\"\",cal!M42)","v":""},{"$f":"IF(cal!N42=0,\"\",cal!N42)","v":""}]
[null,{"$f":"cal!B43","v":0.6},{"$f":"cal!C43","v":6},{"$f":"IF($E$10<=$E$11,\"\",cal!D43)","v":0},{"$f":"IF($E$10<=$E$11,\"\",cal!E43)","v":0},{"$f":"IF($E$10<=$E$11,\"\",cal!F43)","v":{"$error":"#NUM!"}},{"$f":"IF($K$10>=$K$11,\"\",cal!G43)","v":0},{"$f":"IF($K$10>=$K$11,\"\",cal!H43)","v":0},{"$f":"IF($K$10>=$K$11,\"\",cal!I43)","v":0},{"$f":"IF($K$10>=$K$11,\"\",cal!J43)","v":{"$error":"#NUM!"}},{"$f":"IF(cal!K43=-8,\"\",cal!K43)","v":""},{"$f":"IF(cal!L43=0,\"\",cal!L43)","v":""},{"$f":"IF(cal!M43=0,\"\",cal!M43)","v":""},{"$f":"IF(cal!N43=0,\"\",cal!N43)","v":""}]
[null,{"$f":"cal!B44","v":0.8},{"$f":"cal!C44","v":8},{"$f":"IF($E$10<=$E$11,\"\",cal!D44)","v":0},{"$f":"IF($E$10<=$E$11,\"\",cal!E44)","v":0},{"$f":"IF($E$10<=$E$11,\"\",cal!F44)","v":{"$error":"#NUM!"}},{"$f":"IF($K$10>=$K$11,\"\",cal!G44)","v":0},{"$f":"IF($K$10>=$K$11,\"\",cal!H44)","v":0},{"$f":"IF($K$10>=$K$11,\"\",cal!I44)","v":0},{"$f":"IF($K$10>=$K$11,\"\",cal!J44)","v":{"$error":"#NUM!"}},{"$f":"IF(cal!K44=-8,\"\",cal!K44)","v":""},{"$f":"IF(cal!L44=0,\"\",cal!L44)","v":""},{"$f":"IF(cal!M44=0,\"\",cal!M44)","v":""},{"$f":"IF(cal!N44=0,\"\",cal!N44)","v":""}]
[null,{"$f":"cal!B45","v":1},{"$f":"cal!C45","v":10},{"$f":"IF($E$10<=$E$11,\"\",cal!D45)","v":0},{"$f":"IF($E$10<=$E$11,\"\",cal!E45)","v":0},{"$f":"IF($E$10<=$E$11,\"\",cal!F45)","v":{"$error":"#NUM!"}},{"$f":"IF($K$10>=$K$11,\"\",cal!G45)","v":0},{"$f":"IF($K$10>=$K$11,\"\",cal!H45)","v":0},{"$f":"IF($K$10>=$K$11,\"\",cal!I45)","v":0},{"$f":"IF($K$10>=$K$11,\"\",cal!J45)","v":{"$error":"#NUM!"}},{"$f":"IF(cal!K45=-8,\"\",cal!K45)","v":""},{"$f":"IF(cal!L45=0,\"\",cal!L45)","v":""},{"$f":"IF(cal!M45=0,\"\",cal!M45)","v":""},{"$f":"IF(cal!N45=0,\"\",cal!N45)","v":""}]
[null,{"$f":"IF(cal!$X$16=1,\"\",IF(cal!$X$16=2,\"\",cal!B46))","v":""}]
[null,{"$f":"cal!B47","v":0.2},{"$f":"cal!C47","v":2},{"$f":"IF($E$10<=$E$11,cal!$AC$3,cal!D47)","v":0},{"$f":"IF($E$10<=$E$11,\"\",cal!E47)","v":0},{"$f":"IF($E$10<=$E$11,\"\",cal!F47)","v":{"$error":"#NUM!"}},{"$f":"IF($K$10>=$K$11,cal!$AC$3,cal!G47)","v":0},{"$f":"IF($K$10>=$K$11,\"\",cal!H47)","v":0},{"$f":"IF($K$10>=$K$11,\"\",cal!I47)","v":0},{"$f":"IF($K$10>=$K$11,\"\",cal!J47)","v":{"$error":"#NUM!"}},{"$f":"IF(cal!K47=-8,\"\",cal!K47)","v":""},{"$f":"IF(cal!L47=0,\"\",cal!L47)","v":""},{"$f":"IF(cal!M47=0,\"\",cal!M47)","v":""},{"$f":"IF(cal!N47=0,\"\",cal!N47)","v":""}]
[null,{"$f":"cal!B48","v":0.4},{"$f":"cal!C48","v":4},{"$f":"IF($E$10<=$E$11,cal!$AC$4,cal!D48)","v":0},{"$f":"IF($E$10<=$E$11,\"\",cal!E48)","v":0},{"$f":"IF($E$10<=$E$11,\"\",cal!F48)","v":{"$error":"#NUM!"}},{"$f":"IF($K$10>=$K$11,cal!$AC$5,cal!G48)","v":0},{"$f":"IF($K$10>=$K$11,\"\",cal!H48)","v":0},{"$f":"IF($K$10>=$K$11,\"\",cal!I48)","v":0},{"$f":"IF($K$10>=$K$11,\"\",cal!J48)","v":{"$error":"#NUM!"}},{"$f":"IF(cal!K48=-8,\"\",cal!K48)","v":""},{"$f":"IF(cal!L48=0,\"\",cal!L48)","v":""},{"$f":"IF(cal!M48=0,\"\",cal!M48)","v":""},{"$f":"IF(cal!N48=0,\"\",cal!N48)","v":""}]
[null,{"$f":"cal!B49","v":0.6},{"$f":"cal!C49","v":6},{"$f":"IF($E$10<=$E$11,\"\",cal!D49)","v":0},{"$f":"IF($E$10<=$E$11,\"\",cal!E49)","v":0},{"$f":"IF($E$10<=$E$11,\"\",cal!F49)","v":{"$error":"#NUM!"}},{"$f":"IF($K$10>=$K$11,\"\",cal!G49)","v":0},{"$f":"IF($K$10>=$K$11,\"\",cal!H49)","v":0},{"$f":"IF($K$10>=$K$11,\"\",cal!I49)","v":0},{"$f":"IF($K$10>=$K$11,\"\",cal!J49)","v":{"$error":"#NUM!"}},{"$f":"IF(cal!K49=-8,\"\",cal!K49)","v":""},{"$f":"IF(cal!L49=0,\"\",cal!L49)","v":""},{"$f":"IF(cal!M49=0,\"\",cal!M49)","v":""},{"$f":"IF(cal!N49=0,\"\",cal!N49)","v":""}]
[null,{"$f":"cal!B50","v":0.8},{"$f":"cal!C50","v":8},{"$f":"IF($E$10<=$E$11,\"\",cal!D50)","v":0},{"$f":"IF($E$10<=$E$11,\"\",cal!E50)","v":0},{"$f":"IF($E$10<=$E$11,\"\",cal!F50)","v":{"$error":"#NUM!"}},{"$f":"IF($K$10>=$K$11,\"\",cal!G50)","v":0},{"$f":"IF($K$10>=$K$11,\"\",cal!H50)","v":0},{"$f":"IF($K$10>=$K$11,\"\",cal!I50)","v":0},{"$f":"IF($K$10>=$K$11,\"\",cal!J50)","v":{"$error":"#NUM!"}},{"$f":"IF(cal!K50=-8,\"\",cal!K50)","v":""},{"$f":"IF(cal!L50=0,\"\",cal!L50)","v":""},{"$f":"IF(cal!M50=0,\"\",cal!M50)","v":""},{"$f":"IF(cal!N50=0,\"\",cal!N50)","v":""}]
[null,{"$f":"cal!B51","v":1},{"$f":"cal!C51","v":10},{"$f":"IF($E$10<=$E$11,\"\",cal!D51)","v":0},{"$f":"IF($E$10<=$E$11,\"\",cal!E51)","v":0},{"$f":"IF($E$10<=$E$11,\"\",cal!F51)","v":{"$error":"#NUM!"}},{"$f":"IF($K$10>=$K$11,\"\",cal!G51)","v":0},{"$f":"IF($K$10>=$K$11,\"\",cal!H51)","v":0},{"$f":"IF($K$10>=$K$11,\"\",cal!I51)","v":0},{"$f":"IF($K$10>=$K$11,\"\",cal!J51)","v":{"$error":"#NUM!"}},{"$f":"IF(cal!K51=-8,\"\",cal!K51)","v":""},{"$f":"IF(cal!L51=0,\"\",cal!L51)","v":""},{"$f":"IF(cal!M51=0,\"\",cal!M51)","v":""},{"$f":"IF(cal!N51=0,\"\",cal!N51)","v":""}]
[null,{"$f":"IF(cal!$X$16=1,\"\",IF(cal!$X$16=2,\"\",cal!B52))","v":""}]
[null,{"$f":"cal!B53","v":0.2},{"$f":"cal!C53","v":2},{"$f":"IF($E$10<=$E$11,cal!$AC$3,cal!D53)","v":0},{"$f":"IF($E$10<=$E$11,\"\",cal!E53)","v":0},{"$f":"IF($E$10<=$E$11,\"\",cal!F53)","v":{"$error":"#NUM!"}},{"$f":"IF($K$10>=$K$11,cal!$AC$3,cal!G53)","v":0},{"$f":"IF($K$10>=$K$11,\"\",cal!H53)","v":0},{"$f":"IF($K$10>=$K$11,\"\",cal!I53)","v":0},{"$f":"IF($K$10>=$K$11,\"\",cal!J53)","v":{"$error":"#NUM!"}},{"$f":"IF(cal!K53=-8,\"\",cal!K53)","v":""},{"$f":"IF(cal!L53=0,\"\",cal!L53)","v":""},{"$f":"IF(cal!M53=0,\"\",cal!M53)","v":""},{"$f":"IF(cal!N53=0,\"\",cal!N53)","v":""}]
[null,{"$f":"cal!B54","v":0.4},{"$f":"cal!C54","v":4},{"$f":"IF($E$10<=$E$11,cal!$AC$4,cal!D54)","v":0},{"$f":"IF($E$10<=$E$11,\"\",cal!E54)","v":0},{"$f":"IF($E$10<=$E$11,\"\",cal!F54)","v":{"$error":"#NUM!"}},{"$f":"IF($K$10>=$K$11,cal!$AC$5,cal!G54)","v":0},{"$f":"IF($K$10>=$K$11,\"\",cal!H54)","v":0},{"$f":"IF($K$10>=$K$11,\"\",cal!I54)","v":0},{"$f":"IF($K$10>=$K$11,\"\",cal!J54)","v":{"$error":"#NUM!"}},{"$f":"IF(cal!K54=-8,\"\",cal!K54)","v":""},{"$f":"IF(cal!L54=0,\"\",cal!L54)","v":""},{"$f":"IF(cal!M54=0,\"\",cal!M54)","v":""},{"$f":"IF(cal!N54=0,\"\",cal!N54)","v":""}]
[null,{"$f":"cal!B55","v":0.6},{"$f":"cal!C55","v":6},{"$f":"IF($E$10<=$E$11,\"\",cal!D55)","v":0},{"$f":"IF($E$10<=$E$11,\"\",cal!E55)","v":0},{"$f":"IF($E$10<=$E$11,\"\",cal!F55)","v":{"$error":"#NUM!"}},{"$f":"IF($K$10>=$K$11,\"\",cal!G55)","v":0},{"$f":"IF($K$10>=$K$11,\"\",cal!H55)","v":0},{"$f":"IF($K$10>=$K$11,\"\",cal!I55)","v":0},{"$f":"IF($K$10>=$K$11,\"\",cal!J55)","v":{"$error":"#NUM!"}},{"$f":"IF(cal!K55=-8,\"\",cal!K55)","v":""},{"$f":"IF(cal!L55=0,\"\",cal!L55)","v":""},{"$f":"IF(cal!M55=0,\"\",cal!M55)","v":""},{"$f":"IF(cal!N55=0,\"\",cal!N55)","v":""}]
[null,{"$f":"cal!B56","v":0.8},{"$f":"cal!C56","v":8},{"$f":"IF($E$10<=$E$11,\"\",cal!D56)","v":0},{"$f":"IF($E$10<=$E$11,\"\",cal!E56)","v":0},{"$f":"IF($E$10<=$E$11,\"\",cal!F56)","v":{"$error":"#NUM!"}},{"$f":"IF($K$10>=$K$11,\"\",cal!G56)","v":0},{"$f":"IF($K$10>=$K$11,\"\",cal!H56)","v":0},{"$f":"IF($K$10>=$K$11,\"\",cal!I56)","v":0},{"$f":"IF($K$10>=$K$11,\"\",cal!J56)","v":{"$error":"#NUM!"}},{"$f":"IF(cal!K56=-8,\"\",cal!K56)","v":""},{"$f":"IF(cal!L56=0,\"\",cal!L56)","v":""},{"$f":"IF(cal!M56=0,\"\",cal!M56)","v":""},{"$f":"IF(cal!N56=0,\"\",cal!N56)","v":""}]
[null,{"$f":"cal!B57","v":1},{"$f":"cal!C57","v":10},{"$f":"IF($E$10<=$E$11,\"\",cal!D57)","v":0},{"$f":"IF($E$10<=$E$11,\"\",cal!E57)","v":0},{"$f":"IF($E$10<=$E$11,\"\",cal!F57)","v":{"$error":"#NUM!"}},{"$f":"IF($K$10>=$K$11,\"\",cal!G57)","v":0},{"$f":"IF($K$10>=$K$11,\"\",cal!H57)","v":0},{"$f":"IF($K$10>=$K$11,\"\",cal!I57)","v":0},{"$f":"IF($K$10>=$K$11,\"\",cal!J57)","v":{"$error":"#NUM!"}},{"$f":"IF(cal!K57=-8,\"\",cal!K57)","v":""},{"$f":"IF(cal!L57=0,\"\",cal!L57)","v":""},{"$f":"IF(cal!M57=0,\"\",cal!M57)","v":""},{"$f":"IF(cal!N57=0,\"\",cal!N57)","v":""}]
[null,{"$f":"IF(cal!$X$16=1,\"\",IF(cal!$X$16=2,\"\",cal!B58))","v":""}]
[null,{"$f":"cal!B59","v":0.2},{"$f":"cal!C59","v":2},{"$f":"IF($E$10<=$E$11,cal!$AC$3,cal!D59)","v":0},{"$f":"IF($E$10<=$E$11,\"\",cal!E59)","v":0},{"$f":"IF($E$10<=$E$11,\"\",cal!F59)","v":{"$error":"#NUM!"}},{"$f":"IF($K$10>=$K$11,cal!$AC$3,cal!G59)","v":0},{"$f":"IF($K$10>=$K$11,\"\",cal!H59)","v":0},{"$f":"IF($K$10>=$K$11,\"\",cal!I59)","v":0},{"$f":"IF($K$10>=$K$11,\"\",cal!J59)","v":{"$error":"#NUM!"}},{"$f":"IF(cal!K59=-8,\"\",cal!K59)","v":""},{"$f":"IF(cal!L59=0,\"\",cal!L59)","v":""},{"$f":"IF(cal!M59=0,\"\",cal!M59)","v":""},{"$f":"IF(cal!N59=0,\"\",cal!N59)","v":""}]
[null,{"$f":"cal!B60","v":0.4},{"$f":"cal!C60","v":4},{"$f":"IF($E$10<=$E$11,cal!$AC$4,cal!D60)","v":0},{"$f":"IF($E$10<=$E$11,\"\",cal!E60)","v":0},{"$f":"IF($E$10<=$E$11,\"\",cal!F60)","v":{"$error":"#NUM!"}},{"$f":"IF($K$10>=$K$11,cal!$AC$5,cal!G60)","v":0},{"$f":"IF($K$10>=$K$11,\"\",cal!H60)","v":0},{"$f":"IF($K$10>=$K$11,\"\",cal!I60)","v":0},{"$f":"IF($K$10>=$K$11,\"\",cal!J60)","v":{"$error":"#NUM!"}},{"$f":"IF(cal!K60=-8,\"\",cal!K60)","v":""},{"$f":"IF(cal!L60=0,\"\",cal!L60)","v":""},{"$f":"IF(cal!M60=0,\"\",cal!M60)","v":""},{"$f":"IF(cal!N60=0,\"\",cal!N60)","v":""}]
[null,{"$f":"cal!B61","v":0.6},{"$f":"cal!C61","v":6},{"$f":"IF($E$10<=$E$11,\"\",cal!D61)","v":0},{"$f":"IF($E$10<=$E$11,\"\",cal!E61)","v":0},{"$f":"IF($E$10<=$E$11,\"\",cal!F61)","v":{"$error":"#NUM!"}},{"$f":"IF($K$10>=$K$11,\"\",cal!G61)","v":0},{"$f":"IF($K$10>=$K$11,\"\",cal!H61)","v":0},{"$f":"IF($K$10>=$K$11,\"\",cal!I61)","v":0},{"$f":"IF($K$10>=$K$11,\"\",cal!J61)","v":{"$error":"#NUM!"}},{"$f":"IF(cal!K61=-8,\"\",cal!K61)","v":""},{"$f":"IF(cal!L61=0,\"\",cal!L61)","v":""},{"$f":"IF(cal!M61=0,\"\",cal!M61)","v":""},{"$f":"IF(cal!N61=0,\"\",cal!N61)","v":""}]
[null,{"$f":"cal!B62","v":0.8},{"$f":"cal!C62","v":8},{"$f":"IF($E$10<=$E$11,\"\",cal!D62)","v":0},{"$f":"IF($E$10<=$E$11,\"\",cal!E62)","v":0},{"$f":"IF($E$10<=$E$11,\"\",cal!F62)","v":{"$error":"#NUM!"}},{"$f":"IF($K$10>=$K$11,\"\",cal!G62)","v":0},{"$f":"IF($K$10>=$K$11,\"\",cal!H62)","v":0},{"$f":"IF($K$10>=$K$11,\"\",cal!I62)","v":0},{"$f":"IF($K$10>=$K$11,\"\",cal!J62)","v":{"$error":"#NUM!"}},{"$f":"IF(cal!K62=-8,\"\",cal!K62)","v":""},{"$f":"IF(cal!L62=0,\"\",cal!L62)","v":""},{"$f":"IF(cal!M62=0,\"\",cal!M62)","v":""},{"$f":"IF(cal!N62=0,\"\",cal!N62)","v":""}]
[null,{"$f":"cal!B63","v":1},{"$f":"cal!C63","v":10},{"$f":"IF($E$10<=$E$11,\"\",cal!D63)","v":0},{"$f":"IF($E$10<=$E$11,\"\",cal!E63)","v":0},{"$f":"IF($E$10<=$E$11,\"\",cal!F63)","v":{"$error":"#NUM!"}},{"$f":"IF($K$10>=$K$11,\"\",cal!G63)","v":0},{"$f":"IF($K$10>=$K$11,\"\",cal!H63)","v":0},{"$f":"IF($K$10>=$K$11,\"\",cal!I63)","v":0},{"$f":"IF($K$10>=$K$11,\"\",cal!J63)","v":{"$error":"#NUM!"}},{"$f":"IF(cal!K63=-8,\"\",cal!K63)","v":""},{"$f":"IF(cal!L63=0,\"\",cal!L63)","v":""},{"$f":"IF(cal!M63=0,\"\",cal!M63)","v":""},{"$f":"IF(cal!N63=0,\"\",cal!N63)","v":""}]
[null,{"$f":"IF(cal!$X$16=1,\"\",IF(cal!$X$16=2,\"\",cal!B64))","v":""}]
[null,{"$f":"cal!B65","v":0.2},{"$f":"cal!C65","v":2},{"$f":"IF($E$10<=$E$11,cal!$AC$3,cal!D65)","v":0},{"$f":"IF($E$10<=$E$11,\"\",cal!E65)","v":0},{"$f":"IF($E$10<=$E$11,\"\",cal!F65)","v":{"$error":"#NUM!"}},{"$f":"IF($K$10>=$K$11,cal!$AC$3,cal!G65)","v":0},{"$f":"IF($K$10>=$K$11,\"\",cal!H65)","v":0},{"$f":"IF($K$10>=$K$11,\"\",cal!I65)","v":0},{"$f":"IF($K$10>=$K$11,\"\",cal!J65)","v":{"$error":"#NUM!"}},{"$f":"IF(cal!K65=-8,\"\",cal!K65)","v":""},{"$f":"IF(cal!L65=0,\"\",cal!L65)","v":""},{"$f":"IF(cal!M65=0,\"\",cal!M65)","v":""},{"$f":"IF(cal!N65=0,\"\",cal!N65)","v":""}]
[null,{"$f":"cal!B66","v":0.4},{"$f":"cal!C66","v":4},{"$f":"IF($E$10<=$E$11,cal!$AC$4,cal!D66)","v":0},{"$f":"IF($E$10<=$E$11,\"\",cal!E66)","v":0},{"$f":"IF($E$10<=$E$11,\"\",cal!F66)","v":{"$error":"#NUM!"}},{"$f":"IF($K$10>=$K$11,cal!$AC$5,cal!G66)","v":0},{"$f":"IF($K$10>=$K$11,\"\",cal!H66)","v":0},{"$f":"IF($K$10>=$K$11,\"\",cal!I66)","v":0},{"$f":"IF($K$10>=$K$11,\"\",cal!J66)","v":{"$error":"#NUM!"}},{"$f":"IF(cal!K66=-8,\"\",cal!K66)","v":""},{"$f":"IF(cal!L66=0,\"\",cal!L66)","v":""},{"$f":"IF(cal!M66=0,\"\",cal!M66)","v":""},{"$f":"IF(cal!N66=0,\"\",cal!N66)","v":""}]
[null,{"$f":"cal!B67","v":0.6},{"$f":"cal!C67","v":6},{"$f":"IF($E$10<=$E$11,\"\",cal!D67)","v":0},{"$f":"IF($E$10<=$E$11,\"\",cal!E67)","v":0},{"$f":"IF($E$10<=$E$11,\"\",cal!F67)","v":{"$error":"#NUM!"}},{"$f":"IF($K$10>=$K$11,\"\",cal!G67)","v":0},{"$f":"IF($K$10>=$K$11,\"\",cal!H67)","v":0},{"$f":"IF($K$10>=$K$11,\"\",cal!I67)","v":0},{"$f":"IF($K$10>=$K$11,\"\",cal!J67)","v":{"$error":"#NUM!"}},{"$f":"IF(cal!K67=-8,\"\",cal!K67)","v":""},{"$f":"IF(cal!L67=0,\"\",cal!L67)","v":""},{"$f":"IF(cal!M67=0,\"\",cal!M67)","v":""},{"$f":"IF(cal!N67=0,\"\",cal!N67)","v":""}]
[null,{"$f":"cal!B68","v":0.8},{"$f":"cal!C68","v":8},{"$f":"IF($E$10<=$E$11,\"\",cal!D68)","v":0},{"$f":"IF($E$10<=$E$11,\"\",cal!E68)","v":0},{"$f":"IF($E$10<=$E$11,\"\",cal!F68)","v":{"$error":"#NUM!"}},{"$f":"IF($K$10>=$K$11,\"\",cal!G68)","v":0},{"$f":"IF($K$10>=$K$11,\"\",cal!H68)","v":0},{"$f":"IF($K$10>=$K$11,\"\",cal!I68)","v":0},{"$f":"IF($K$10>=$K$11,\"\",cal!J68)","v":{"$error":"#NUM!"}},{"$f":"IF(cal!K68=-8,\"\",cal!K68)","v":""},{"$f":"IF(cal!L68=0,\"\",cal!L68)","v":""},{"$f":"IF(cal!M68=0,\"\",cal!M68)","v":""},{"$f":"IF(cal!N68=0,\"\",cal!N68)","v":""}]
[null,{"$f":"cal!B69","v":1},{"$f":"cal!C69","v":10},{"$f":"IF($E$10<=$E$11,\"\",cal!D69)","v":0},{"$f":"IF($E$10<=$E$11,\"\",cal!E69)","v":0},{"$f":"IF($E$10<=$E$11,\"\",cal!F69)","v":{"$error":"#NUM!"}},{"$f":"IF($K$10>=$K$11,\"\",cal!G69)","v":0},{"$f":"IF($K$10>=$K$11,\"\",cal!H69)","v":0},{"$f":"IF($K$10>=$K$11,\"\",cal!I69)","v":0},{"$f":"IF($K$10>=$K$11,\"\",cal!J69)","v":{"$error":"#NUM!"}},{"$f":"IF(cal!K69=-8,\"\",cal!K69)","v":""},{"$f":"IF(cal!L69=0,\"\",cal!L69)","v":""},{"$f":"IF(cal!M69=0,\"\",cal!M69)","v":""},{"$f":"IF(cal!N69=0,\"\",cal!N69)","v":""}]
[null,{"$f":"cal!B70","v":"*Values according to EN 16430"},null,null,null,null,null,null,null,null,null,null,null,null,null,"v2022-08-26"]
[null,{"$f":"cal!B71","v":"**Sound power according to ISO 3741:2010"}]
[null,{"$f":"cal!B72","v":"***Sound pressure with an assumed room damping of 8dB(A)"}]

{"sheet":"cal","index":1,"n_rows":72,"n_cols":85,"rows_kept":72,"cut":false,"hidden":true,"merged":[[63,1,63,15],[57,1,57,15],[51,1,51,15],[45,1,45,15],[39,1,39,15],[6,12,6,13],[7,12,7,13],[15,71,15,77],[15,78,15,84],[15,56,15,62],[15,63,15,69],[15,38,15,44],[15,49,15,55],[6,14,6,15],[7,14,7,15],[15,30,15,36],[15,23,15,29],[33,1,33,15],[27,1,27,15],[21,1,21,15],[15,1,15,15],[8,12,8,13],[8,1,8,3],[8,6,8,9],[9,1,9,3],[9,6,9,9],[10,1,10,3],[10,6,10,9]]}
[null,null,null,null,null,null,"Nederlands","English","Deutsch","Français","Norsk","Español","Svenska","Čeština","ExtraTaal1","ExtraTaal2","ExtraTaal3",null,null,null,{"$f":"IF($S$7=1,NL!Q7,IF($S$7=2,EN!Q7,IF($S$7=3,DE!Q7,IF($S$7=4,FR!Q7,IF($S$7=5,NR!Q7,IF($S$7=6,SP!Q7,IF($S$7=7,SW!Q7,IF($S$7=8,TS!Q7,IF($S$7=9,ExtraTaal1!Q7,IF($S$7=10,ExtraTaal2!Q7,IF($S$7=11,ExtraTaal3!Q7,)))))))))))","v":"Copy all data"},null,null,null,null,"Freedom"]
[null,null,null,null,null,null,null,null,null,null,null,null,null,null,null,null,null,null,null,null,{"$f":"IF($S$7=1,NL!Q8,IF($S$7=2,EN!Q8,IF($S$7=3,DE!Q8,IF($S$7=4,FR!Q8,IF($S$7=5,NR!Q8,IF($S$7=6,SP!Q8,IF($S$7=7,SW!Q8,IF($S$7=8,TS!Q8,IF($S$7=9,ExtraTaal1!Q8,IF($S$7=10,ExtraTaal2!Q8,IF($S$7=11,ExtraTaal3!Q8,)))))))))))","v":"SI-units"},null,null,null,"Freedom",{"$f":"AE16","v":"Freedom"}]
[null,{"$f":"IF($S$7=1,NL!A2,IF(cal!$S$7=2,EN!A2,IF(cal!$S$7=3,DE!A2,IF(cal!$S$7=4,FR!A2,))))","v":"Formulary"},null,null,null,null,null,null,null,null,null,null,null,null,null,null,null,null,null,null,{"$f":"IF($S$7=1,NL!Q9,IF($S$7=2,EN!Q9,IF($S$7=3,DE!Q9,IF($S$7=4,FR!Q9,IF($S$7=5,NR!Q9,IF($S$7=6,SP!Q9,IF($S$7=7,SW!Q9,IF($S$7=8,TS!Q9,IF($S$7=9,ExtraTaal1!Q9,IF($S$7=10,ExtraTaal2!Q9,IF($S$7=11,ExtraTaal3!Q9,)))))))))))","v":"Imperial-units"},null,null,null,"Clima H10 B18",{"$f":"AM16","v":0},null,null,{"$f":"IF($S$7=1,NL!Q15,IF(cal!$S$7=2,EN!Q15,IF(cal!$S$7=3,DE!Q15,IF(cal!$S$7=4,FR!Q15,IF(cal!$S$7=5,NR!Q15,IF(cal!$S$7=6,SP!Q15,))))))","v":"Temp."}]
[null,null,null,null,null,null,null,null,null,null,null,null,null,null,null,null,null,null,null,null,null,null,null,1,"Clima H13 B27 4P",{"$f":"AX16","v":0},null,null,{"$f":"IF($S$7=1,NL!Q16,IF(cal!$S$7=2,EN!Q16,IF(cal!$S$7=3,DE!Q16,IF(cal!$S$7=4,FR!Q16,IF(cal!$S$7=5,NR!Q16,IF(cal!$S$7=6,SP!Q16,))))))","v":"heating!"}]
[null,{"$f":"IF($S$7=1,NL!A4,IF(cal!$S$7=2,EN!A4,IF(cal!$S$7=3,DE!A4,IF(cal!$S$7=4,FR!A4,))))","v":"Conditions"},null,null,null,null,null,null,null,null,null,null,null,null,null,null,null,null,null,null,null,null,null,null,"Clima H13 B32 2P",{"$f":"BL16","v":0},null,null,{"$f":"IF($S$7=1,NL!Q17,IF(cal!$S$7=2,EN!Q17,IF(cal!$S$7=3,DE!Q17,IF(cal!$S$7=4,FR!Q17,IF(cal!$S$7=5,NR!Q17,IF(cal!$S$7=6,SP!Q17,))))))","v":"cooling!"}]
[null,null,null,null,null,null,null,null,null,null,null,null,null,null,null,null,null,null,null,null,null,null,null,null,"Clima H13 B32 4P",{"$f":"BE16","v":0}]
[null,{"$f":"IF($S$7=1,NL!A6,IF(cal!$S$7=2,EN!A6,IF(cal!$S$7=3,DE!A6,IF(cal!$S$7=4,FR!A6,IF(cal!$S$7=5,NR!A6,IF(cal!$S$7=6,SP!A6,IF(cal!$S$7=7,SW!A6,IF(cal!$S$7=8,TS!A6,IF(cal!$S$7=9,ExtraTaal1!A6,IF(cal!$S$7=10,ExtraTaal2!A6,IF(cal!$S$7=11,ExtraTaal3!A6,)))))))))))","v":"Temperatures"},null,null,null,null,null,null,null,null,null,null,{"$f":"IF($S$7=1,NL!L6,IF(cal!$S$7=2,EN!L6,IF(cal!$S$7=3,DE!L6,IF(cal!$S$7=4,FR!L6,IF(cal!$S$7=5,NR!L6,IF(cal!$S$7=6,SP!L6,IF(cal!$S$7=7,SW!L6,IF(cal!$S$7=8,TS!L6,IF(cal!$S$7=9,ExtraTaal1!L6,IF(cal!$S$7=10,ExtraTaal2!L6,IF(cal!$S$7=11,ExtraTaal3!L6,)))))))))))","v":"Altitude"},{"$f":"IF($S$7=1,NL!M6,IF(cal!$S$7=2,EN!M6,IF(cal!$S$7=3,DE!M6,IF(cal!$S$7=4,FR!M6,IF(cal!$S$7=5,NR!M6,IF(cal!$S$7=6,SP!M6,IF(cal!$S$7=7,SW!M6,IF(cal!$S$7=8,TS!M6,IF(cal!$S$7=9,ExtraTaal1!M6,IF(cal!$S$7=10,ExtraTaal2!M6,IF(cal!$S$7=11,ExtraTaal3!M6,)))))))))))","v":0},null,null,null,null,{"$f":"IF(Freedom!$K$4=cal!G1,1,IF(Freedom!$K$4=cal!H1,2,IF(Freedom!$K$4=cal!I1,3,IF(Freedom!$K$4=cal!J1,4,IF(Freedom!$K$4=cal!K1,5,IF(Freedom!$K$4=cal!L1,6,IF(Freedom!$K$4=cal!M1,7,IF(Freedom!$K$4=cal!N1,8,IF(Freedom!$K$4=cal!O1,9,IF(Freedom!$K$4=cal!P1,10,IF(Freedom!$K$4=cal!Q1,11,)))))))))))","v":2},null,null,null,null,null,"Clima H19 B34 2P",{"$f":"CA16","v":0}]
[null,{"$f":"IF($S$7=1,NL!A7,IF(cal!$S$7=2,EN!A7,IF(cal!$S$7=3,DE!A7,IF(cal!$S$7=4,FR!A7,IF(cal!$S$7=5,NR!A7,IF(cal!$S$7=6,SP!A7,IF(cal!$S$7=7,SW!A7,IF(cal!$S$7=8,TS!A7,IF(cal!$S$7=9,ExtraTaal1!A7,IF(cal!$S$7=10,ExtraTaal2!A7,IF(cal!$S$7=11,ExtraTaal3!A7,)))))))))))","v":"Heating:"},null,null,null,null,{"$f":"IF($S$7=1,NL!F7,IF(cal!$S$7=2,EN!F7,IF(cal!$S$7=3,DE!F7,IF(cal!$S$7=4,FR!F7,IF(cal!$S$7=5,NR!F7,IF(cal!$S$7=6,SP!F7,IF(cal!$S$7=7,SW!F7,IF(cal!$S$7=8,TS!F7,IF(cal!$S$7=9,ExtraTaal1!F7,IF(cal!$S$7=10,ExtraTaal2!F7,IF(cal!$S$7=11,ExtraTaal3!F7,)))))))))))","v":"Cooling:"},null,null,null,null,null,{"$f":"Freedom!M9:N9","v":0},0,{"$f":"IF($X$4=1,\"m\",IF($X$4=2,\"ft\"))","v":"m"},null,null,null,"Temp",null,null,null,null,"Temp","Clima H19 B34 4P",{"$f":"BT16","v":0}]
[null,{"$f":"IF($S$7=1,NL!A8,IF(cal!$S$7=2,EN!A8,IF(cal!$S$7=3,DE!A8,IF(cal!$S$7=4,FR!A8,IF(cal!$S$7=5,NR!A8,IF(cal!$S$7=6,SP!A8,IF(cal!$S$7=7,SW!A8,IF(cal!$S$7=8,TS!A8,IF(cal!$S$7=9,ExtraTaal1!A8,IF(cal!$S$7=10,ExtraTaal2!A8,IF(cal!$S$7=11,ExtraTaal3!A8,)))))))))))","v":"Inlet temp."},{"$f":"IF($S$7=1,NL!B8,IF(cal!$S$7=2,EN!B8,IF(cal!$S$7=3,DE!B8,IF(cal!$S$7=4,FR!B8,IF(cal!$S$7=5,NR!B8,IF(cal!$S$7=6,SP!B8,IF(cal!$S$7=7,SW!B8,IF(cal!$S$7=8,TS!B8,IF(cal!$S$7=9,ExtraTaal1!B8,IF(cal!$S$7=10,ExtraTaal2!B8,IF(cal!$S$7=11,ExtraTaal3!B8,)))))))))))","v":0},{"$f":"IF($S$7=1,NL!C8,IF(cal!$S$7=2,EN!C8,IF(cal!$S$7=3,DE!C8,IF(cal!$S$7=4,FR!C8,IF(cal!$S$7=5,NR!C8,IF(cal!$S$7=6,SP!C8,IF(cal!$S$7=7,SW!C8,IF(cal!$S$7=8,TS!C8,IF(cal!$S$7=9,ExtraTaal1!C8,IF(cal!$S$7=10,ExtraTaal2!C8,IF(cal!$S$7=11,ExtraTaal3!C8,)))))))))))","v":0},{"$f":"Freedom!E10","v":75},null,{"$f":"B9","v":"Inlet temp."},{"$f":"IF($S$7=1,NL!G8,IF(cal!$S$7=2,EN!G8,IF(cal!$S$7=3,DE!G8,IF(cal!$S$7=4,FR!G8,))))","v":0},{"$f":"IF($S$7=1,NL!H8,IF(cal!$S$7=2,EN!H8,IF(cal!$S$7=3,DE!H8,IF(cal!$S$7=4,FR!H8,))))","v":0},{"$f":"IF($S$7=1,NL!I8,IF(cal!$S$7=2,EN!I8,IF(cal!$S$7=3,DE!I8,IF(cal!$S$7=4,FR!I8,))))","v":0},{"$f":"Freedom!K10","v":16},null,{"$f":"IF($S$7=1,NL!L8,IF(cal!$S$7=2,EN!L8,IF(cal!$S$7=3,DE!L8,IF(cal!$S$7=4,FR!L8,IF(cal!$S$7=5,NR!L8,IF(cal!$S$7=6,SP!L8,IF(cal!$S$7=7,SW!L8,IF(cal!$S$7=8,TS!L8,IF(cal!$S$7=9,ExtraTaal1!L8,IF(cal!$S$7=10,ExtraTaal2!L8,IF(cal!$S$7=11,ExtraTaal3!L8,)))))))))))","v":"Unit conversion"},{"$f":"IF($S$7=1,NL!M8,IF(cal!$S$7=2,EN!M8,IF(cal!$S$7=3,DE!M8,IF(cal!$S$7=4,FR!M8,IF(cal!$S$7=5,NR!M8,IF(cal!$S$7=6,SP!M8,IF(cal!$S$7=7,SW!M8,IF(cal!$S$7=8,TS!M8,IF(cal!$S$7=9,ExtraTaal1!M8,IF(cal!$S$7=10,ExtraTaal2!M8,IF(cal!$S$7=11,ExtraTaal3!M8,)))))))))))","v":0},null,null,null,null,{"$f":"IF($X$4=1,E9,IF($X$4=2,(E9-32)/1.8))","v":75},null,null,null,null,{"$f":"IF($X$4=1,K9,IF($X$4=2,(K9-32)/1.8))","v":16}]
[null,{"$f":"IF($S$7=1,NL!A9,IF(cal!$S$7=2,EN!A9,IF(cal!$S$7=3,DE!A9,IF(cal!$S$7=4,FR!A9,IF(cal!$S$7=5,NR!A9,IF(cal!$S$7=6,SP!A9,IF(cal!$S$7=7,SW!A9,IF(cal!$S$7=8,TS!A9,IF(cal!$S$7=9,ExtraTaal1!A9,IF(cal!$S$7=10,ExtraTaal2!A9,IF(cal!$S$7=11,ExtraTaal3!A9,)))))))))))","v":"Return temp."},{"$f":"IF($S$7=1,NL!B9,IF(cal!$S$7=2,EN!B9,IF(cal!$S$7=3,DE!B9,IF(cal!$S$7=4,FR!B9,IF(cal!$S$7=5,NR!B9,IF(cal!$S$7=6,SP!B9,IF(cal!$S$7=7,SW!B9,IF(cal!$S$7=8,TS!B9,IF(cal!$S$7=9,ExtraTaal1!B9,IF(cal!$S$7=10,ExtraTaal2!B9,IF(cal!$S$7=11,ExtraTaal3!B9,)))))))))))","v":0},{"$f":"IF($S$7=1,NL!C9,IF(cal!$S$7=2,EN!C9,IF(cal!$S$7=3,DE!C9,IF(cal!$S$7=4,FR!C9,IF(cal!$S$7=5,NR!C9,IF(cal!$S$7=6,SP!C9,IF(cal!$S$7=7,SW!C9,IF(cal!$S$7=8,TS!C9,IF(cal!$S$7=9,ExtraTaal1!C9,IF(cal!$S$7=10,ExtraTaal2!C9,IF(cal!$S$7=11,ExtraTaal3!C9,)))))))))))","v":0},{"$f":"Freedom!E11","v":65},null,{"$f":"B10","v":"Return temp."},{"$f":"IF($S$7=1,NL!G9,IF(cal!$S$7=2,EN!G9,IF(cal!$S$7=3,DE!G9,IF(cal!$S$7=4,FR!G9,))))","v":0},{"$f":"IF($S$7=1,NL!H9,IF(cal!$S$7=2,EN!H9,IF(cal!$S$7=3,DE!H9,IF(cal!$S$7=4,FR!H9,))))","v":0},{"$f":"IF($S$7=1,NL!I9,IF(cal!$S$7=2,EN!I9,IF(cal!$S$7=3,DE!I9,IF(cal!$S$7=4,FR!I9,))))","v":0},{"$f":"Freedom!K11","v":18},null,null,null,null,null,null,null,{"$f":"IF($X$4=1,E10,IF($X$4=2,(E10-32)/1.8))","v":65},"CF,h",null,null,"CF,c",{"$f":"IF($X$4=1,K10,IF($X$4=2,(K10-32)/1.8))","v":18},null,"p_atm","h[mm]","cf_h"]
[null,{"$f":"IF($S$7=1,NL!A10,IF(cal!$S$7=2,EN!A10,IF(cal!$S$7=3,DE!A10,IF(cal!$S$7=4,FR!A10,IF(cal!$S$7=5,NR!A10,IF(cal!$S$7=6,SP!A10,IF(cal!$S$7=7,SW!A10,IF(cal!$S$7=8,TS!A10,IF(cal!$S$7=9,ExtraTaal1!A10,IF(cal!$S$7=10,ExtraTaal2!A10,IF(cal!$S$7=11,ExtraTaal3!A10,)))))))))))","v":"Room temp."},{"$f":"IF($S$7=1,NL!B10,IF(cal!$S$7=2,EN!B10,IF(cal!$S$7=3,DE!B10,IF(cal!$S$7=4,FR!B10,IF(cal!$S$7=5,NR!B10,IF(cal!$S$7=6,SP!B10,IF(cal!$S$7=7,SW!B10,IF(cal!$S$7=8,TS!B10,IF(cal!$S$7=9,ExtraTaal1!B10,IF(cal!$S$7=10,ExtraTaal2!B10,IF(cal!$S$7=11,ExtraTaal3!B10,)))))))))))","v":0},{"$f":"IF($S$7=1,NL!C10,IF(cal!$S$7=2,EN!C10,IF(cal!$S$7=3,DE!C10,IF(cal!$S$7=4,FR!C10,IF(cal!$S$7=5,NR!C10,IF(cal!$S$7=6,SP!C10,IF(cal!$S$7=7,SW!C10,IF(cal!$S$7=8,TS!C10,IF(cal!$S$7=9,ExtraTaal1!C10,IF(cal!$S$7=10,ExtraTaal2!C10,IF(cal!$S$7=11,ExtraTaal3!C10,)))))))))))","v":0},{"$f":"Freedom!E12","v":20},null,{"$f":"B11","v":"Room temp."},{"$f":"IF($S$7=1,NL!G10,IF(cal!$S$7=2,EN!G10,IF(cal!$S$7=3,DE!G10,IF(cal!$S$7=4,FR!G10,))))","v":0},null,null,{"$f":"Freedom!K12","v":27},null,null,null,null,null,null,null,{"$f":"IF($X$4=1,E11,IF($X$4=2,(E11-32)/1.8))","v":20},{"$f":"(($S$9-$S$10)/LN(($S$9-$S$11)/($S$10-$S$11)))/((75-65)/LN((75-20)/(65-20)))","v":1},null,null,{"$f":"(($X$9-$X$10)/LN(($X$9-$X$11)/($X$10-$X$11)))/((16-18)/LN((16-27)/(18-27)))","v":1},{"$f":"IF($X$4=1,K11,IF($X$4=2,(K11-32)/1.8))","v":27},null,{"$f":"IF($X$4=1,(101325*(1-((0.0065*M8)/(288.15)))^((9.81*0.028964)/(8.31447*0.0065))),IF($X$4=2,(101325*(1-((0.0065*(M8*0.3048))/(288.15)))^((9.81*0.028964)/(8.31447*0.0065)))))","v":101325},{"$f":"IF($X$4=1,M8/1000,IF($X$4=2,M8*0.0003048))","v":0},{"$f":"-(0.000265264729874266*AA11^6)+(0.000957582908802335*AA11^5)+(0.00470250661483425*AA11^4)-(0.0298716926548353*AA11^3)+(0.0557086806557086*AA11^2)-(0.0484008125693582*AA11)+1","v":1}]
[null,{"$f":"G12","v":"Relative humidity"},null,null,0.5,null,{"$f":"IF($S$7=1,NL!F11,IF(cal!$S$7=2,EN!F11,IF(cal!$S$7=3,DE!F11,IF(cal!$S$7=4,FR!F11,IF(cal!$S$7=5,NR!F11,IF(cal!$S$7=6,SP!F11,IF(cal!$S$7=7,SW!F11,IF(cal!$S$7=8,TS!F11,IF(cal!$S$7=9,ExtraTaal1!F11,IF(cal!$S$7=10,ExtraTaal2!F11,IF(cal!$S$7=11,ExtraTaal3!F11,)))))))))))","v":"Relative humidity"},null,null,null,{"$f":"Freedom!K13","v":0.5}]
[]
[null,null,null,null,{"$f":"IF($X$4=1,1,IF($X$4=2,0.004403))","v":1},{"$f":"IF($X$4=1,1,IF($X$4=2,4.0147))","v":1},{"$f":"IF($X$4=1,0.000334444444444444,IF($X$4=2,0.000568224721372))","v":3.3444444444444401E-4},{"$f":"IF($X$4=1,1,IF($X$4=2,3.4121416331))","v":1},{"$f":"IF($X$4=1,1,IF($X$4=2,0.004403))","v":1},{"$f":"IF($X$4=1,1,IF($X$4=2,4.0147))","v":1},null,null,null,{"$f":"IF($X$4=1,1,IF($X$4=2,0.588575))","v":1},{"$f":"IF($X$4=1,1,1.8)","v":1},{"$f":"IF($X$4=1,0,32)","v":0}]
[null,{"$f":"IF($S$7=1,NL!A14,IF(cal!$S$7=2,EN!A14,IF(cal!$S$7=3,DE!A14,IF(cal!$S$7=4,FR!A14,IF(cal!$S$7=5,NR!A14,IF(cal!$S$7=6,SP!A14,IF(cal!$S$7=7,SW!A14,IF(cal!$S$7=8,TS!A14,IF(cal!$S$7=9,ExtraTaal1!A14,IF(cal!$S$7=10,ExtraTaal2!A14,IF(cal!$S$7=11,ExtraTaal3!A14,)))))))))))","v":"Speed level:"},{"$f":"IF($S$7=1,NL!B14,IF(cal!$S$7=2,EN!B14,IF(cal!$S$7=3,DE!B14,IF(cal!$S$7=4,FR!B14,IF(cal!$S$7=5,NR!B14,IF(cal!$S$7=6,SP!B14,IF(cal!$S$7=7,SW!B14,IF(cal!$S$7=8,TS!B14,IF(cal!$S$7=9,ExtraTaal1!B14,IF(cal!$S$7=10,ExtraTaal2!B14,IF(cal!$S$7=11,ExtraTaal3!B14,)))))))))))","v":"Control voltage [V]"},{"$f":"IF($S$7=1,NL!C14,IF(cal!$S$7=2,EN!C14,IF(cal!$S$7=3,DE!C14,IF(cal!$S$7=4,FR!C14,IF(cal!$S$7=5,NR!C14,IF(cal!$S$7=6,SP!C14,IF(cal!$S$7=7,SW!C14,IF(cal!$S$7=8,TS!C14,IF(cal!$S$7=9,ExtraTaal1!C14,IF(cal!$S$7=10,ExtraTaal2!C14,IF(cal!$S$7=11,ExtraTaal3!C14,)))))))))))","v":"Heat output * 75/65/20 [W]"},{"$f":"IF($S$7=1,NL!D14,IF(cal!$S$7=2,EN!D14,IF(cal!$S$7=3,DE!D14,IF(cal!$S$7=4,FR!D14,IF(cal!$S$7=5,NR!D14,IF(cal!$S$7=6,SP!D14,IF(cal!$S$7=7,SW!D14,IF(cal!$S$7=8,TS!D14,IF(cal!$S$7=9,ExtraTaal1!D14,IF(cal!$S$7=10,ExtraTaal2!D14,IF(cal!$S$7=11,ExtraTaal3!D14,)))))))))))","v":"Water flowrate, heating [l/h]"},{"$f":"IF($S$7=1,NL!E14,IF(cal!$S$7=2,EN!E14,IF(cal!$S$7=3,DE!E14,IF(cal!$S$7=4,FR!E14,IF(cal!$S$7=5,NR!E14,IF(cal!$S$7=6,SP!E14,IF(cal!$S$7=7,SW!E14,IF(cal!$S$7=8,TS!E14,IF(cal!$S$7=9,ExtraTaal1!E14,IF(cal!$S$7=10,ExtraTaal2!E14,IF(cal!$S$7=11,ExtraTaal3!E14,)))))))))))","v":"Watersided pressure loss [kPa]"},{"$f":"IF($S$7=1,NL!F14,IF(cal!$S$7=2,EN!F14,IF(cal!$S$7=3,DE!F14,IF(cal!$S$7=4,FR!F14,IF(cal!$S$7=5,NR!F14,IF(cal!$S$7=6,SP!F14,IF(cal!$S$7=7,SW!F14,IF(cal!$S$7=8,TS!F14,IF(cal!$S$7=9,ExtraTaal1!F14,IF(cal!$S$7=10,ExtraTaal2!F14,IF(cal!$S$7=11,ExtraTaal3!F14,)))))))))))","v":"Sens. cooling capacity * 16/18/27 [W]"},{"$f":"IF($S$7=1,NL!G14,IF(cal!$S$7=2,EN!G14,IF(cal!$S$7=3,DE!G14,IF(cal!$S$7=4,FR!G14,IF(cal!$S$7=5,NR!G14,IF(cal!$S$7=6,SP!G14,IF(cal!$S$7=7,SW!G14,IF(cal!$S$7=8,TS!G14,IF(cal!$S$7=9,ExtraTaal1!G14,IF(cal!$S$7=10,ExtraTaal2!G14,IF(cal!$S$7=11,ExtraTaal3!G14,)))))))))))","v":"Tot. cooling capacity 16/18/27 [W]"},{"$f":"IF($S$7=1,NL!H14,IF(cal!$S$7=2,EN!H14,IF(cal!$S$7=3,DE!H14,IF(cal!$S$7=4,FR!H14,IF(cal!$S$7=5,NR!H14,IF(cal!$S$7=6,SP!H14,IF(cal!$S$7=7,SW!H14,IF(cal!$S$7=8,TS!H14,IF(cal!$S$7=9,ExtraTaal1!H14,IF(cal!$S$7=10,ExtraTaal2!H14,IF(cal!$S$7=11,ExtraTaal3!H14,)))))))))))","v":"Water flowrate, cooling [l/h]"},{"$f":"IF($S$7=1,NL!I14,IF(cal!$S$7=2,EN!I14,IF(cal!$S$7=3,DE!I14,IF(cal!$S$7=4,FR!I14,IF(cal!$S$7=5,NR!I14,IF(cal!$S$7=6,SP!I14,IF(cal!$S$7=7,SW!I14,IF(cal!$S$7=8,TS!I14,IF(cal!$S$7=9,ExtraTaal1!I14,IF(cal!$S$7=10,ExtraTaal2!I14,IF(cal!$S$7=11,ExtraTaal3!I14,)))))))))))","v":"Watersided pressure loss [kPa]"},{"$f":"IF($S$7=1,NL!J14,IF(cal!$S$7=2,EN!J14,IF(cal!$S$7=3,DE!J14,IF(cal!$S$7=4,FR!J14,IF(cal!$S$7=5,NR!J14,IF(cal!$S$7=6,SP!J14,IF(cal!$S$7=7,SW!J14,IF(cal!$S$7=8,TS!J14,IF(cal!$S$7=9,ExtraTaal1!J14,IF(cal!$S$7=10,ExtraTaal2!J14,IF(cal!$S$7=11,ExtraTaal3!J14,)))))))))))","v":"Sound pressure *** [dB(A)]"},{"$f":"IF($S$7=1,NL!K14,IF(cal!$S$7=2,EN!K14,IF(cal!$S$7=3,DE!K14,IF(cal!$S$7=4,FR!K14,IF(cal!$S$7=5,NR!K14,IF(cal!$S$7=6,SP!K14,IF(cal!$S$7=7,SW!K14,IF(cal!$S$7=8,TS!K14,IF(cal!$S$7=9,ExtraTaal1!K14,IF(cal!$S$7=10,ExtraTaal2!K14,IF(cal!$S$7=11,ExtraTaal3!K14,)))))))))))","v":"Sound power ** [dB(A)]"},{"$f":"IF($S$7=1,NL!L14,IF(cal!$S$7=2,EN!L14,IF(cal!$S$7=3,DE!L14,IF(cal!$S$7=4,FR!L14,IF(cal!$S$7=5,NR!L14,IF(cal!$S$7=6,SP!L14,IF(cal!$S$7=7,SW!L14,IF(cal!$S$7=8,TS!L14,IF(cal!$S$7=9,ExtraTaal1!L14,IF(cal!$S$7=10,ExtraTaal2!L14,IF(cal!$S$7=11,ExtraTaal3!L14,)))))))))))","v":"Electrical power [W]"},{"$f":"IF($S$7=1,NL!M14,IF(cal!$S$7=2,EN!M14,IF(cal!$S$7=3,DE!M14,IF(cal!$S$7=4,FR!M14,IF(cal!$S$7=5,NR!M14,IF(cal!$S$7=6,SP!M14,IF(cal!$S$7=7,SW!M14,IF(cal!$S$7=8,TS!M14,IF(cal!$S$7=9,ExtraTaal1!M14,IF(cal!$S$7=10,ExtraTaal2!M14,IF(cal!$S$7=11,ExtraTaal3!M14,)))))))))))","v":"Air flowrate [m³/h]"},{"$f":"IF($S$7=1,NL!N14,IF(cal!$S$7=2,EN!N14,IF(cal!$S$7=3,DE!N14,IF(cal!$S$7=4,FR!N14,IF(cal!$S$7=5,NR!N14,IF(cal!$S$7=6,SP!N14,IF(cal!$S$7=7,SW!N14,IF(cal!$S$7=8,TS!N14,IF(cal!$S$7=9,ExtraTaal1!N14,IF(cal!$S$7=10,ExtraTaal2!N14,IF(cal!$S$7=11,ExtraTaal3!N14,)))))))))))","v":"Air exhaust temp. heating [°C]"},{"$f":"IF($S$7=1,NL!O14,IF(cal!$S$7=2,EN!O14,IF(cal!$S$7=3,DE!O14,IF(cal!$S$7=4,FR!O14,IF(cal!$S$7=5,NR!O14,IF(cal!$S$7=6,SP!O14,IF(cal!$S$7=7,SW!O14,IF(cal!$S$7=8,TS!O14,IF(cal!$S$7=9,ExtraTaal1!O14,IF(cal!$S$7=10,ExtraTaal2!O14,IF(cal!$S$7=11,ExtraTaal3!O14,)))))))))))","v":"Air exhaust temp. cooling [°C]"},"n- heating","n- cooling",null,null,null,null,null,"Q_verw","dP_verw","Q_voelb_c","dP_cool","Geluid_P","P_elek","V_air","Q_verw","dP_verw","Q_voelb_c","dP_cool","Geluid_P","P_elek","V_air",null,"Q_verw","dP_verw","Q_voelb_c","dP_cool","Geluid_P","P_elek","V_air",null,null,null,null,"Q_verw","dP_verw","Q_voelb_c","dP_cool","Geluid_P","P_elek","V_air","Q_verw","dP_verw","Q_voelb_c","dP_cool","Geluid_P","P_elek","V_air","Q_verw","dP_verw","Q_voelb_c","dP_cool","Geluid_P","P_elek","V_air",null,"Q_verw","dP_verw","Q_voelb_c","dP_cool","Geluid_P","P_elek","V_air","Q_verw","dP_verw","Q_voelb_c","dP_cool","Geluid_P","P_elek","V_air"]
[null,{"$f":"IF($S$7=1,NL!A15,IF(cal!$S$7=2,EN!A15,IF(cal!$S$7=3,DE!A15,IF(cal!$S$7=4,FR!A15,IF(cal!$S$7=5,NR!A15,IF(cal!$S$7=6,SP!A15,IF(cal!$S$7=7,SW!A15,IF(cal!$S$7=8,TS!A15,IF(cal!$S$7=9,ExtraTaal1!A15,IF(cal!$S$7=10,ExtraTaal2!A15,IF(cal!$S$7=11,ExtraTaal3!A15,)))))))))))","v":"Freedom height 20 cm width 19 cm length 74 cm (Type 1)"},{"$f":"IF($S$7=1,NL!B15,IF(cal!$S$7=2,EN!B15,IF(cal!$S$7=3,DE!B15,IF(cal!$S$7=4,FR!B15,IF(cal!$S$7=5,NR!B15,IF(cal!$S$7=6,SP!B15,IF(cal!$S$7=7,SW!B15,IF(cal!$S$7=8,TS!B15,IF(cal!$S$7=9,ExtraTaal1!B15,IF(cal!$S$7=10,ExtraTaal2!B15,IF(cal!$S$7=11,ExtraTaal3!B15,)))))))))))","v":0},{"$f":"IF($S$7=1,NL!C15,IF(cal!$S$7=2,EN!C15,IF(cal!$S$7=3,DE!C15,IF(cal!$S$7=4,FR!C15,IF(cal!$S$7=5,NR!C15,IF(cal!$S$7=6,SP!C15,IF(cal!$S$7=7,SW!C15,IF(cal!$S$7=8,TS!C15,IF(cal!$S$7=9,ExtraTaal1!C15,IF(cal!$S$7=10,ExtraTaal2!C15,IF(cal!$S$7=11,ExtraTaal3!C15,)))))))))))","v":0},{"$f":"IF($S$7=1,NL!D15,IF(cal!$S$7=2,EN!D15,IF(cal!$S$7=3,DE!D15,IF(cal!$S$7=4,FR!D15,IF(cal!$S$7=5,NR!D15,IF(cal!$S$7=6,SP!D15,IF(cal!$S$7=7,SW!D15,IF(cal!$S$7=8,TS!D15,IF(cal!$S$7=9,ExtraTaal1!D15,IF(cal!$S$7=10,ExtraTaal2!D15,IF(cal!$S$7=11,ExtraTaal3!D15,)))))))))))","v":0},{"$f":"IF($S$7=1,NL!E15,IF(cal!$S$7=2,EN!E15,IF(cal!$S$7=3,DE!E15,IF(cal!$S$7=4,FR!E15,IF(cal!$S$7=5,NR!E15,IF(cal!$S$7=6,SP!E15,IF(cal!$S$7=7,SW!E15,IF(cal!$S$7=8,TS!E15,IF(cal!$S$7=9,ExtraTaal1!E15,IF(cal!$S$7=10,ExtraTaal2!E15,IF(cal!$S$7=11,ExtraTaal3!E15,)))))))))))","v":0},{"$f":"IF($S$7=1,NL!F15,IF(cal!$S$7=2,EN!F15,IF(cal!$S$7=3,DE!F15,IF(cal!$S$7=4,FR!F15,IF(cal!$S$7=5,NR!F15,IF(cal!$S$7=6,SP!F15,IF(cal!$S$7=7,SW!F15,IF(cal!$S$7=8,TS!F15,IF(cal!$S$7=9,ExtraTaal1!F15,IF(cal!$S$7=10,ExtraTaal2!F15,IF(cal!$S$7=11,ExtraTaal3!F15,)))))))))))","v":0},{"$f":"IF($S$7=1,NL!G15,IF(cal!$S$7=2,EN!G15,IF(cal!$S$7=3,DE!G15,IF(cal!$S$7=4,FR!G15,IF(cal!$S$7=5,NR!G15,IF(cal!$S$7=6,SP!G15,IF(cal!$S$7=7,SW!G15,IF(cal!$S$7=8,TS!G15,IF(cal!$S$7=9,ExtraTaal1!G15,IF(cal!$S$7=10,ExtraTaal2!G15,IF(cal!$S$7=11,ExtraTaal3!G15,)))))))))))","v":0},{"$f":"IF($S$7=1,NL!H15,IF(cal!$S$7=2,EN!H15,IF(cal!$S$7=3,DE!H15,IF(cal!$S$7=4,FR!H15,IF(cal!$S$7=5,NR!H15,IF(cal!$S$7=6,SP!H15,IF(cal!$S$7=7,SW!H15,IF(cal!$S$7=8,TS!H15,IF(cal!$S$7=9,ExtraTaal1!H15,IF(cal!$S$7=10,ExtraTaal2!H15,IF(cal!$S$7=11,ExtraTaal3!H15,)))))))))))","v":0},{"$f":"IF($S$7=1,NL!I15,IF(cal!$S$7=2,EN!I15,IF(cal!$S$7=3,DE!I15,IF(cal!$S$7=4,FR!I15,IF(cal!$S$7=5,NR!I15,IF(cal!$S$7=6,SP!I15,IF(cal!$S$7=7,SW!I15,IF(cal!$S$7=8,TS!I15,IF(cal!$S$7=9,ExtraTaal1!I15,IF(cal!$S$7=10,ExtraTaal2!I15,IF(cal!$S$7=11,ExtraTaal3!I15,)))))))))))","v":0},{"$f":"IF($S$7=1,NL!J15,IF(cal!$S$7=2,EN!J15,IF(cal!$S$7=3,DE!J15,IF(cal!$S$7=4,FR!J15,IF(cal!$S$7=5,NR!J15,IF(cal!$S$7=6,SP!J15,IF(cal!$S$7=7,SW!J15,IF(cal!$S$7=8,TS!J15,IF(cal!$S$7=9,ExtraTaal1!J15,IF(cal!$S$7=10,ExtraTaal2!J15,IF(cal!$S$7=11,ExtraTaal3!J15,)))))))))))","v":0},{"$f":"IF($S$7=1,NL!K15,IF(cal!$S$7=2,EN!K15,IF(cal!$S$7=3,DE!K15,IF(cal!$S$7=4,FR!K15,IF(cal!$S$7=5,NR!K15,IF(cal!$S$7=6,SP!K15,IF(cal!$S$7=7,SW!K15,IF(cal!$S$7=8,TS!K15,IF(cal!$S$7=9,ExtraTaal1!K15,IF(cal!$S$7=10,ExtraTaal2!K15,IF(cal!$S$7=11,ExtraTaal3!K15,)))))))))))","v":0},{"$f":"IF($S$7=1,NL!L15,IF(cal!$S$7=2,EN!L15,IF(cal!$S$7=3,DE!L15,IF(cal!$S$7=4,FR!L15,IF(cal!$S$7=5,NR!L15,IF(cal!$S$7=6,SP!L15,IF(cal!$S$7=7,SW!L15,IF(cal!$S$7=8,TS!L15,IF(cal!$S$7=9,ExtraTaal1!L15,IF(cal!$S$7=10,ExtraTaal2!L15,IF(cal!$S$7=11,ExtraTaal3!L15,)))))))))))","v":0},{"$f":"IF($S$7=1,NL!M15,IF(cal!$S$7=2,EN!M15,IF(cal!$S$7=3,DE!M15,IF(cal!$S$7=4,FR!M15,IF(cal!$S$7=5,NR!M15,IF(cal!$S$7=6,SP!M15,IF(cal!$S$7=7,SW!M15,IF(cal!$S$7=8,TS!M15,IF(cal!$S$7=9,ExtraTaal1!M15,IF(cal!$S$7=10,ExtraTaal2!M15,IF(cal!$S$7=11,ExtraTaal3!M15,)))))))))))","v":0},{"$f":"IF($S$7=1,NL!N15,IF(cal!$S$7=2,EN!N15,IF(cal!$S$7=3,DE!N15,IF(cal!$S$7=4,FR!N15,IF(cal!$S$7=5,NR!N15,IF(cal!$S$7=6,SP!N15,IF(cal!$S$7=7,SW!N15,IF(cal!$S$7=8,TS!N15,IF(cal!$S$7=9,ExtraTaal1!N15,IF(cal!$S$7=10,ExtraTaal2!N15,IF(cal!$S$7=11,ExtraTaal3!N15,)))))))))))","v":0},{"$f":"IF($S$7=1,NL!O15,IF(cal!$S$7=2,EN!O15,IF(cal!$S$7=3,DE!O15,IF(cal!$S$7=4,FR!O15,IF(cal!$S$7=5,NR!O15,IF(cal!$S$7=6,SP!O15,IF(cal!$S$7=7,SW!O15,IF(cal!$S$7=8,TS!O15,IF(cal!$S$7=9,ExtraTaal1!O15,IF(cal!$S$7=10,ExtraTaal2!O15,IF(cal!$S$7=11,ExtraTaal3!O15,)))))))))))","v":0},"n-value","n-value",null,null,null,null,null,{"$f":"IF(Freedom!$K$6=cal!Y2,1,IF(Freedom!$K$6=cal!Y3,2,IF(Freedom!$K$6=cal!Y5,3,IF(Freedom!$K$6=cal!Y6,4,IF(Freedom!$K$6=cal!Y7,5,IF(Freedom!$K$6=cal!Y8,6,IF(Freedom!$K$6=cal!Y4,7,)))))))","v":1},null,null,null,null,null,null,{"$f":"\"Freedom\"","v":"Freedom"},null,null,null,null,null,null,null,null,null,null,null,null,null,null,null,"voelbare koelcapaciteit","totale koelcapaciteit"]
[null,0.2,2,{"$f":"(X17*($T$11^$Q17))*Watts*CF_Altit","v":312.70800000000003},{"$f":"ROUND(((D17/Watts)/(($S$9-$S$10)*1.163))*$E$14,IF($X$4=1,0,IF($X$4=2,2)))","v":27},{"$f":"($Y$18*(E17/$E$14)^$Y$20)*$F$14","v":0.10451976775750199},{"$f":"(Z17*($W$11^R17))*Watts*CF_Altit","v":33.989999999999995},{"$f":"((G17/Watts)/(IF((237.3*LN((RH*EXP(17.27*(Tl_cool/(Tl_cool+237.3))))))/(17.27-LN((RH*EXP(17.27*(Tl_cool/(Tl_cool+237.3))))))<Tavg_cold,1,IF(1/(1+((2258*((0.622/(($Z$11/(1*611*EXP(17.27*(Tavg_cold/(Tavg_cold+237.3))))))-1)*1000-(0.622/(($Z$11/(RH*611*EXP(17.27*(Tl_cool/(Tl_cool+237.3))))))-1)*1000))/(1005*(Tavg_cold-Tl_cool))))*1.039+((-0.000729*$C17+0.001448)*(Tl_cool-Tavg_cold)+(0.016908*$C17-0.033574))*1.039>1,1,1/(1+((2258*((0.622/(($Z$11/(1*611*EXP(17.27*(Tavg_cold/(Tavg_cold+237.3))))))-1)*1000-(0.622/(($Z$11/(RH*611*EXP(17.27*(Tl_cool/(Tl_cool+237.3))))))-1)*1000))/(1005*(Tavg_cold-Tl_cool))))*1.039+((-0.000729*$C17+0.001448)*(Tl_cool-Tavg_cold)+(0.016908*$C17-0.033574))*1.039))))*Watts","v":33.989999999999995},{"$f":"ROUND(((H17/Watts)/((Tr_cool-Tv_cool)*1.163))*$I$14,IF($X$4=1,0,IF($X$4=2,2)))","v":15},{"$f":"($AA$18*(I17/$I$14)^$AA$20)*$J$14","v":3.5785331495427598E-2},{"$f":"L17-8","v":14},{"$f":"AB17","v":22},0.5,{"$f":"AD17*Cubics","v":24},{"$f":"((($D17/Watts)/(((p_atm*0.028964)/(8.31447*(20+273.15)))*(($N17/3600)/Cubics)*(1005+1870*((0.622)/(((p_atm)/($E$12*Pvs_Heat_in))-1)))))+Tl_heat)*Celc1+Celc2","v":58.245781394611512},{"$f":"(Tl_cool-(($G17/Watts)/(1006*$N17*kgss)))*Celc1+Celc2","v":22.790621718195805},1,0.9,null,null,null,null,{"$f":"(H17-G17)/H17","v":0},{"$f":"IF($X$16=1,AE17,IF($X$16=2,AM17,IF($X$16=3,BL17,IF($X$16=4,BE17,IF($X$16=5,CA17,IF($X$16=6,BT17,IF($X$16=7,AX17,)))))))","v":312.70800000000003},{"$f":"IF($X$16=1,AF17,IF($X$16=2,AN17,IF($X$16=3,BM17,IF($X$16=4,BF17,IF($X$16=5,CB17,IF($X$16=6,BU17,IF($X$16=7,AY17,)))))))","v":"a"},{"$f":"IF($X$16=1,AG17,IF($X$16=2,AO17,IF($X$16=3,BN17,IF($X$16=4,BG17,IF($X$16=5,CC17,IF($X$16=6,BV17,IF($X$16=7,AZ17,)))))))","v":33.989999999999995},{"$f":"IF($X$16=1,AH17,IF($X$16=2,AP17,IF($X$16=3,BO17,IF($X$16=4,BH17,IF($X$16=5,CD17,IF($X$16=6,BW17,IF($X$16=7,BA17,)))))))","v":"a"},{"$f":"IF($X$16=1,AI17,IF($X$16=2,AQ17,IF($X$16=3,BP17,IF($X$16=4,BI17,IF($X$16=5,CE17,IF($X$16=6,BX17,IF($X$16=7,BB17,)))))))","v":22},{"$f":"IF($X$16=1,AJ17,IF($X$16=2,AR17,IF($X$16=3,BQ17,IF($X$16=4,BJ17,IF($X$16=5,CF17,IF($X$16=6,BY17,IF($X$16=7,BC17,)))))))","v":0.5},{"$f":"IF($X$16=1,AK17,IF($X$16=2,AS17,IF($X$16=3,BR17,IF($X$16=4,BK17,IF($X$16=5,CG17,IF($X$16=6,BZ17,IF($X$16=7,BD17,)))))))","v":24},312.70800000000003,"a",33.989999999999995,"a",22,0.5,24,null,null,null,null,null,null,null,null,null,{"$f":"(AG17*((((Tv_cool-Tr_cool)/LN((Tv_cool-Tl_cool)/(Tr_cool-Tl_cool)))/((16-18)/LN((16-27)/(18-27))))^S17))*$G$14","v":1.136776666666665E-2},{"$f":"((AU17/$G$14)/(IF((237.3*LN((RH*EXP(17.27*(Tl_cool/(Tl_cool+237.3))))))/(17.27-LN((RH*EXP(17.27*(Tl_cool/(Tl_cool+237.3))))))<((Tv_cool+Tr_cool)/2),1,1/(1+((2258*((0.622/((p_atm/(1*611*EXP(17.27*(((Tv_cool+Tr_cool)/2)/(((Tv_cool+Tr_cool)/2)+237.3))))))-1)*1000-(0.622/((p_atm/(RH*611*EXP(17.27*(Tl_cool/(Tl_cool+237.3))))))-1)*1000))/(1005*(((Tv_cool+Tr_cool)/2)-Tl_cool))))+-((-0.000625*$C17+0.00625)*(Tl_cool-(Tv_cool+Tr_cool)/2)-(-0.000625*$C17+0.00625)*10))))*$H$14","v":33.989999999999995}]
[null,0.4,4,{"$f":"(X18*($T$11^$Q18))*Watts*CF_Altit","v":561.96799999999996},{"$f":"ROUND(((D18/Watts)/(($S$9-$S$10)*1.163))*$E$14,IF($X$4=1,0,IF($X$4=2,2)))","v":48},{"$f":"($Y$18*(E18/$E$14)^$Y$20)*$F$14","v":0.29843785011075069},{"$f":"(Z18*($W$11^R18))*Watts*CF_Altit","v":74.777999999999977},{"$f":"((G18/Watts)/(IF((237.3*LN((RH*EXP(17.27*(Tl_cool/(Tl_cool+237.3))))))/(17.27-LN((RH*EXP(17.27*(Tl_cool/(Tl_cool+237.3))))))<Tavg_cold,1,IF(1/(1+((2258*((0.622/(($Z$11/(1*611*EXP(17.27*(Tavg_cold/(Tavg_cold+237.3))))))-1)*1000-(0.622/(($Z$11/(RH*611*EXP(17.27*(Tl_cool/(Tl_cool+237.3))))))-1)*1000))/(1005*(Tavg_cold-Tl_cool))))*1.039+((-0.000729*$C18+0.001448)*(Tl_cool-Tavg_cold)+(0.016908*$C18-0.033574))*1.039>1,1,1/(1+((2258*((0.622/(($Z$11/(1*611*EXP(17.27*(Tavg_cold/(Tavg_cold+237.3))))))-1)*1000-(0.622/(($Z$11/(RH*611*EXP(17.27*(Tl_cool/(Tl_cool+237.3))))))-1)*1000))/(1005*(Tavg_cold-Tl_cool))))*1.039+((-0.000729*$C18+0.001448)*(Tl_cool-Tavg_cold)+(0.016908*$C18-0.033574))*1.039))))*Watts","v":74.777999999999977},{"$f":"ROUND(((H18/Watts)/((Tr_cool-Tv_cool)*1.163))*$I$14,IF($X$4=1,0,IF($X$4=2,2)))","v":32},{"$f":"($AA$18*(I18/$I$14)^$AA$20)*$J$14","v":0.14247830750649948},{"$f":"L18-8","v":15},23,0.8,{"$f":"AD18*Cubics","v":37},{"$f":"((($D18/Watts)/(((p_atm*0.028964)/(8.31447*(20+273.15)))*(($N18/3600)/Cubics)*(1005+1870*((0.622)/(((p_atm)/($E$12*Pvs_Heat_in))-1)))))+Tl_heat)*Celc1+Celc2","v":64.582626490545977},{"$f":"(Tl_cool-(($G18/Watts)/(1006*$N18*kgss)))*Celc1+Celc2","v":20.993103424884822},1,0.9,null,null,null,null,{"$f":"(H18-G18)/H18","v":0},{"$f":"IF($X$16=1,AE18,IF($X$16=2,AM18,IF($X$16=3,BL18,IF($X$16=4,BE18,IF($X$16=5,CA18,IF($X$16=6,BT18,IF($X$16=7,AX18,)))))))","v":561.96799999999996},{"$f":"IF($X$16=1,AF18,IF($X$16=2,AN18,IF($X$16=3,BM18,IF($X$16=4,BF18,IF($X$16=5,CB18,IF($X$16=6,BU18,IF($X$16=7,AY18,)))))))","v":2.5649818987149339E-4},{"$f":"IF($X$16=1,AG18,IF($X$16=2,AO18,IF($X$16=3,BN18,IF($X$16=4,BG18,IF($X$16=5,CC18,IF($X$16=6,BV18,IF($X$16=7,AZ18,)))))))","v":74.777999999999977},{"$f":"IF($X$16=1,AH18,IF($X$16=2,AP18,IF($X$16=3,BO18,IF($X$16=4,BH18,IF($X$16=5,CD18,IF($X$16=6,BW18,IF($X$16=7,BA18,)))))))","v":2.5649818987149339E-4},{"$f":"IF($X$16=1,AI18,IF($X$16=2,AQ18,IF($X$16=3,BP18,IF($X$16=4,BI18,IF($X$16=5,CE18,IF($X$16=6,BX18,IF($X$16=7,BB18,)))))))","v":23},{"$f":"IF($X$16=1,AJ18,IF($X$16=2,AR18,IF($X$16=3,BQ18,IF($X$16=4,BJ18,IF($X$16=5,CF18,IF($X$16=6,BY18,IF($X$16=7,BC18,)))))))","v":0.8},{"$f":"IF($X$16=1,AK18,IF($X$16=2,AS18,IF($X$16=3,BR18,IF($X$16=4,BK18,IF($X$16=5,CG18,IF($X$16=6,BZ18,IF($X$16=7,BD18,)))))))","v":37},561.96799999999996,2.5649818987149339E-4,74.777999999999977,{"$f":"AF18","v":2.5649818987149339E-4},23,0.8,37,null,null,null,null,null,null,null,null,null,{"$f":"(AG18*((((Tv_cool-Tr_cool)/LN((Tv_cool-Tl_cool)/(Tr_cool-Tl_cool)))/((16-18)/LN((16-27)/(18-27))))^S18))*$G$14","v":2.5009086666666628E-2},{"$f":"((AU18/$G$14)/(IF((237.3*LN((RH*EXP(17.27*(Tl_cool/(Tl_cool+237.3))))))/(17.27-LN((RH*EXP(17.27*(Tl_cool/(Tl_cool+237.3))))))<((Tv_cool+Tr_cool)/2),1,1/(1+((2258*((0.622/((p_atm/(1*611*EXP(17.27*(((Tv_cool+Tr_cool)/2)/(((Tv_cool+Tr_cool)/2)+237.3))))))-1)*1000-(0.622/((p_atm/(RH*611*EXP(17.27*(Tl_cool/(Tl_cool+237.3))))))-1)*1000))/(1005*(((Tv_cool+Tr_cool)/2)-Tl_cool))))+-((-0.000625*$C18+0.00625)*(Tl_cool-(Tv_cool+Tr_cool)/2)-(-0.000625*$C18+0.00625)*10))))*$H$14","v":74.777999999999977}]
[null,0.6,6,{"$f":"(X19*($T$11^$Q19))*Watts*CF_Altit","v":791.96699999999998},{"$f":"ROUND(((D19/Watts)/(($S$9-$S$10)*1.163))*$E$14,IF($X$4=1,0,IF($X$4=2,2)))","v":68},{"$f":"($Y$18*(E19/$E$14)^$Y$20)*$F$14","v":0.56323919121960386},{"$f":"(Z19*($W$11^R19))*Watts*CF_Altit","v":117.83199999999997},{"$f":"((G19/Watts)/(IF((237.3*LN((RH*EXP(17.27*(Tl_cool/(Tl_cool+237.3))))))/(17.27-LN((RH*EXP(17.27*(Tl_cool/(Tl_cool+237.3))))))<Tavg_cold,1,IF(1/(1+((2258*((0.622/(($Z$11/(1*611*EXP(17.27*(Tavg_cold/(Tavg_cold+237.3))))))-1)*1000-(0.622/(($Z$11/(RH*611*EXP(17.27*(Tl_cool/(Tl_cool+237.3))))))-1)*1000))/(1005*(Tavg_cold-Tl_cool))))*1.039+((-0.000729*$C19+0.001448)*(Tl_cool-Tavg_cold)+(0.016908*$C19-0.033574))*1.039>1,1,1/(1+((2258*((0.622/(($Z$11/(1*611*EXP(17.27*(Tavg_cold/(Tavg_cold+237.3))))))-1)*1000-(0.622/(($Z$11/(RH*611*EXP(17.27*(Tl_cool/(Tl_cool+237.3))))))-1)*1000))/(1005*(Tavg_cold-Tl_cool))))*1.039+((-0.000729*$C19+0.001448)*(Tl_cool-Tavg_cold)+(0.016908*$C19-0.033574))*1.039))))*Watts","v":117.83199999999997},{"$f":"ROUND(((H19/Watts)/((Tr_cool-Tv_cool)*1.163))*$I$14,IF($X$4=1,0,IF($X$4=2,2)))","v":51},{"$f":"($AA$18*(I19/$I$14)^$AA$20)*$J$14","v":0.33332288556727424},{"$f":"L19-8","v":23},31,1.3,{"$f":"AD19*Cubics","v":52},{"$f":"((($D19/Watts)/(((p_atm*0.028964)/(8.31447*(20+273.15)))*(($N19/3600)/Cubics)*(1005+1870*((0.622)/(((p_atm)/($E$12*Pvs_Heat_in))-1)))))+Tl_heat)*Celc1+Celc2","v":64.705353168617819},{"$f":"(Tl_cool-(($G19/Watts)/(1006*$N19*kgss)))*Celc1+Celc2","v":20.264994749113285},1,0.9,null,null,null,null,{"$f":"(H19-G19)/H19","v":0},{"$f":"IF($X$16=1,AE19,IF($X$16=2,AM19,IF($X$16=3,BL19,IF($X$16=4,BE19,IF($X$16=5,CA19,IF($X$16=6,BT19,IF($X$16=7,AX19,)))))))","v":791.96699999999998},{"$f":"IF($X$16=1,AF19,IF($X$16=2,AN19,IF($X$16=3,BM19,IF($X$16=4,BF19,IF($X$16=5,CB19,IF($X$16=6,BU19,IF($X$16=7,AY19,)))))))","v":"b"},{"$f":"IF($X$16=1,AG19,IF($X$16=2,AO19,IF($X$16=3,BN19,IF($X$16=4,BG19,IF($X$16=5,CC19,IF($X$16=6,BV19,IF($X$16=7,AZ19,)))))))","v":117.83199999999997},{"$f":"IF($X$16=1,AH19,IF($X$16=2,AP19,IF($X$16=3,BO19,IF($X$16=4,BH19,IF($X$16=5,CD19,IF($X$16=6,BW19,IF($X$16=7,BA19,)))))))","v":"b"},{"$f":"IF($X$16=1,AI19,IF($X$16=2,AQ19,IF($X$16=3,BP19,IF($X$16=4,BI19,IF($X$16=5,CE19,IF($X$16=6,BX19,IF($X$16=7,BB19,)))))))","v":31},{"$f":"IF($X$16=1,AJ19,IF($X$16=2,AR19,IF($X$16=3,BQ19,IF($X$16=4,BJ19,IF($X$16=5,CF19,IF($X$16=6,BY19,IF($X$16=7,BC19,)))))))","v":1.3},{"$f":"IF($X$16=1,AK19,IF($X$16=2,AS19,IF($X$16=3,BR19,IF($X$16=4,BK19,IF($X$16=5,CG19,IF($X$16=6,BZ19,IF($X$16=7,BD19,)))))))","v":52},791.96699999999998,"b",117.83199999999997,"b",31,1.3,52,null,null,null,null,null,null,null,null,null,{"$f":"(AG19*((((Tv_cool-Tr_cool)/LN((Tv_cool-Tl_cool)/(Tr_cool-Tl_cool)))/((16-18)/LN((16-27)/(18-27))))^S19))*$G$14","v":3.9408257777777712E-2},{"$f":"((AU19/$G$14)/(IF((237.3*LN((RH*EXP(17.27*(Tl_cool/(Tl_cool+237.3))))))/(17.27-LN((RH*EXP(17.27*(Tl_cool/(Tl_cool+237.3))))))<((Tv_cool+Tr_cool)/2),1,1/(1+((2258*((0.622/((p_atm/(1*611*EXP(17.27*(((Tv_cool+Tr_cool)/2)/(((Tv_cool+Tr_cool)/2)+237.3))))))-1)*1000-(0.622/((p_atm/(RH*611*EXP(17.27*(Tl_cool/(Tl_cool+237.3))))))-1)*1000))/(1005*(((Tv_cool+Tr_cool)/2)-Tl_cool))))+-((-0.000625*$C19+0.00625)*(Tl_cool-(Tv_cool+Tr_cool)/2)-(-0.000625*$C19+0.00625)*10))))*$H$14","v":117.83199999999995}]
[null,0.8,8,{"$f":"(X20*($T$11^$Q20))*Watts*CF_Altit","v":1009.503},{"$f":"ROUND(((D20/Watts)/(($S$9-$S$10)*1.163))*$E$14,IF($X$4=1,0,IF($X$4=2,2)))","v":87},{"$f":"($Y$18*(E20/$E$14)^$Y$20)*$F$14","v":0.88273000450333838},{"$f":"(Z20*($W$11^R20))*Watts*CF_Altit","v":163.15199999999993},{"$f":"((G20/Watts)/(IF((237.3*LN((RH*EXP(17.27*(Tl_cool/(Tl_cool+237.3))))))/(17.27-LN((RH*EXP(17.27*(Tl_cool/(Tl_cool+237.3))))))<Tavg_cold,1,IF(1/(1+((2258*((0.622/(($Z$11/(1*611*EXP(17.27*(Tavg_cold/(Tavg_cold+237.3))))))-1)*1000-(0.622/(($Z$11/(RH*611*EXP(17.27*(Tl_cool/(Tl_cool+237.3))))))-1)*1000))/(1005*(Tavg_cold-Tl_cool))))*1.039+((-0.000729*$C20+0.001448)*(Tl_cool-Tavg_cold)+(0.016908*$C20-0.033574))*1.039>1,1,1/(1+((2258*((0.622/(($Z$11/(1*611*EXP(17.27*(Tavg_cold/(Tavg_cold+237.3))))))-1)*1000-(0.622/(($Z$11/(RH*611*EXP(17.27*(Tl_cool/(Tl_cool+237.3))))))-1)*1000))/(1005*(Tavg_cold-Tl_cool))))*1.039+((-0.000729*$C20+0.001448)*(Tl_cool-Tavg_cold)+(0.016908*$C20-0.033574))*1.039))))*Watts","v":163.15199999999993},{"$f":"ROUND(((H20/Watts)/((Tr_cool-Tv_cool)*1.163))*$I$14,IF($X$4=1,0,IF($X$4=2,2)))","v":70},{"$f":"($AA$18*(I20/$I$14)^$AA$20)*$J$14","v":0.59381250082624693},{"$f":"L20-8","v":28},36,2.1,{"$f":"AD20*Cubics","v":68},{"$f":"((($D20/Watts)/(((p_atm*0.028964)/(8.31447*(20+273.15)))*(($N20/3600)/Cubics)*(1005+1870*((0.622)/(((p_atm)/($E$12*Pvs_Heat_in))-1)))))+Tl_heat)*Celc1+Celc2","v":63.576715118412864},{"$f":"(Tl_cool-(($G20/Watts)/(1006*$N20*kgss)))*Celc1+Celc2","v":19.868817969649363},1,0.9,null,null,null,null,{"$f":"(H20-G20)/H20","v":0},{"$f":"IF($X$16=1,AE20,IF($X$16=2,AM20,IF($X$16=3,BL20,IF($X$16=4,BE20,IF($X$16=5,CA20,IF($X$16=6,BT20,IF($X$16=7,AX20,)))))))","v":1009.503},{"$f":"IF($X$16=1,AF20,IF($X$16=2,AN20,IF($X$16=3,BM20,IF($X$16=4,BF20,IF($X$16=5,CB20,IF($X$16=6,BU20,IF($X$16=7,AY20,)))))))","v":1.8235155847906248},{"$f":"IF($X$16=1,AG20,IF($X$16=2,AO20,IF($X$16=3,BN20,IF($X$16=4,BG20,IF($X$16=5,CC20,IF($X$16=6,BV20,IF($X$16=7,AZ20,)))))))","v":163.15199999999993},{"$f":"IF($X$16=1,AH20,IF($X$16=2,AP20,IF($X$16=3,BO20,IF($X$16=4,BH20,IF($X$16=5,CD20,IF($X$16=6,BW20,IF($X$16=7,BA20,)))))))","v":1.8235155847906248},{"$f":"IF($X$16=1,AI20,IF($X$16=2,AQ20,IF($X$16=3,BP20,IF($X$16=4,BI20,IF($X$16=5,CE20,IF($X$16=6,BX20,IF($X$16=7,BB20,)))))))","v":36},{"$f":"IF($X$16=1,AJ20,IF($X$16=2,AR20,IF($X$16=3,BQ20,IF($X$16=4,BJ20,IF($X$16=5,CF20,IF($X$16=6,BY20,IF($X$16=7,BC20,)))))))","v":2.1},{"$f":"IF($X$16=1,AK20,IF($X$16=2,AS20,IF($X$16=3,BR20,IF($X$16=4,BK20,IF($X$16=5,CG20,IF($X$16=6,BZ20,IF($X$16=7,BD20,)))))))","v":68},1009.503,1.8235155847906248,163.15199999999993,{"$f":"AF20","v":1.8235155847906248},36,2.1,68,null,null,null,null,null,null,null,null,null,{"$f":"(AG20*((((Tv_cool-Tr_cool)/LN((Tv_cool-Tl_cool)/(Tr_cool-Tl_cool)))/((16-18)/LN((16-27)/(18-27))))^S20))*$G$14","v":5.4565279999999904E-2},{"$f":"((AU20/$G$14)/(IF((237.3*LN((RH*EXP(17.27*(Tl_cool/(Tl_cool+237.3))))))/(17.27-LN((RH*EXP(17.27*(Tl_cool/(Tl_cool+237.3))))))<((Tv_cool+Tr_cool)/2),1,1/(1+((2258*((0.622/((p_atm/(1*611*EXP(17.27*(((Tv_cool+Tr_cool)/2)/(((Tv_cool+Tr_cool)/2)+237.3))))))-1)*1000-(0.622/((p_atm/(RH*611*EXP(17.27*(Tl_cool/(Tl_cool+237.3))))))-1)*1000))/(1005*(((Tv_cool+Tr_cool)/2)-Tl_cool))))+-((-0.000625*$C20+0.00625)*(Tl_cool-(Tv_cool+Tr_cool)/2)-(-0.000625*$C20+0.00625)*10))))*$H$14","v":163.15199999999993}]
[null,1,10,{"$f":"(X21*($T$11^$Q21))*Watts*CF_Altit","v":1217.9749999999999},{"$f":"ROUND(((D21/Watts)/(($S$9-$S$10)*1.163))*$E$14,IF($X$4=1,0,IF($X$4=2,2)))","v":105},{"$f":"($Y$18*(E21/$E$14)^$Y$20)*$F$14","v":1.2438112805866202},{"$f":"(Z21*($W$11^R21))*Watts*CF_Altit","v":209.60499999999993},{"$f":"((G21/Watts)/(IF((237.3*LN((RH*EXP(17.27*(Tl_cool/(Tl_cool+237.3))))))/(17.27-LN((RH*EXP(17.27*(Tl_cool/(Tl_cool+237.3))))))<Tavg_cold,1,IF(1/(1+((2258*((0.622/(($Z$11/(1*611*EXP(17.27*(Tavg_cold/(Tavg_cold+237.3))))))-1)*1000-(0.622/(($Z$11/(RH*611*EXP(17.27*(Tl_cool/(Tl_cool+237.3))))))-1)*1000))/(1005*(Tavg_cold-Tl_cool))))*1.039+((-0.000729*$C21+0.001448)*(Tl_cool-Tavg_cold)+(0.016908*$C21-0.033574))*1.039>1,1,1/(1+((2258*((0.622/(($Z$11/(1*611*EXP(17.27*(Tavg_cold/(Tavg_cold+237.3))))))-1)*1000-(0.622/(($Z$11/(RH*611*EXP(17.27*(Tl_cool/(Tl_cool+237.3))))))-1)*1000))/(1005*(Tavg_cold-Tl_cool))))*1.039+((-0.000729*$C21+0.001448)*(Tl_cool-Tavg_cold)+(0.016908*$C21-0.033574))*1.039))))*Watts","v":209.60499999999993},{"$f":"ROUND(((H21/Watts)/((Tr_cool-Tv_cool)*1.163))*$I$14,IF($X$4=1,0,IF($X$4=2,2)))","v":90},{"$f":"($AA$18*(I21/$I$14)^$AA$20)*$J$14","v":0.93902245345157098},{"$f":"L21-8","v":34},42,3,{"$f":"AD21*Cubics","v":79},{"$f":"((($D21/Watts)/(((p_atm*0.028964)/(8.31447*(20+273.15)))*(($N21/3600)/Cubics)*(1005+1870*((0.622)/(((p_atm)/($E$12*Pvs_Heat_in))-1)))))+Tl_heat)*Celc1+Celc2","v":65.25505228311215},{"$f":"(Tl_cool-(($G21/Watts)/(1006*$N21*kgss)))*Celc1+Celc2","v":19.114076130290876},1,0.9,null,null,null,null,{"$f":"(H21-G21)/H21","v":0},{"$f":"IF($X$16=1,AE21,IF($X$16=2,AM21,IF($X$16=3,BL21,IF($X$16=4,BE21,IF($X$16=5,CA21,IF($X$16=6,BT21,IF($X$16=7,AX21,)))))))","v":1217.9749999999999},{"$f":"IF($X$16=1,AF21,IF($X$16=2,AN21,IF($X$16=3,BM21,IF($X$16=4,BF21,IF($X$16=5,CB21,IF($X$16=6,BU21,IF($X$16=7,AY21,)))))))","v":0},{"$f":"IF($X$16=1,AG21,IF($X$16=2,AO21,IF($X$16=3,BN21,IF($X$16=4,BG21,IF($X$16=5,CC21,IF($X$16=6,BV21,IF($X$16=7,AZ21,)))))))","v":209.60499999999993},{"$f":"IF($X$16=1,AH21,IF($X$16=2,AP21,IF($X$16=3,BO21,IF($X$16=4,BH21,IF($X$16=5,CD21,IF($X$16=6,BW21,IF($X$16=7,BA21,)))))))","v":0},{"$f":"IF($X$16=1,AI21,IF($X$16=2,AQ21,IF($X$16=3,BP21,IF($X$16=4,BI21,IF($X$16=5,CE21,IF($X$16=6,BX21,IF($X$16=7,BB21,)))))))","v":42},{"$f":"IF($X$16=1,AJ21,IF($X$16=2,AR21,IF($X$16=3,BQ21,IF($X$16=4,BJ21,IF($X$16=5,CF21,IF($X$16=6,BY21,IF($X$16=7,BC21,)))))))","v":3},{"$f":"IF($X$16=1,AK21,IF($X$16=2,AS21,IF($X$16=3,BR21,IF($X$16=4,BK21,IF($X$16=5,CG21,IF($X$16=6,BZ21,IF($X$16=7,BD21,)))))))","v":79},1217.9749999999999,null,209.60499999999993,null,42,3,79,null,null,null,null,null,null,null,null,null,{"$f":"(AG21*((((Tv_cool-Tr_cool)/LN((Tv_cool-Tl_cool)/(Tr_cool-Tl_cool)))/((16-18)/LN((16-27)/(18-27))))^S21))*$G$14","v":7.0101227777777664E-2},{"$f":"((AU21/$G$14)/(IF((237.3*LN((RH*EXP(17.27*(Tl_cool/(Tl_cool+237.3))))))/(17.27-LN((RH*EXP(17.27*(Tl_cool/(Tl_cool+237.3))))))<((Tv_cool+Tr_cool)/2),1,1/(1+((2258*((0.622/((p_atm/(1*611*EXP(17.27*(((Tv_cool+Tr_cool)/2)/(((Tv_cool+Tr_cool)/2)+237.3))))))-1)*1000-(0.622/((p_atm/(RH*611*EXP(17.27*(Tl_cool/(Tl_cool+237.3))))))-1)*1000))/(1005*(((Tv_cool+Tr_cool)/2)-Tl_cool))))+-((-0.000625*$C21+0.00625)*(Tl_cool-(Tv_cool+Tr_cool)/2)-(-0.000625*$C21+0.00625)*10))))*$H$14","v":209.60499999999993}]
[null,{"$f":"IF($S$7=1,NL!A21,IF(cal!$S$7=2,EN!A21,IF(cal!$S$7=3,DE!A21,IF(cal!$S$7=4,FR!A21,IF(cal!$S$7=5,NR!A21,IF(cal!$S$7=6,SP!A21,IF(cal!$S$7=7,SW!A21,IF(cal!$S$7=8,TS!A21,IF(cal!$S$7=9,ExtraTaal1!A21,IF(cal!$S$7=10,ExtraTaal2!A21,IF(cal!$S$7=11,ExtraTaal3!A21,)))))))))))","v":"Freedom height 20 cm width 19 cm length 110 cm (Type 2)"},{"$f":"IF($S$7=1,NL!B21,IF(cal!$S$7=2,EN!B21,IF(cal!$S$7=3,DE!B21,IF(cal!$S$7=4,FR!B21,IF(cal!$S$7=5,NR!B21,IF(cal!$S$7=6,SP!B21,IF(cal!$S$7=7,SW!B21,IF(cal!$S$7=8,TS!B21,IF(cal!$S$7=9,ExtraTaal1!B21,IF(cal!$S$7=10,ExtraTaal2!B21,IF(cal!$S$7=11,ExtraTaal3!B21,)))))))))))","v":0},{"$f":"IF($S$7=1,NL!C21,IF(cal!$S$7=2,EN!C21,IF(cal!$S$7=3,DE!C21,IF(cal!$S$7=4,FR!C21,IF(cal!$S$7=5,NR!C21,IF(cal!$S$7=6,SP!C21,IF(cal!$S$7=7,SW!C21,IF(cal!$S$7=8,TS!C21,IF(cal!$S$7=9,ExtraTaal1!C21,IF(cal!$S$7=10,ExtraTaal2!C21,IF(cal!$S$7=11,ExtraTaal3!C21,)))))))))))","v":0},{"$f":"IF($S$7=1,NL!D21,IF(cal!$S$7=2,EN!D21,IF(cal!$S$7=3,DE!D21,IF(cal!$S$7=4,FR!D21,IF(cal!$S$7=5,NR!D21,IF(cal!$S$7=6,SP!D21,IF(cal!$S$7=7,SW!D21,IF(cal!$S$7=8,TS!D21,IF(cal!$S$7=9,ExtraTaal1!D21,IF(cal!$S$7=10,ExtraTaal2!D21,IF(cal!$S$7=11,ExtraTaal3!D21,)))))))))))","v":0},{"$f":"IF($S$7=1,NL!E21,IF(cal!$S$7=2,EN!E21,IF(cal!$S$7=3,DE!E21,IF(cal!$S$7=4,FR!E21,IF(cal!$S$7=5,NR!E21,IF(cal!$S$7=6,SP!E21,IF(cal!$S$7=7,SW!E21,IF(cal!$S$7=8,TS!E21,IF(cal!$S$7=9,ExtraTaal1!E21,IF(cal!$S$7=10,ExtraTaal2!E21,IF(cal!$S$7=11,ExtraTaal3!E21,)))))))))))","v":0},{"$f":"IF($S$7=1,NL!F21,IF(cal!$S$7=2,EN!F21,IF(cal!$S$7=3,DE!F21,IF(cal!$S$7=4,FR!F21,IF(cal!$S$7=5,NR!F21,IF(cal!$S$7=6,SP!F21,IF(cal!$S$7=7,SW!F21,IF(cal!$S$7=8,TS!F21,IF(cal!$S$7=9,ExtraTaal1!F21,IF(cal!$S$7=10,ExtraTaal2!F21,IF(cal!$S$7=11,ExtraTaal3!F21,)))))))))))","v":0},{"$f":"IF($S$7=1,NL!G21,IF(cal!$S$7=2,EN!G21,IF(cal!$S$7=3,DE!G21,IF(cal!$S$7=4,FR!G21,IF(cal!$S$7=5,NR!G21,IF(cal!$S$7=6,SP!G21,IF(cal!$S$7=7,SW!G21,IF(cal!$S$7=8,TS!G21,IF(cal!$S$7=9,ExtraTaal1!G21,IF(cal!$S$7=10,ExtraTaal2!G21,IF(cal!$S$7=11,ExtraTaal3!G21,)))))))))))","v":0},{"$f":"IF($S$7=1,NL!H21,IF(cal!$S$7=2,EN!H21,IF(cal!$S$7=3,DE!H21,IF(cal!$S$7=4,FR!H21,IF(cal!$S$7=5,NR!H21,IF(cal!$S$7=6,SP!H21,IF(cal!$S$7=7,SW!H21,IF(cal!$S$7=8,TS!H21,IF(cal!$S$7=9,ExtraTaal1!H21,IF(cal!$S$7=10,ExtraTaal2!H21,IF(cal!$S$7=11,ExtraTaal3!H21,)))))))))))","v":0},{"$f":"IF($S$7=1,NL!I21,IF(cal!$S$7=2,EN!I21,IF(cal!$S$7=3,DE!I21,IF(cal!$S$7=4,FR!I21,IF(cal!$S$7=5,NR!I21,IF(cal!$S$7=6,SP!I21,IF(cal!$S$7=7,SW!I21,IF(cal!$S$7=8,TS!I21,IF(cal!$S$7=9,ExtraTaal1!I21,IF(cal!$S$7=10,ExtraTaal2!I21,IF(cal!$S$7=11,ExtraTaal3!I21,)))))))))))","v":0},{"$f":"IF($S$7=1,NL!J21,IF(cal!$S$7=2,EN!J21,IF(cal!$S$7=3,DE!J21,IF(cal!$S$7=4,FR!J21,IF(cal!$S$7=5,NR!J21,IF(cal!$S$7=6,SP!J21,IF(cal!$S$7=7,SW!J21,IF(cal!$S$7=8,TS!J21,IF(cal!$S$7=9,ExtraTaal1!J21,IF(cal!$S$7=10,ExtraTaal2!J21,IF(cal!$S$7=11,ExtraTaal3!J21,)))))))))))","v":0},{"$f":"IF($S$7=1,NL!K21,IF(cal!$S$7=2,EN!K21,IF(cal!$S$7=3,DE!K21,IF(cal!$S$7=4,FR!K21,IF(cal!$S$7=5,NR!K21,IF(cal!$S$7=6,SP!K21,IF(cal!$S$7=7,SW!K21,IF(cal!$S$7=8,TS!K21,IF(cal!$S$7=9,ExtraTaal1!K21,IF(cal!$S$7=10,ExtraTaal2!K21,IF(cal!$S$7=11,ExtraTaal3!K21,)))))))))))","v":0},{"$f":"IF($S$7=1,NL!L21,IF(cal!$S$7=2,EN!L21,IF(cal!$S$7=3,DE!L21,IF(cal!$S$7=4,FR!L21,IF(cal!$S$7=5,NR!L21,IF(cal!$S$7=6,SP!L21,IF(cal!$S$7=7,SW!L21,IF(cal!$S$7=8,TS!L21,IF(cal!$S$7=9,ExtraTaal1!L21,IF(cal!$S$7=10,ExtraTaal2!L21,IF(cal!$S$7=11,ExtraTaal3!L21,)))))))))))","v":0},{"$f":"IF($S$7=1,NL!M21,IF(cal!$S$7=2,EN!M21,IF(cal!$S$7=3,DE!M21,IF(cal!$S$7=4,FR!M21,IF(cal!$S$7=5,NR!M21,IF(cal!$S$7=6,SP!M21,IF(cal!$S$7=7,SW!M21,IF(cal!$S$7=8,TS!M21,IF(cal!$S$7=9,ExtraTaal1!M21,IF(cal!$S$7=10,ExtraTaal2!M21,IF(cal!$S$7=11,ExtraTaal3!M21,)))))))))))","v":0},{"$f":"IF($S$7=1,NL!N21,IF(cal!$S$7=2,EN!N21,IF(cal!$S$7=3,DE!N21,IF(cal!$S$7=4,FR!N21,IF(cal!$S$7=5,NR!N21,IF(cal!$S$7=6,SP!N21,IF(cal!$S$7=7,SW!N21,IF(cal!$S$7=8,TS!N21,IF(cal!$S$7=9,ExtraTaal1!N21,IF(cal!$S$7=10,ExtraTaal2!N21,IF(cal!$S$7=11,ExtraTaal3!N21,)))))))))))","v":0},{"$f":"IF($S$7=1,NL!O21,IF(cal!$S$7=2,EN!O21,IF(cal!$S$7=3,DE!O21,IF(cal!$S$7=4,FR!O21,IF(cal!$S$7=5,NR!O21,IF(cal!$S$7=6,SP!O21,IF(cal!$S$7=7,SW!O21,IF(cal!$S$7=8,TS!O21,IF(cal!$S$7=9,ExtraTaal1!O21,IF(cal!$S$7=10,ExtraTaal2!O21,IF(cal!$S$7=11,ExtraTaal3!O21,)))))))))))","v":0},"n-value",{"$f":"IF($X$16=1,S22,IF($X$16=2,S22,IF($X$16=3,U22,IF($X$16=4,U22,IF($X$16=5,V22,IF($X$16=6,V22,IF($X$16=7,T22,)))))))","v":0},null,null,null,null,null,{"$f":"IF($X$16=1,AE22,IF($X$16=2,AM22,IF($X$16=3,BL22,IF($X$16=4,BE22,IF($X$16=5,CA22,IF($X$16=6,BT22,IF($X$16=7,AX22,)))))))","v":"H"},{"$f":"IF($X$16=1,AF22,IF($X$16=2,AN22,IF($X$16=3,BM22,IF($X$16=4,BF22,IF($X$16=5,CB22,IF($X$16=6,BU22,IF($X$16=7,AY22,)))))))","v":20},{"$f":"IF($X$16=1,AG22,IF($X$16=2,AO22,IF($X$16=3,BN22,IF($X$16=4,BG22,IF($X$16=5,CC22,IF($X$16=6,BV22,IF($X$16=7,AZ22,)))))))","v":"B"},{"$f":"IF($X$16=1,AH22,IF($X$16=2,AP22,IF($X$16=3,BO22,IF($X$16=4,BH22,IF($X$16=5,CD22,IF($X$16=6,BW22,IF($X$16=7,BA22,)))))))","v":19},{"$f":"IF($X$16=1,AI22,IF($X$16=2,AQ22,IF($X$16=3,BP22,IF($X$16=4,BI22,IF($X$16=5,CE22,IF($X$16=6,BX22,IF($X$16=7,BB22,)))))))","v":"L"},{"$f":"IF($X$16=1,AJ22,IF($X$16=2,AR22,IF($X$16=3,BQ22,IF($X$16=4,BJ22,IF($X$16=5,CF22,IF($X$16=6,BY22,IF($X$16=7,BC22,)))))))","v":74},{"$f":"IF($X$16=1,AK22,IF($X$16=2,AS22,IF($X$16=3,BR22,IF($X$16=4,BK22,IF($X$16=5,CG22,IF($X$16=6,BZ22,IF($X$16=7,BD22,)))))))","v":0},"H",20,"B",19,"L",74]
[null,0.2,2,{"$f":"(X23*($T$11^$Q23))*Watts*CF_Altit","v":625.33100000000002},{"$f":"ROUND(((D23/Watts)/(($S$9-$S$10)*1.163))*$E$14,IF($X$4=1,0,IF($X$4=2,2)))","v":54},{"$f":"($Y$24*(E23/$E$14)^$Y$26)*$F$14","v":0.57982211611847723},{"$f":"(Z23*($W$11^R23))*Watts*CF_Altit","v":68.137999999999977},{"$f":"((G23/Watts)/(IF((237.3*LN((RH*EXP(17.27*(Tl_cool/(Tl_cool+237.3))))))/(17.27-LN((RH*EXP(17.27*(Tl_cool/(Tl_cool+237.3))))))<Tavg_cold,1,IF(1/(1+((2258*((0.622/(($Z$11/(1*611*EXP(17.27*(Tavg_cold/(Tavg_cold+237.3))))))-1)*1000-(0.622/(($Z$11/(RH*611*EXP(17.27*(Tl_cool/(Tl_cool+237.3))))))-1)*1000))/(1005*(Tavg_cold-Tl_cool))))*1.039+((-0.000729*$C23+0.001448)*(Tl_cool-Tavg_cold)+(0.016908*$C23-0.033574))*1.039>1,1,1/(1+((2258*((0.622/(($Z$11/(1*611*EXP(17.27*(Tavg_cold/(Tavg_cold+237.3))))))-1)*1000-(0.622/(($Z$11/(RH*611*EXP(17.27*(Tl_cool/(Tl_cool+237.3))))))-1)*1000))/(1005*(Tavg_cold-Tl_cool))))*1.039+((-0.000729*$C23+0.001448)*(Tl_cool-Tavg_cold)+(0.016908*$C23-0.033574))*1.039))))*Watts","v":68.137999999999977},{"$f":"ROUND(((H23/Watts)/((Tr_cool-Tv_cool)*1.163))*$I$14,IF($X$4=1,0,IF($X$4=2,2)))","v":29},{"$f":"($AA$24*(I23/$I$14)^$AA$26)*$J$14","v":0.18661789951710783},{"$f":"L23-8","v":15},{"$f":"AB23","v":23},0.6,{"$f":"AD23*Cubics","v":42},{"$f":"((($D23/Watts)/(((p_atm*0.028964)/(8.31447*(20+273.15)))*(($N23/3600)/Cubics)*(1005+1870*((0.622)/(((p_atm)/($E$12*Pvs_Heat_in))-1)))))+Tl_heat)*Celc1+Celc2","v":63.703523917838119},{"$f":"(Tl_cool-(($G23/Watts)/(1006*$N23*kgss)))*Celc1+Celc2","v":22.178100830234534},1,0.9,null,null,null,null,{"$f":"(H23-G23)/H23","v":0},{"$f":"IF($X$16=1,AE23,IF($X$16=2,AM23,IF($X$16=3,BL23,IF($X$16=4,BE23,IF($X$16=5,CA23,IF($X$16=6,BT23,IF($X$16=7,AX23,)))))))","v":625.33100000000002},{"$f":"IF($X$16=1,AF23,IF($X$16=2,AN23,IF($X$16=3,BM23,IF($X$16=4,BF23,IF($X$16=5,CB23,IF($X$16=6,BU23,IF($X$16=7,AY23,)))))))","v":"a"},{"$f":"IF($X$16=1,AG23,IF($X$16=2,AO23,IF($X$16=3,BN23,IF($X$16=4,BG23,IF($X$16=5,CC23,IF($X$16=6,BV23,IF($X$16=7,AZ23,)))))))","v":68.137999999999977},{"$f":"IF($X$16=1,AH23,IF($X$16=2,AP23,IF($X$16=3,BO23,IF($X$16=4,BH23,IF($X$16=5,CD23,IF($X$16=6,BW23,IF($X$16=7,BA23,)))))))","v":"a"},{"$f":"IF($X$16=1,AI23,IF($X$16=2,AQ23,IF($X$16=3,BP23,IF($X$16=4,BI23,IF($X$16=5,CE23,IF($X$16=6,BX23,IF($X$16=7,BB23,)))))))","v":23},{"$f":"IF($X$16=1,AJ23,IF($X$16=2,AR23,IF($X$16=3,BQ23,IF($X$16=4,BJ23,IF($X$16=5,CF23,IF($X$16=6,BY23,IF($X$16=7,BC23,)))))))","v":0.6},{"$f":"IF($X$16=1,AK23,IF($X$16=2,AS23,IF($X$16=3,BR23,IF($X$16=4,BK23,IF($X$16=5,CG23,IF($X$16=6,BZ23,IF($X$16=7,BD23,)))))))","v":42},625.33100000000002,"a",68.137999999999977,"a",23,0.6,42,null,null,null,null,null,null,null,null,null,{"$f":"(AG23*((((Tv_cool-Tr_cool)/LN((Tv_cool-Tl_cool)/(Tr_cool-Tl_cool)))/((16-18)/LN((16-27)/(18-27))))^S23))*$G$14","v":2.2788375555555518E-2},{"$f":"((AU23/$G$14)/(IF((237.3*LN((RH*EXP(17.27*(Tl_cool/(Tl_cool+237.3))))))/(17.27-LN((RH*EXP(17.27*(Tl_cool/(Tl_cool+237.3))))))<((Tv_cool+Tr_cool)/2),1,1/(1+((2258*((0.622/((p_atm/(1*611*EXP(17.27*(((Tv_cool+Tr_cool)/2)/(((Tv_cool+Tr_cool)/2)+237.3))))))-1)*1000-(0.622/((p_atm/(RH*611*EXP(17.27*(Tl_cool/(Tl_cool+237.3))))))-1)*1000))/(1005*(((Tv_cool+Tr_cool)/2)-Tl_cool))))+-((-0.000625*$C23+0.00625)*(Tl_cool-(Tv_cool+Tr_cool)/2)-(-0.000625*$C23+0.00625)*10))))*$H$14","v":68.137999999999977}]
[null,0.4,4,{"$f":"(X24*($T$11^$Q24))*Watts*CF_Altit","v":1122.079},{"$f":"ROUND(((D24/Watts)/(($S$9-$S$10)*1.163))*$E$14,IF($X$4=1,0,IF($X$4=2,2)))","v":96},{"$f":"($Y$24*(E24/$E$14)^$Y$26)*$F$14","v":1.6555802743700996},{"$f":"(Z24*($W$11^R24))*Watts*CF_Altit","v":148.36499999999995},{"$f":"((G24/Watts)/(IF((237.3*LN((RH*EXP(17.27*(Tl_cool/(Tl_cool+237.3))))))/(17.27-LN((RH*EXP(17.27*(Tl_cool/(Tl_cool+237.3))))))<Tavg_cold,1,IF(1/(1+((2258*((0.622/(($Z$11/(1*611*EXP(17.27*(Tavg_cold/(Tavg_cold+237.3))))))-1)*1000-(0.622/(($Z$11/(RH*611*EXP(17.27*(Tl_cool/(Tl_cool+237.3))))))-1)*1000))/(1005*(Tavg_cold-Tl_cool))))*1.039+((-0.000729*$C24+0.001448)*(Tl_cool-Tavg_cold)+(0.016908*$C24-0.033574))*1.039>1,1,1/(1+((2258*((0.622/(($Z$11/(1*611*EXP(17.27*(Tavg_cold/(Tavg_cold+237.3))))))-1)*1000-(0.622/(($Z$11/(RH*611*EXP(17.27*(Tl_cool/(Tl_cool+237.3))))))-1)*1000))/(1005*(Tavg_cold-Tl_cool))))*1.039+((-0.000729*$C24+0.001448)*(Tl_cool-Tavg_cold)+(0.016908*$C24-0.033574))*1.039))))*Watts","v":148.36499999999995},{"$f":"ROUND(((H24/Watts)/((Tr_cool-Tv_cool)*1.163))*$I$14,IF($X$4=1,0,IF($X$4=2,2)))","v":64},{"$f":"($AA$24*(I24/$I$14)^$AA$26)*$J$14","v":0.79039664488221262},{"$f":"L24-8","v":19},27,1.3,{"$f":"AD24*Cubics","v":75},{"$f":"((($D24/Watts)/(((p_atm*0.028964)/(8.31447*(20+273.15)))*(($N24/3600)/Cubics)*(1005+1870*((0.622)/(((p_atm)/($E$12*Pvs_Heat_in))-1)))))+Tl_heat)*Celc1+Celc2","v":63.91551289149934},{"$f":"(Tl_cool-(($G24/Watts)/(1006*$N24*kgss)))*Celc1+Celc2","v":21.120393915576305},1,0.9,null,null,null,null,{"$f":"(H24-G24)/H24","v":0},{"$f":"IF($X$16=1,AE24,IF($X$16=2,AM24,IF($X$16=3,BL24,IF($X$16=4,BE24,IF($X$16=5,CA24,IF($X$16=6,BT24,IF($X$16=7,AX24,)))))))","v":1122.079},{"$f":"IF($X$16=1,AF24,IF($X$16=2,AN24,IF($X$16=3,BM24,IF($X$16=4,BF24,IF($X$16=5,CB24,IF($X$16=6,BU24,IF($X$16=7,AY24,)))))))","v":4.0202009009986008E-4},{"$f":"IF($X$16=1,AG24,IF($X$16=2,AO24,IF($X$16=3,BN24,IF($X$16=4,BG24,IF($X$16=5,CC24,IF($X$16=6,BV24,IF($X$16=7,AZ24,)))))))","v":148.36499999999995},{"$f":"IF($X$16=1,AH24,IF($X$16=2,AP24,IF($X$16=3,BO24,IF($X$16=4,BH24,IF($X$16=5,CD24,IF($X$16=6,BW24,IF($X$16=7,BA24,)))))))","v":4.0202009009986008E-4},{"$f":"IF($X$16=1,AI24,IF($X$16=2,AQ24,IF($X$16=3,BP24,IF($X$16=4,BI24,IF($X$16=5,CE24,IF($X$16=6,BX24,IF($X$16=7,BB24,)))))))","v":27},{"$f":"IF($X$16=1,AJ24,IF($X$16=2,AR24,IF($X$16=3,BQ24,IF($X$16=4,BJ24,IF($X$16=5,CF24,IF($X$16=6,BY24,IF($X$16=7,BC24,)))))))","v":1.3},{"$f":"IF($X$16=1,AK24,IF($X$16=2,AS24,IF($X$16=3,BR24,IF($X$16=4,BK24,IF($X$16=5,CG24,IF($X$16=6,BZ24,IF($X$16=7,BD24,)))))))","v":75},1122.079,4.0202009009986008E-4,148.36499999999995,{"$f":"AF24","v":4.0202009009986008E-4},27,1.3,75,null,null,null,null,null,null,null,null,null,{"$f":"(AG24*((((Tv_cool-Tr_cool)/LN((Tv_cool-Tl_cool)/(Tr_cool-Tl_cool)))/((16-18)/LN((16-27)/(18-27))))^S24))*$G$14","v":4.9619849999999917E-2},{"$f":"((AU24/$G$14)/(IF((237.3*LN((RH*EXP(17.27*(Tl_cool/(Tl_cool+237.3))))))/(17.27-LN((RH*EXP(17.27*(Tl_cool/(Tl_cool+237.3))))))<((Tv_cool+Tr_cool)/2),1,1/(1+((2258*((0.622/((p_atm/(1*611*EXP(17.27*(((Tv_cool+Tr_cool)/2)/(((Tv_cool+Tr_cool)/2)+237.3))))))-1)*1000-(0.622/((p_atm/(RH*611*EXP(17.27*(Tl_cool/(Tl_cool+237.3))))))-1)*1000))/(1005*(((Tv_cool+Tr_cool)/2)-Tl_cool))))+-((-0.000625*$C24+0.00625)*(Tl_cool-(Tv_cool+Tr_cool)/2)-(-0.000625*$C24+0.00625)*10))))*$H$14","v":148.36499999999995}]
[null,0.6,6,{"$f":"(X25*($T$11^$Q25))*Watts*CF_Altit","v":1580.3620000000001},{"$f":"ROUND(((D25/Watts)/(($S$9-$S$10)*1.163))*$E$14,IF($X$4=1,0,IF($X$4=2,2)))","v":136},{"$f":"($Y$24*(E25/$E$14)^$Y$26)*$F$14","v":3.1245624319746947},{"$f":"(Z25*($W$11^R25))*Watts*CF_Altit","v":235.18599999999992},{"$f":"((G25/Watts)/(IF((237.3*LN((RH*EXP(17.27*(Tl_cool/(Tl_cool+237.3))))))/(17.27-LN((RH*EXP(17.27*(Tl_cool/(Tl_cool+237.3))))))<Tavg_cold,1,IF(1/(1+((2258*((0.622/(($Z$11/(1*611*EXP(17.27*(Tavg_cold/(Tavg_cold+237.3))))))-1)*1000-(0.622/(($Z$11/(RH*611*EXP(17.27*(Tl_cool/(Tl_cool+237.3))))))-1)*1000))/(1005*(Tavg_cold-Tl_cool))))*1.039+((-0.000729*$C25+0.001448)*(Tl_cool-Tavg_cold)+(0.016908*$C25-0.033574))*1.039>1,1,1/(1+((2258*((0.622/(($Z$11/(1*611*EXP(17.27*(Tavg_cold/(Tavg_cold+237.3))))))-1)*1000-(0.622/(($Z$11/(RH*611*EXP(17.27*(Tl_cool/(Tl_cool+237.3))))))-1)*1000))/(1005*(Tavg_cold-Tl_cool))))*1.039+((-0.000729*$C25+0.001448)*(Tl_cool-Tavg_cold)+(0.016908*$C25-0.033574))*1.039))))*Watts","v":235.18599999999992},{"$f":"ROUND(((H25/Watts)/((Tr_cool-Tv_cool)*1.163))*$I$14,IF($X$4=1,0,IF($X$4=2,2)))","v":101},{"$f":"($AA$24*(I25/$I$14)^$AA$26)*$J$14","v":1.816180542521981},{"$f":"L25-8","v":29},37,2.7,{"$f":"AD25*Cubics","v":98},{"$f":"((($D25/Watts)/(((p_atm*0.028964)/(8.31447*(20+273.15)))*(($N25/3600)/Cubics)*(1005+1870*((0.622)/(((p_atm)/($E$12*Pvs_Heat_in))-1)))))+Tl_heat)*Celc1+Celc2","v":67.335426106340364},{"$f":"(Tl_cool-(($G25/Watts)/(1006*$N25*kgss)))*Celc1+Celc2","v":19.867144546107305},1,0.9,null,null,null,null,{"$f":"(H25-G25)/H25","v":0},{"$f":"IF($X$16=1,AE25,IF($X$16=2,AM25,IF($X$16=3,BL25,IF($X$16=4,BE25,IF($X$16=5,CA25,IF($X$16=6,BT25,IF($X$16=7,AX25,)))))))","v":1580.3620000000001},{"$f":"IF($X$16=1,AF25,IF($X$16=2,AN25,IF($X$16=3,BM25,IF($X$16=4,BF25,IF($X$16=5,CB25,IF($X$16=6,BU25,IF($X$16=7,AY25,)))))))","v":"b"},{"$f":"IF($X$16=1,AG25,IF($X$16=2,AO25,IF($X$16=3,BN25,IF($X$16=4,BG25,IF($X$16=5,CC25,IF($X$16=6,BV25,IF($X$16=7,AZ25,)))))))","v":235.18599999999992},{"$f":"IF($X$16=1,AH25,IF($X$16=2,AP25,IF($X$16=3,BO25,IF($X$16=4,BH25,IF($X$16=5,CD25,IF($X$16=6,BW25,IF($X$16=7,BA25,)))))))","v":"b"},{"$f":"IF($X$16=1,AI25,IF($X$16=2,AQ25,IF($X$16=3,BP25,IF($X$16=4,BI25,IF($X$16=5,CE25,IF($X$16=6,BX25,IF($X$16=7,BB25,)))))))","v":37},{"$f":"IF($X$16=1,AJ25,IF($X$16=2,AR25,IF($X$16=3,BQ25,IF($X$16=4,BJ25,IF($X$16=5,CF25,IF($X$16=6,BY25,IF($X$16=7,BC25,)))))))","v":2.7},{"$f":"IF($X$16=1,AK25,IF($X$16=2,AS25,IF($X$16=3,BR25,IF($X$16=4,BK25,IF($X$16=5,CG25,IF($X$16=6,BZ25,IF($X$16=7,BD25,)))))))","v":98},1580.3620000000001,"b",235.18599999999992,"b",37,2.7,98,null,null,null,null,null,null,null,null,null,{"$f":"(AG25*((((Tv_cool-Tr_cool)/LN((Tv_cool-Tl_cool)/(Tr_cool-Tl_cool)))/((16-18)/LN((16-27)/(18-27))))^S25))*$G$14","v":7.865665111111099E-2},{"$f":"((AU25/$G$14)/(IF((237.3*LN((RH*EXP(17.27*(Tl_cool/(Tl_cool+237.3))))))/(17.27-LN((RH*EXP(17.27*(Tl_cool/(Tl_cool+237.3))))))<((Tv_cool+Tr_cool)/2),1,1/(1+((2258*((0.622/((p_atm/(1*611*EXP(17.27*(((Tv_cool+Tr_cool)/2)/(((Tv_cool+Tr_cool)/2)+237.3))))))-1)*1000-(0.622/((p_atm/(RH*611*EXP(17.27*(Tl_cool/(Tl_cool+237.3))))))-1)*1000))/(1005*(((Tv_cool+Tr_cool)/2)-Tl_cool))))+-((-0.000625*$C25+0.00625)*(Tl_cool-(Tv_cool+Tr_cool)/2)-(-0.000625*$C25+0.00625)*10))))*$H$14","v":235.18599999999995}]
[null,0.8,8,{"$f":"(X26*($T$11^$Q26))*Watts*CF_Altit","v":2015.566},{"$f":"ROUND(((D26/Watts)/(($S$9-$S$10)*1.163))*$E$14,IF($X$4=1,0,IF($X$4=2,2)))","v":173},{"$f":"($Y$24*(E26/$E$14)^$Y$26)*$F$14","v":4.8457355024670399},{"$f":"(Z26*($W$11^R26))*Watts*CF_Altit","v":325.30399999999986},{"$f":"((G26/Watts)/(IF((237.3*LN((RH*EXP(17.27*(Tl_cool/(Tl_cool+237.3))))))/(17.27-LN((RH*EXP(17.27*(Tl_cool/(Tl_cool+237.3))))))<Tavg_cold,1,IF(1/(1+((2258*((0.622/(($Z$11/(1*611*EXP(17.27*(Tavg_cold/(Tavg_cold+237.3))))))-1)*1000-(0.622/(($Z$11/(RH*611*EXP(17.27*(Tl_cool/(Tl_cool+237.3))))))-1)*1000))/(1005*(Tavg_cold-Tl_cool))))*1.039+((-0.000729*$C26+0.001448)*(Tl_cool-Tavg_cold)+(0.016908*$C26-0.033574))*1.039>1,1,1/(1+((2258*((0.622/(($Z$11/(1*611*EXP(17.27*(Tavg_cold/(Tavg_cold+237.3))))))-1)*1000-(0.622/(($Z$11/(RH*611*EXP(17.27*(Tl_cool/(Tl_cool+237.3))))))-1)*1000))/(1005*(Tavg_cold-Tl_cool))))*1.039+((-0.000729*$C26+0.001448)*(Tl_cool-Tavg_cold)+(0.016908*$C26-0.033574))*1.039))))*Watts","v":325.30399999999986},{"$f":"ROUND(((H26/Watts)/((Tr_cool-Tv_cool)*1.163))*$I$14,IF($X$4=1,0,IF($X$4=2,2)))","v":140},{"$f":"($AA$24*(I26/$I$14)^$AA$26)*$J$14","v":3.2941674880631955},{"$f":"L26-8","v":32},40,4.5999999999999996,{"$f":"AD26*Cubics","v":125},{"$f":"((($D26/Watts)/(((p_atm*0.028964)/(8.31447*(20+273.15)))*(($N26/3600)/Cubics)*(1005+1870*((0.622)/(((p_atm)/($E$12*Pvs_Heat_in))-1)))))+Tl_heat)*Celc1+Celc2","v":67.330685980221233},{"$f":"(Tl_cool-(($G26/Watts)/(1006*$N26*kgss)))*Celc1+Celc2","v":19.265051551158159},1,0.9,null,null,null,null,{"$f":"(H26-G26)/H26","v":0},{"$f":"IF($X$16=1,AE26,IF($X$16=2,AM26,IF($X$16=3,BL26,IF($X$16=4,BE26,IF($X$16=5,CA26,IF($X$16=6,BT26,IF($X$16=7,AX26,)))))))","v":2015.566},{"$f":"IF($X$16=1,AF26,IF($X$16=2,AN26,IF($X$16=3,BM26,IF($X$16=4,BF26,IF($X$16=5,CB26,IF($X$16=6,BU26,IF($X$16=7,AY26,)))))))","v":1.8235155847906248},{"$f":"IF($X$16=1,AG26,IF($X$16=2,AO26,IF($X$16=3,BN26,IF($X$16=4,BG26,IF($X$16=5,CC26,IF($X$16=6,BV26,IF($X$16=7,AZ26,)))))))","v":325.30399999999986},{"$f":"IF($X$16=1,AH26,IF($X$16=2,AP26,IF($X$16=3,BO26,IF($X$16=4,BH26,IF($X$16=5,CD26,IF($X$16=6,BW26,IF($X$16=7,BA26,)))))))","v":1.8235155847906248},{"$f":"IF($X$16=1,AI26,IF($X$16=2,AQ26,IF($X$16=3,BP26,IF($X$16=4,BI26,IF($X$16=5,CE26,IF($X$16=6,BX26,IF($X$16=7,BB26,)))))))","v":40},{"$f":"IF($X$16=1,AJ26,IF($X$16=2,AR26,IF($X$16=3,BQ26,IF($X$16=4,BJ26,IF($X$16=5,CF26,IF($X$16=6,BY26,IF($X$16=7,BC26,)))))))","v":4.5999999999999996},{"$f":"IF($X$16=1,AK26,IF($X$16=2,AS26,IF($X$16=3,BR26,IF($X$16=4,BK26,IF($X$16=5,CG26,IF($X$16=6,BZ26,IF($X$16=7,BD26,)))))))","v":125},2015.566,1.8235155847906248,325.30399999999986,{"$f":"AF26","v":1.8235155847906248},40,4.5999999999999996,125,null,null,null,null,null,null,null,null,null,{"$f":"(AG26*((((Tv_cool-Tr_cool)/LN((Tv_cool-Tl_cool)/(Tr_cool-Tl_cool)))/((16-18)/LN((16-27)/(18-27))))^S26))*$G$14","v":0.10879611555555536},{"$f":"((AU26/$G$14)/(IF((237.3*LN((RH*EXP(17.27*(Tl_cool/(Tl_cool+237.3))))))/(17.27-LN((RH*EXP(17.27*(Tl_cool/(Tl_cool+237.3))))))<((Tv_cool+Tr_cool)/2),1,1/(1+((2258*((0.622/((p_atm/(1*611*EXP(17.27*(((Tv_cool+Tr_cool)/2)/(((Tv_cool+Tr_cool)/2)+237.3))))))-1)*1000-(0.622/((p_atm/(RH*611*EXP(17.27*(Tl_cool/(Tl_cool+237.3))))))-1)*1000))/(1005*(((Tv_cool+Tr_cool)/2)-Tl_cool))))+-((-0.000625*$C26+0.00625)*(Tl_cool-(Tv_cool+Tr_cool)/2)-(-0.000625*$C26+0.00625)*10))))*$H$14","v":325.30399999999986}]
[null,1,10,{"$f":"(X27*($T$11^$Q27))*Watts*CF_Altit","v":2433.1860000000001},{"$f":"ROUND(((D27/Watts)/(($S$9-$S$10)*1.163))*$E$14,IF($X$4=1,0,IF($X$4=2,2)))","v":209},{"$f":"($Y$24*(E27/$E$14)^$Y$26)*$F$14","v":6.8402294226660212},{"$f":"(Z27*($W$11^R27))*Watts*CF_Altit","v":418.71899999999988},{"$f":"((G27/Watts)/(IF((237.3*LN((RH*EXP(17.27*(Tl_cool/(Tl_cool+237.3))))))/(17.27-LN((RH*EXP(17.27*(Tl_cool/(Tl_cool+237.3))))))<Tavg_cold,1,IF(1/(1+((2258*((0.622/(($Z$11/(1*611*EXP(17.27*(Tavg_cold/(Tavg_cold+237.3))))))-1)*1000-(0.622/(($Z$11/(RH*611*EXP(17.27*(Tl_cool/(Tl_cool+237.3))))))-1)*1000))/(1005*(Tavg_cold-Tl_cool))))*1.039+((-0.000729*$C27+0.001448)*(Tl_cool-Tavg_cold)+(0.016908*$C27-0.033574))*1.039>1,1,1/(1+((2258*((0.622/(($Z$11/(1*611*EXP(17.27*(Tavg_cold/(Tavg_cold+237.3))))))-1)*1000-(0.622/(($Z$11/(RH*611*EXP(17.27*(Tl_cool/(Tl_cool+237.3))))))-1)*1000))/(1005*(Tavg_cold-Tl_cool))))*1.039+((-0.000729*$C27+0.001448)*(Tl_cool-Tavg_cold)+(0.016908*$C27-0.033574))*1.039))))*Watts","v":418.71899999999988},{"$f":"ROUND(((H27/Watts)/((Tr_cool-Tv_cool)*1.163))*$I$14,IF($X$4=1,0,IF($X$4=2,2)))","v":180},{"$f":"($AA$24*(I27/$I$14)^$AA$26)*$J$14","v":5.2092154213954833},{"$f":"L27-8","v":37},45,7.1,{"$f":"AD27*Cubics","v":160},{"$f":"((($D27/Watts)/(((p_atm*0.028964)/(8.31447*(20+273.15)))*(($N27/3600)/Cubics)*(1005+1870*((0.622)/(((p_atm)/($E$12*Pvs_Heat_in))-1)))))+Tl_heat)*Celc1+Celc2","v":64.638656437521206},{"$f":"(Tl_cool-(($G27/Watts)/(1006*$N27*kgss)))*Celc1+Celc2","v":19.221771117481151},1,0.9,null,null,null,null,{"$f":"(H27-G27)/H27","v":0},{"$f":"IF($X$16=1,AE27,IF($X$16=2,AM27,IF($X$16=3,BL27,IF($X$16=4,BE27,IF($X$16=5,CA27,IF($X$16=6,BT27,IF($X$16=7,AX27,)))))))","v":2433.1860000000001},{"$f":"IF($X$16=1,AF27,IF($X$16=2,AN27,IF($X$16=3,BM27,IF($X$16=4,BF27,IF($X$16=5,CB27,IF($X$16=6,BU27,IF($X$16=7,AY27,)))))))","v":0},{"$f":"IF($X$16=1,AG27,IF($X$16=2,AO27,IF($X$16=3,BN27,IF($X$16=4,BG27,IF($X$16=5,CC27,IF($X$16=6,BV27,IF($X$16=7,AZ27,)))))))","v":418.71899999999988},{"$f":"IF($X$16=1,AH27,IF($X$16=2,AP27,IF($X$16=3,BO27,IF($X$16=4,BH27,IF($X$16=5,CD27,IF($X$16=6,BW27,IF($X$16=7,BA27,)))))))","v":0},{"$f":"IF($X$16=1,AI27,IF($X$16=2,AQ27,IF($X$16=3,BP27,IF($X$16=4,BI27,IF($X$16=5,CE27,IF($X$16=6,BX27,IF($X$16=7,BB27,)))))))","v":45},{"$f":"IF($X$16=1,AJ27,IF($X$16=2,AR27,IF($X$16=3,BQ27,IF($X$16=4,BJ27,IF($X$16=5,CF27,IF($X$16=6,BY27,IF($X$16=7,BC27,)))))))","v":7.1},{"$f":"IF($X$16=1,AK27,IF($X$16=2,AS27,IF($X$16=3,BR27,IF($X$16=4,BK27,IF($X$16=5,CG27,IF($X$16=6,BZ27,IF($X$16=7,BD27,)))))))","v":160},2433.1860000000001,null,418.71899999999988,null,45,7.1,160,null,null,null,null,null,null,null,null,null,{"$f":"(AG27*((((Tv_cool-Tr_cool)/LN((Tv_cool-Tl_cool)/(Tr_cool-Tl_cool)))/((16-18)/LN((16-27)/(18-27))))^S27))*$G$14","v":0.14003824333333312},{"$f":"((AU27/$G$14)/(IF((237.3*LN((RH*EXP(17.27*(Tl_cool/(Tl_cool+237.3))))))/(17.27-LN((RH*EXP(17.27*(Tl_cool/(Tl_cool+237.3))))))<((Tv_cool+Tr_cool)/2),1,1/(1+((2258*((0.622/((p_atm/(1*611*EXP(17.27*(((Tv_cool+Tr_cool)/2)/(((Tv_cool+Tr_cool)/2)+237.3))))))-1)*1000-(0.622/((p_atm/(RH*611*EXP(17.27*(Tl_cool/(Tl_cool+237.3))))))-1)*1000))/(1005*(((Tv_cool+Tr_cool)/2)-Tl_cool))))+-((-0.000625*$C27+0.00625)*(Tl_cool-(Tv_cool+Tr_cool)/2)-(-0.000625*$C27+0.00625)*10))))*$H$14","v":418.71899999999988}]
[null,{"$f":"IF($S$7=1,NL!A27,IF(cal!$S$7=2,EN!A27,IF(cal!$S$7=3,DE!A27,IF(cal!$S$7=4,FR!A27,IF(cal!$S$7=5,NR!A27,IF(cal!$S$7=6,SP!A27,IF(cal!$S$7=7,SW!A27,IF(cal!$S$7=8,TS!A27,IF(cal!$S$7=9,ExtraTaal1!A27,IF(cal!$S$7=10,ExtraTaal2!A27,IF(cal!$S$7=11,ExtraTaal3!A27,)))))))))))","v":"Freedom height 20 cm width 19 cm length 145 cm (Type 3)"},{"$f":"IF($S$7=1,NL!B27,IF(cal!$S$7=2,EN!B27,IF(cal!$S$7=3,DE!B27,IF(cal!$S$7=4,FR!B27,IF(cal!$S$7=5,NR!B27,IF(cal!$S$7=6,SP!B27,IF(cal!$S$7=7,SW!B27,IF(cal!$S$7=8,TS!B27,IF(cal!$S$7=9,ExtraTaal1!B27,IF(cal!$S$7=10,ExtraTaal2!B27,IF(cal!$S$7=11,ExtraTaal3!B27,)))))))))))","v":0},{"$f":"IF($S$7=1,NL!C27,IF(cal!$S$7=2,EN!C27,IF(cal!$S$7=3,DE!C27,IF(cal!$S$7=4,FR!C27,IF(cal!$S$7=5,NR!C27,IF(cal!$S$7=6,SP!C27,IF(cal!$S$7=7,SW!C27,IF(cal!$S$7=8,TS!C27,IF(cal!$S$7=9,ExtraTaal1!C27,IF(cal!$S$7=10,ExtraTaal2!C27,IF(cal!$S$7=11,ExtraTaal3!C27,)))))))))))","v":0},{"$f":"IF($S$7=1,NL!D27,IF(cal!$S$7=2,EN!D27,IF(cal!$S$7=3,DE!D27,IF(cal!$S$7=4,FR!D27,IF(cal!$S$7=5,NR!D27,IF(cal!$S$7=6,SP!D27,IF(cal!$S$7=7,SW!D27,IF(cal!$S$7=8,TS!D27,IF(cal!$S$7=9,ExtraTaal1!D27,IF(cal!$S$7=10,ExtraTaal2!D27,IF(cal!$S$7=11,ExtraTaal3!D27,)))))))))))","v":0},{"$f":"IF($S$7=1,NL!E27,IF(cal!$S$7=2,EN!E27,IF(cal!$S$7=3,DE!E27,IF(cal!$S$7=4,FR!E27,IF(cal!$S$7=5,NR!E27,IF(cal!$S$7=6,SP!E27,IF(cal!$S$7=7,SW!E27,IF(cal!$S$7=8,TS!E27,IF(cal!$S$7=9,ExtraTaal1!E27,IF(cal!$S$7=10,ExtraTaal2!E27,IF(cal!$S$7=11,ExtraTaal3!E27,)))))))))))","v":0},{"$f":"IF($S$7=1,NL!F27,IF(cal!$S$7=2,EN!F27,IF(cal!$S$7=3,DE!F27,IF(cal!$S$7=4,FR!F27,IF(cal!$S$7=5,NR!F27,IF(cal!$S$7=6,SP!F27,IF(cal!$S$7=7,SW!F27,IF(cal!$S$7=8,TS!F27,IF(cal!$S$7=9,ExtraTaal1!F27,IF(cal!$S$7=10,ExtraTaal2!F27,IF(cal!$S$7=11,ExtraTaal3!F27,)))))))))))","v":0},{"$f":"IF($S$7=1,NL!G27,IF(cal!$S$7=2,EN!G27,IF(cal!$S$7=3,DE!G27,IF(cal!$S$7=4,FR!G27,IF(cal!$S$7=5,NR!G27,IF(cal!$S$7=6,SP!G27,IF(cal!$S$7=7,SW!G27,IF(cal!$S$7=8,TS!G27,IF(cal!$S$7=9,ExtraTaal1!G27,IF(cal!$S$7=10,ExtraTaal2!G27,IF(cal!$S$7=11,ExtraTaal3!G27,)))))))))))","v":0},{"$f":"IF($S$7=1,NL!H27,IF(cal!$S$7=2,EN!H27,IF(cal!$S$7=3,DE!H27,IF(cal!$S$7=4,FR!H27,IF(cal!$S$7=5,NR!H27,IF(cal!$S$7=6,SP!H27,IF(cal!$S$7=7,SW!H27,IF(cal!$S$7=8,TS!H27,IF(cal!$S$7=9,ExtraTaal1!H27,IF(cal!$S$7=10,ExtraTaal2!H27,IF(cal!$S$7=11,ExtraTaal3!H27,)))))))))))","v":0},{"$f":"IF($S$7=1,NL!I27,IF(cal!$S$7=2,EN!I27,IF(cal!$S$7=3,DE!I27,IF(cal!$S$7=4,FR!I27,IF(cal!$S$7=5,NR!I27,IF(cal!$S$7=6,SP!I27,IF(cal!$S$7=7,SW!I27,IF(cal!$S$7=8,TS!I27,IF(cal!$S$7=9,ExtraTaal1!I27,IF(cal!$S$7=10,ExtraTaal2!I27,IF(cal!$S$7=11,ExtraTaal3!I27,)))))))))))","v":0},{"$f":"IF($S$7=1,NL!J27,IF(cal!$S$7=2,EN!J27,IF(cal!$S$7=3,DE!J27,IF(cal!$S$7=4,FR!J27,IF(cal!$S$7=5,NR!J27,IF(cal!$S$7=6,SP!J27,IF(cal!$S$7=7,SW!J27,IF(cal!$S$7=8,TS!J27,IF(cal!$S$7=9,ExtraTaal1!J27,IF(cal!$S$7=10,ExtraTaal2!J27,IF(cal!$S$7=11,ExtraTaal3!J27,)))))))))))","v":0},{"$f":"IF($S$7=1,NL!K27,IF(cal!$S$7=2,EN!K27,IF(cal!$S$7=3,DE!K27,IF(cal!$S$7=4,FR!K27,IF(cal!$S$7=5,NR!K27,IF(cal!$S$7=6,SP!K27,IF(cal!$S$7=7,SW!K27,IF(cal!$S$7=8,TS!K27,IF(cal!$S$7=9,ExtraTaal1!K27,IF(cal!$S$7=10,ExtraTaal2!K27,IF(cal!$S$7=11,ExtraTaal3!K27,)))))))))))","v":0},{"$f":"IF($S$7=1,NL!L27,IF(cal!$S$7=2,EN!L27,IF(cal!$S$7=3,DE!L27,IF(cal!$S$7=4,FR!L27,IF(cal!$S$7=5,NR!L27,IF(cal!$S$7=6,SP!L27,IF(cal!$S$7=7,SW!L27,IF(cal!$S$7=8,TS!L27,IF(cal!$S$7=9,ExtraTaal1!L27,IF(cal!$S$7=10,ExtraTaal2!L27,IF(cal!$S$7=11,ExtraTaal3!L27,)))))))))))","v":0},{"$f":"IF($S$7=1,NL!M27,IF(cal!$S$7=2,EN!M27,IF(cal!$S$7=3,DE!M27,IF(cal!$S$7=4,FR!M27,IF(cal!$S$7=5,NR!M27,IF(cal!$S$7=6,SP!M27,IF(cal!$S$7=7,SW!M27,IF(cal!$S$7=8,TS!M27,IF(cal!$S$7=9,ExtraTaal1!M27,IF(cal!$S$7=10,ExtraTaal2!M27,IF(cal!$S$7=11,ExtraTaal3!M27,)))))))))))","v":0},{"$f":"IF($S$7=1,NL!N27,IF(cal!$S$7=2,EN!N27,IF(cal!$S$7=3,DE!N27,IF(cal!$S$7=4,FR!N27,IF(cal!$S$7=5,NR!N27,IF(cal!$S$7=6,SP!N27,IF(cal!$S$7=7,SW!N27,IF(cal!$S$7=8,TS!N27,IF(cal!$S$7=9,ExtraTaal1!N27,IF(cal!$S$7=10,ExtraTaal2!N27,IF(cal!$S$7=11,ExtraTaal3!N27,)))))))))))","v":0},{"$f":"IF($S$7=1,NL!O27,IF(cal!$S$7=2,EN!O27,IF(cal!$S$7=3,DE!O27,IF(cal!$S$7=4,FR!O27,IF(cal!$S$7=5,NR!O27,IF(cal!$S$7=6,SP!O27,IF(cal!$S$7=7,SW!O27,IF(cal!$S$7=8,TS!O27,IF(cal!$S$7=9,ExtraTaal1!O27,IF(cal!$S$7=10,ExtraTaal2!O27,IF(cal!$S$7=11,ExtraTaal3!O27,)))))))))))","v":0},"n-value",0,null,null,null,null,null,{"$f":"IF($X$16=1,AE28,IF($X$16=2,AM28,IF($X$16=3,BL28,IF($X$16=4,BE28,IF($X$16=5,CA28,IF($X$16=6,BT28,IF($X$16=7,AX28,)))))))","v":"H"},{"$f":"IF($X$16=1,AF28,IF($X$16=2,AN28,IF($X$16=3,BM28,IF($X$16=4,BF28,IF($X$16=5,CB28,IF($X$16=6,BU28,IF($X$16=7,AY28,)))))))","v":20},{"$f":"IF($X$16=1,AG28,IF($X$16=2,AO28,IF($X$16=3,BN28,IF($X$16=4,BG28,IF($X$16=5,CC28,IF($X$16=6,BV28,IF($X$16=7,AZ28,)))))))","v":"B"},{"$f":"IF($X$16=1,AH28,IF($X$16=2,AP28,IF($X$16=3,BO28,IF($X$16=4,BH28,IF($X$16=5,CD28,IF($X$16=6,BW28,IF($X$16=7,BA28,)))))))","v":19},{"$f":"IF($X$16=1,AI28,IF($X$16=2,AQ28,IF($X$16=3,BP28,IF($X$16=4,BI28,IF($X$16=5,CE28,IF($X$16=6,BX28,IF($X$16=7,BB28,)))))))","v":"L"},{"$f":"IF($X$16=1,AJ28,IF($X$16=2,AR28,IF($X$16=3,BQ28,IF($X$16=4,BJ28,IF($X$16=5,CF28,IF($X$16=6,BY28,IF($X$16=7,BC28,)))))))","v":110},{"$f":"IF($X$16=1,AK28,IF($X$16=2,AS28,IF($X$16=3,BR28,IF($X$16=4,BK28,IF($X$16=5,CG28,IF($X$16=6,BZ28,IF($X$16=7,BD28,)))))))","v":0},"H",{"$f":"AF22","v":20},"B",{"$f":"AH22","v":19},"L",110]
[null,0.2,2,{"$f":"(X29*($T$11^$Q29))*Watts*CF_Altit","v":939.59399999999994},{"$f":"ROUND(((D29/Watts)/(($S$9-$S$10)*1.163))*$E$14,IF($X$4=1,0,IF($X$4=2,2)))","v":81},{"$f":"($Y$30*(E29/$E$14)^$Y$32)*$F$14","v":1.6934195841714439},{"$f":"(Z29*($W$11^R29))*Watts*CF_Altit","v":101.94699999999996},{"$f":"((G29/Watts)/(IF((237.3*LN((RH*EXP(17.27*(Tl_cool/(Tl_cool+237.3))))))/(17.27-LN((RH*EXP(17.27*(Tl_cool/(Tl_cool+237.3))))))<Tavg_cold,1,IF(1/(1+((2258*((0.622/(($Z$11/(1*611*EXP(17.27*(Tavg_cold/(Tavg_cold+237.3))))))-1)*1000-(0.622/(($Z$11/(RH*611*EXP(17.27*(Tl_cool/(Tl_cool+237.3))))))-1)*1000))/(1005*(Tavg_cold-Tl_cool))))*1.039+((-0.000729*$C29+0.001448)*(Tl_cool-Tavg_cold)+(0.016908*$C29-0.033574))*1.039>1,1,1/(1+((2258*((0.622/(($Z$11/(1*611*EXP(17.27*(Tavg_cold/(Tavg_cold+237.3))))))-1)*1000-(0.622/(($Z$11/(RH*611*EXP(17.27*(Tl_cool/(Tl_cool+237.3))))))-1)*1000))/(1005*(Tavg_cold-Tl_cool))))*1.039+((-0.000729*$C29+0.001448)*(Tl_cool-Tavg_cold)+(0.016908*$C29-0.033574))*1.039))))*Watts","v":101.94699999999996},{"$f":"ROUND(((H29/Watts)/((Tr_cool-Tv_cool)*1.163))*$I$14,IF($X$4=1,0,IF($X$4=2,2)))","v":44},{"$f":"($AA$30*(I29/$I$14)^$AA$32)*$J$14","v":0.55651127957010016},{"$f":"L29-8","v":16},{"$f":"AB29","v":24},1.1000000000000001,{"$f":"AD29*Cubics","v":66},{"$f":"((($D29/Watts)/(((p_atm*0.028964)/(8.31447*(20+273.15)))*(($N29/3600)/Cubics)*(1005+1870*((0.622)/(((p_atm)/($E$12*Pvs_Heat_in))-1)))))+Tl_heat)*Celc1+Celc2","v":61.788048244471582},{"$f":"(Tl_cool-(($G29/Watts)/(1006*$N29*kgss)))*Celc1+Celc2","v":22.408986731979006},1,0.9,null,null,null,null,{"$f":"(H29-G29)/H29","v":0},{"$f":"IF($X$16=1,AE29,IF($X$16=2,AM29,IF($X$16=3,BL29,IF($X$16=4,BE29,IF($X$16=5,CA29,IF($X$16=6,BT29,IF($X$16=7,AX29,)))))))","v":939.59399999999994},{"$f":"IF($X$16=1,AF29,IF($X$16=2,AN29,IF($X$16=3,BM29,IF($X$16=4,BF29,IF($X$16=5,CB29,IF($X$16=6,BU29,IF($X$16=7,AY29,)))))))","v":"a"},{"$f":"IF($X$16=1,AG29,IF($X$16=2,AO29,IF($X$16=3,BN29,IF($X$16=4,BG29,IF($X$16=5,CC29,IF($X$16=6,BV29,IF($X$16=7,AZ29,)))))))","v":101.94699999999996},{"$f":"IF($X$16=1,AH29,IF($X$16=2,AP29,IF($X$16=3,BO29,IF($X$16=4,BH29,IF($X$16=5,CD29,IF($X$16=6,BW29,IF($X$16=7,BA29,)))))))","v":"a"},{"$f":"IF($X$16=1,AI29,IF($X$16=2,AQ29,IF($X$16=3,BP29,IF($X$16=4,BI29,IF($X$16=5,CE29,IF($X$16=6,BX29,IF($X$16=7,BB29,)))))))","v":24},{"$f":"IF($X$16=1,AJ29,IF($X$16=2,AR29,IF($X$16=3,BQ29,IF($X$16=4,BJ29,IF($X$16=5,CF29,IF($X$16=6,BY29,IF($X$16=7,BC29,)))))))","v":1.1000000000000001},{"$f":"IF($X$16=1,AK29,IF($X$16=2,AS29,IF($X$16=3,BR29,IF($X$16=4,BK29,IF($X$16=5,CG29,IF($X$16=6,BZ29,IF($X$16=7,BD29,)))))))","v":66},939.59399999999994,"a",101.94699999999996,"a",24,1.1000000000000001,66,null,null,null,null,null,null,null,null,null,{"$f":"(AG29*((((Tv_cool-Tr_cool)/LN((Tv_cool-Tl_cool)/(Tr_cool-Tl_cool)))/((16-18)/LN((16-27)/(18-27))))^S29))*$G$14","v":3.4095607777777717E-2},{"$f":"((AU29/$G$14)/(IF((237.3*LN((RH*EXP(17.27*(Tl_cool/(Tl_cool+237.3))))))/(17.27-LN((RH*EXP(17.27*(Tl_cool/(Tl_cool+237.3))))))<((Tv_cool+Tr_cool)/2),1,1/(1+((2258*((0.622/((p_atm/(1*611*EXP(17.27*(((Tv_cool+Tr_cool)/2)/(((Tv_cool+Tr_cool)/2)+237.3))))))-1)*1000-(0.622/((p_atm/(RH*611*EXP(17.27*(Tl_cool/(Tl_cool+237.3))))))-1)*1000))/(1005*(((Tv_cool+Tr_cool)/2)-Tl_cool))))+-((-0.000625*$C29+0.00625)*(Tl_cool-(Tv_cool+Tr_cool)/2)-(-0.000625*$C29+0.00625)*10))))*$H$14","v":101.94699999999995}]
[null,0.4,4,{"$f":"(X30*($T$11^$Q30))*Watts*CF_Altit","v":1686.8549999999998},{"$f":"ROUND(((D30/Watts)/(($S$9-$S$10)*1.163))*$E$14,IF($X$4=1,0,IF($X$4=2,2)))","v":145},{"$f":"($Y$30*(E30/$E$14)^$Y$32)*$F$14","v":4.8966677742137579},{"$f":"(Z30*($W$11^R30))*Watts*CF_Altit","v":222.81199999999993},{"$f":"((G30/Watts)/(IF((237.3*LN((RH*EXP(17.27*(Tl_cool/(Tl_cool+237.3))))))/(17.27-LN((RH*EXP(17.27*(Tl_cool/(Tl_cool+237.3))))))<Tavg_cold,1,IF(1/(1+((2258*((0.622/(($Z$11/(1*611*EXP(17.27*(Tavg_cold/(Tavg_cold+237.3))))))-1)*1000-(0.622/(($Z$11/(RH*611*EXP(17.27*(Tl_cool/(Tl_cool+237.3))))))-1)*1000))/(1005*(Tavg_cold-Tl_cool))))*1.039+((-0.000729*$C30+0.001448)*(Tl_cool-Tavg_cold)+(0.016908*$C30-0.033574))*1.039>1,1,1/(1+((2258*((0.622/(($Z$11/(1*611*EXP(17.27*(Tavg_cold/(Tavg_cold+237.3))))))-1)*1000-(0.622/(($Z$11/(RH*611*EXP(17.27*(Tl_cool/(Tl_cool+237.3))))))-1)*1000))/(1005*(Tavg_cold-Tl_cool))))*1.039+((-0.000729*$C30+0.001448)*(Tl_cool-Tavg_cold)+(0.016908*$C30-0.033574))*1.039))))*Watts","v":222.81199999999993},{"$f":"ROUND(((H30/Watts)/((Tr_cool-Tv_cool)*1.163))*$I$14,IF($X$4=1,0,IF($X$4=2,2)))","v":96},{"$f":"($AA$30*(I30/$I$14)^$AA$32)*$J$14","v":2.3084203249560846},{"$f":"L30-8","v":20},28,2.1,{"$f":"AD30*Cubics","v":112},{"$f":"((($D30/Watts)/(((p_atm*0.028964)/(8.31447*(20+273.15)))*(($N30/3600)/Cubics)*(1005+1870*((0.622)/(((p_atm)/($E$12*Pvs_Heat_in))-1)))))+Tl_heat)*Celc1+Celc2","v":64.209491356432522},{"$f":"(Tl_cool-(($G30/Watts)/(1006*$N30*kgss)))*Celc1+Celc2","v":21.087126505324949},1,0.9,null,null,null,null,{"$f":"(H30-G30)/H30","v":0},{"$f":"IF($X$16=1,AE30,IF($X$16=2,AM30,IF($X$16=3,BL30,IF($X$16=4,BE30,IF($X$16=5,CA30,IF($X$16=6,BT30,IF($X$16=7,AX30,)))))))","v":1686.8549999999998},{"$f":"IF($X$16=1,AF30,IF($X$16=2,AN30,IF($X$16=3,BM30,IF($X$16=4,BF30,IF($X$16=5,CB30,IF($X$16=6,BU30,IF($X$16=7,AY30,)))))))","v":5.6054747775989447E-4},{"$f":"IF($X$16=1,AG30,IF($X$16=2,AO30,IF($X$16=3,BN30,IF($X$16=4,BG30,IF($X$16=5,CC30,IF($X$16=6,BV30,IF($X$16=7,AZ30,)))))))","v":222.81199999999993},{"$f":"IF($X$16=1,AH30,IF($X$16=2,AP30,IF($X$16=3,BO30,IF($X$16=4,BH30,IF($X$16=5,CD30,IF($X$16=6,BW30,IF($X$16=7,BA30,)))))))","v":5.6054747775989447E-4},{"$f":"IF($X$16=1,AI30,IF($X$16=2,AQ30,IF($X$16=3,BP30,IF($X$16=4,BI30,IF($X$16=5,CE30,IF($X$16=6,BX30,IF($X$16=7,BB30,)))))))","v":28},{"$f":"IF($X$16=1,AJ30,IF($X$16=2,AR30,IF($X$16=3,BQ30,IF($X$16=4,BJ30,IF($X$16=5,CF30,IF($X$16=6,BY30,IF($X$16=7,BC30,)))))))","v":2.1},{"$f":"IF($X$16=1,AK30,IF($X$16=2,AS30,IF($X$16=3,BR30,IF($X$16=4,BK30,IF($X$16=5,CG30,IF($X$16=6,BZ30,IF($X$16=7,BD30,)))))))","v":112},1686.8549999999998,5.6054747775989447E-4,222.81199999999993,{"$f":"AF30","v":5.6054747775989447E-4},28,2.1,112,null,null,null,null,null,null,null,null,null,{"$f":"(AG30*((((Tv_cool-Tr_cool)/LN((Tv_cool-Tl_cool)/(Tr_cool-Tl_cool)))/((16-18)/LN((16-27)/(18-27))))^S30))*$G$14","v":7.4518235555555437E-2},{"$f":"((AU30/$G$14)/(IF((237.3*LN((RH*EXP(17.27*(Tl_cool/(Tl_cool+237.3))))))/(17.27-LN((RH*EXP(17.27*(Tl_cool/(Tl_cool+237.3))))))<((Tv_cool+Tr_cool)/2),1,1/(1+((2258*((0.622/((p_atm/(1*611*EXP(17.27*(((Tv_cool+Tr_cool)/2)/(((Tv_cool+Tr_cool)/2)+237.3))))))-1)*1000-(0.622/((p_atm/(RH*611*EXP(17.27*(Tl_cool/(Tl_cool+237.3))))))-1)*1000))/(1005*(((Tv_cool+Tr_cool)/2)-Tl_cool))))+-((-0.000625*$C30+0.00625)*(Tl_cool-(Tv_cool+Tr_cool)/2)-(-0.000625*$C30+0.00625)*10))))*$H$14","v":222.81199999999993}]
[null,0.6,6,{"$f":"(X31*($T$11^$Q31))*Watts*CF_Altit","v":2375.2599999999998},{"$f":"ROUND(((D31/Watts)/(($S$9-$S$10)*1.163))*$E$14,IF($X$4=1,0,IF($X$4=2,2)))","v":204},{"$f":"($Y$30*(E31/$E$14)^$Y$32)*$F$14","v":9.1255491420253509},{"$f":"(Z31*($W$11^R31))*Watts*CF_Altit","v":353.13599999999991},{"$f":"((G31/Watts)/(IF((237.3*LN((RH*EXP(17.27*(Tl_cool/(Tl_cool+237.3))))))/(17.27-LN((RH*EXP(17.27*(Tl_cool/(Tl_cool+237.3))))))<Tavg_cold,1,IF(1/(1+((2258*((0.622/(($Z$11/(1*611*EXP(17.27*(Tavg_cold/(Tavg_cold+237.3))))))-1)*1000-(0.622/(($Z$11/(RH*611*EXP(17.27*(Tl_cool/(Tl_cool+237.3))))))-1)*1000))/(1005*(Tavg_cold-Tl_cool))))*1.039+((-0.000729*$C31+0.001448)*(Tl_cool-Tavg_cold)+(0.016908*$C31-0.033574))*1.039>1,1,1/(1+((2258*((0.622/(($Z$11/(1*611*EXP(17.27*(Tavg_cold/(Tavg_cold+237.3))))))-1)*1000-(0.622/(($Z$11/(RH*611*EXP(17.27*(Tl_cool/(Tl_cool+237.3))))))-1)*1000))/(1005*(Tavg_cold-Tl_cool))))*1.039+((-0.000729*$C31+0.001448)*(Tl_cool-Tavg_cold)+(0.016908*$C31-0.033574))*1.039))))*Watts","v":353.13599999999991},{"$f":"ROUND(((H31/Watts)/((Tr_cool-Tv_cool)*1.163))*$I$14,IF($X$4=1,0,IF($X$4=2,2)))","v":152},{"$f":"($AA$30*(I31/$I$14)^$AA$32)*$J$14","v":5.3362748341298465},{"$f":"L31-8","v":30},38,4,{"$f":"AD31*Cubics","v":150},{"$f":"((($D31/Watts)/(((p_atm*0.028964)/(8.31447*(20+273.15)))*(($N31/3600)/Cubics)*(1005+1870*((0.622)/(((p_atm)/($E$12*Pvs_Heat_in))-1)))))+Tl_heat)*Celc1+Celc2","v":66.481023684902183},{"$f":"(Tl_cool-(($G31/Watts)/(1006*$N31*kgss)))*Celc1+Celc2","v":20.002727819131714},1,0.9,null,null,null,null,{"$f":"(H31-G31)/H31","v":0},{"$f":"IF($X$16=1,AE31,IF($X$16=2,AM31,IF($X$16=3,BL31,IF($X$16=4,BE31,IF($X$16=5,CA31,IF($X$16=6,BT31,IF($X$16=7,AX31,)))))))","v":2375.2599999999998},{"$f":"IF($X$16=1,AF31,IF($X$16=2,AN31,IF($X$16=3,BM31,IF($X$16=4,BF31,IF($X$16=5,CB31,IF($X$16=6,BU31,IF($X$16=7,AY31,)))))))","v":"b"},{"$f":"IF($X$16=1,AG31,IF($X$16=2,AO31,IF($X$16=3,BN31,IF($X$16=4,BG31,IF($X$16=5,CC31,IF($X$16=6,BV31,IF($X$16=7,AZ31,)))))))","v":353.13599999999991},{"$f":"IF($X$16=1,AH31,IF($X$16=2,AP31,IF($X$16=3,BO31,IF($X$16=4,BH31,IF($X$16=5,CD31,IF($X$16=6,BW31,IF($X$16=7,BA31,)))))))","v":"b"},{"$f":"IF($X$16=1,AI31,IF($X$16=2,AQ31,IF($X$16=3,BP31,IF($X$16=4,BI31,IF($X$16=5,CE31,IF($X$16=6,BX31,IF($X$16=7,BB31,)))))))","v":38},{"$f":"IF($X$16=1,AJ31,IF($X$16=2,AR31,IF($X$16=3,BQ31,IF($X$16=4,BJ31,IF($X$16=5,CF31,IF($X$16=6,BY31,IF($X$16=7,BC31,)))))))","v":4},{"$f":"IF($X$16=1,AK31,IF($X$16=2,AS31,IF($X$16=3,BR31,IF($X$16=4,BK31,IF($X$16=5,CG31,IF($X$16=6,BZ31,IF($X$16=7,BD31,)))))))","v":150},2375.2599999999998,"b",353.13599999999991,"b",38,4,150,null,null,null,null,null,null,null,null,null,{"$f":"(AG31*((((Tv_cool-Tr_cool)/LN((Tv_cool-Tl_cool)/(Tr_cool-Tl_cool)))/((16-18)/LN((16-27)/(18-27))))^S31))*$G$14","v":0.11810437333333315},{"$f":"((AU31/$G$14)/(IF((237.3*LN((RH*EXP(17.27*(Tl_cool/(Tl_cool+237.3))))))/(17.27-LN((RH*EXP(17.27*(Tl_cool/(Tl_cool+237.3))))))<((Tv_cool+Tr_cool)/2),1,1/(1+((2258*((0.622/((p_atm/(1*611*EXP(17.27*(((Tv_cool+Tr_cool)/2)/(((Tv_cool+Tr_cool)/2)+237.3))))))-1)*1000-(0.622/((p_atm/(RH*611*EXP(17.27*(Tl_cool/(Tl_cool+237.3))))))-1)*1000))/(1005*(((Tv_cool+Tr_cool)/2)-Tl_cool))))+-((-0.000625*$C31+0.00625)*(Tl_cool-(Tv_cool+Tr_cool)/2)-(-0.000625*$C31+0.00625)*10))))*$H$14","v":353.13599999999991}]
[null,0.8,8,{"$f":"(X32*($T$11^$Q32))*Watts*CF_Altit","v":3027.9309999999996},{"$f":"ROUND(((D32/Watts)/(($S$9-$S$10)*1.163))*$E$14,IF($X$4=1,0,IF($X$4=2,2)))","v":260},{"$f":"($Y$30*(E32/$E$14)^$Y$32)*$F$14","v":14.202144910847871},{"$f":"(Z32*($W$11^R32))*Watts*CF_Altit","v":488.7149999999998},{"$f":"((G32/Watts)/(IF((237.3*LN((RH*EXP(17.27*(Tl_cool/(Tl_cool+237.3))))))/(17.27-LN((RH*EXP(17.27*(Tl_cool/(Tl_cool+237.3))))))<Tavg_cold,1,IF(1/(1+((2258*((0.622/(($Z$11/(1*611*EXP(17.27*(Tavg_cold/(Tavg_cold+237.3))))))-1)*1000-(0.622/(($Z$11/(RH*611*EXP(17.27*(Tl_cool/(Tl_cool+237.3))))))-1)*1000))/(1005*(Tavg_cold-Tl_cool))))*1.039+((-0.000729*$C32+0.001448)*(Tl_cool-Tavg_cold)+(0.016908*$C32-0.033574))*1.039>1,1,1/(1+((2258*((0.622/(($Z$11/(1*611*EXP(17.27*(Tavg_cold/(Tavg_cold+237.3))))))-1)*1000-(0.622/(($Z$11/(RH*611*EXP(17.27*(Tl_cool/(Tl_cool+237.3))))))-1)*1000))/(1005*(Tavg_cold-Tl_cool))))*1.039+((-0.000729*$C32+0.001448)*(Tl_cool-Tavg_cold)+(0.016908*$C32-0.033574))*1.039))))*Watts","v":488.7149999999998},{"$f":"ROUND(((H32/Watts)/((Tr_cool-Tv_cool)*1.163))*$I$14,IF($X$4=1,0,IF($X$4=2,2)))","v":210},{"$f":"($AA$30*(I32/$I$14)^$AA$32)*$J$14","v":9.6208950689407811},{"$f":"L32-8","v":35},43,6.6,{"$f":"AD32*Cubics","v":193},{"$f":"((($D32/Watts)/(((p_atm*0.028964)/(8.31447*(20+273.15)))*(($N32/3600)/Cubics)*(1005+1870*((0.622)/(((p_atm)/($E$12*Pvs_Heat_in))-1)))))+Tl_heat)*Celc1+Celc2","v":66.051571336215503},{"$f":"(Tl_cool-(($G32/Watts)/(1006*$N32*kgss)))*Celc1+Celc2","v":19.47378894313529},1,0.9,null,null,null,null,{"$f":"(H32-G32)/H32","v":0},{"$f":"IF($X$16=1,AE32,IF($X$16=2,AM32,IF($X$16=3,BL32,IF($X$16=4,BE32,IF($X$16=5,CA32,IF($X$16=6,BT32,IF($X$16=7,AX32,)))))))","v":3027.9309999999996},{"$f":"IF($X$16=1,AF32,IF($X$16=2,AN32,IF($X$16=3,BM32,IF($X$16=4,BF32,IF($X$16=5,CB32,IF($X$16=6,BU32,IF($X$16=7,AY32,)))))))","v":1.8235155847906248},{"$f":"IF($X$16=1,AG32,IF($X$16=2,AO32,IF($X$16=3,BN32,IF($X$16=4,BG32,IF($X$16=5,CC32,IF($X$16=6,BV32,IF($X$16=7,AZ32,)))))))","v":488.7149999999998},{"$f":"IF($X$16=1,AH32,IF($X$16=2,AP32,IF($X$16=3,BO32,IF($X$16=4,BH32,IF($X$16=5,CD32,IF($X$16=6,BW32,IF($X$16=7,BA32,)))))))","v":1.8235155847906248},{"$f":"IF($X$16=1,AI32,IF($X$16=2,AQ32,IF($X$16=3,BP32,IF($X$16=4,BI32,IF($X$16=5,CE32,IF($X$16=6,BX32,IF($X$16=7,BB32,)))))))","v":43},{"$f":"IF($X$16=1,AJ32,IF($X$16=2,AR32,IF($X$16=3,BQ32,IF($X$16=4,BJ32,IF($X$16=5,CF32,IF($X$16=6,BY32,IF($X$16=7,BC32,)))))))","v":6.6},{"$f":"IF($X$16=1,AK32,IF($X$16=2,AS32,IF($X$16=3,BR32,IF($X$16=4,BK32,IF($X$16=5,CG32,IF($X$16=6,BZ32,IF($X$16=7,BD32,)))))))","v":193},3027.9309999999996,1.8235155847906248,488.7149999999998,{"$f":"AF32","v":1.8235155847906248},43,6.6,193,null,null,null,null,null,null,null,null,null,{"$f":"(AG32*((((Tv_cool-Tr_cool)/LN((Tv_cool-Tl_cool)/(Tr_cool-Tl_cool)))/((16-18)/LN((16-27)/(18-27))))^S32))*$G$14","v":0.16344801666666639},{"$f":"((AU32/$G$14)/(IF((237.3*LN((RH*EXP(17.27*(Tl_cool/(Tl_cool+237.3))))))/(17.27-LN((RH*EXP(17.27*(Tl_cool/(Tl_cool+237.3))))))<((Tv_cool+Tr_cool)/2),1,1/(1+((2258*((0.622/((p_atm/(1*611*EXP(17.27*(((Tv_cool+Tr_cool)/2)/(((Tv_cool+Tr_cool)/2)+237.3))))))-1)*1000-(0.622/((p_atm/(RH*611*EXP(17.27*(Tl_cool/(Tl_cool+237.3))))))-1)*1000))/(1005*(((Tv_cool+Tr_cool)/2)-Tl_cool))))+-((-0.000625*$C32+0.00625)*(Tl_cool-(Tv_cool+Tr_cool)/2)-(-0.000625*$C32+0.00625)*10))))*$H$14","v":488.7149999999998}]
[null,1,10,{"$f":"(X33*($T$11^$Q33))*Watts*CF_Altit","v":3656.4289999999996},{"$f":"ROUND(((D33/Watts)/(($S$9-$S$10)*1.163))*$E$14,IF($X$4=1,0,IF($X$4=2,2)))","v":314},{"$f":"($Y$30*(E33/$E$14)^$Y$32)*$F$14","v":20.035608188600499},{"$f":"(Z33*($W$11^R33))*Watts*CF_Altit","v":628.49799999999971},{"$f":"((G33/Watts)/(IF((237.3*LN((RH*EXP(17.27*(Tl_cool/(Tl_cool+237.3))))))/(17.27-LN((RH*EXP(17.27*(Tl_cool/(Tl_cool+237.3))))))<Tavg_cold,1,IF(1/(1+((2258*((0.622/(($Z$11/(1*611*EXP(17.27*(Tavg_cold/(Tavg_cold+237.3))))))-1)*1000-(0.622/(($Z$11/(RH*611*EXP(17.27*(Tl_cool/(Tl_cool+237.3))))))-1)*1000))/(1005*(Tavg_cold-Tl_cool))))*1.039+((-0.000729*$C33+0.001448)*(Tl_cool-Tavg_cold)+(0.016908*$C33-0.033574))*1.039>1,1,1/(1+((2258*((0.622/(($Z$11/(1*611*EXP(17.27*(Tavg_cold/(Tavg_cold+237.3))))))-1)*1000-(0.622/(($Z$11/(RH*611*EXP(17.27*(Tl_cool/(Tl_cool+237.3))))))-1)*1000))/(1005*(Tavg_cold-Tl_cool))))*1.039+((-0.000729*$C33+0.001448)*(Tl_cool-Tavg_cold)+(0.016908*$C33-0.033574))*1.039))))*Watts","v":628.49799999999971},{"$f":"ROUND(((H33/Watts)/((Tr_cool-Tv_cool)*1.163))*$I$14,IF($X$4=1,0,IF($X$4=2,2)))","v":270},{"$f":"($AA$30*(I33/$I$14)^$AA$32)*$J$14","v":15.213954707026911},{"$f":"L33-8","v":39},47,10.1,{"$f":"AD33*Cubics","v":239},{"$f":"((($D33/Watts)/(((p_atm*0.028964)/(8.31447*(20+273.15)))*(($N33/3600)/Cubics)*(1005+1870*((0.622)/(((p_atm)/($E$12*Pvs_Heat_in))-1)))))+Tl_heat)*Celc1+Celc2","v":64.907102251205615},{"$f":"(Tl_cool-(($G33/Watts)/(1006*$N33*kgss)))*Celc1+Celc2","v":19.184009331740821},1,0.9,null,null,null,null,{"$f":"(H33-G33)/H33","v":0},{"$f":"IF($X$16=1,AE33,IF($X$16=2,AM33,IF($X$16=3,BL33,IF($X$16=4,BE33,IF($X$16=5,CA33,IF($X$16=6,BT33,IF($X$16=7,AX33,)))))))","v":3656.4289999999996},{"$f":"IF($X$16=1,AF33,IF($X$16=2,AN33,IF($X$16=3,BM33,IF($X$16=4,BF33,IF($X$16=5,CB33,IF($X$16=6,BU33,IF($X$16=7,AY33,)))))))","v":0},{"$f":"IF($X$16=1,AG33,IF($X$16=2,AO33,IF($X$16=3,BN33,IF($X$16=4,BG33,IF($X$16=5,CC33,IF($X$16=6,BV33,IF($X$16=7,AZ33,)))))))","v":628.49799999999971},{"$f":"IF($X$16=1,AH33,IF($X$16=2,AP33,IF($X$16=3,BO33,IF($X$16=4,BH33,IF($X$16=5,CD33,IF($X$16=6,BW33,IF($X$16=7,BA33,)))))))","v":0},{"$f":"IF($X$16=1,AI33,IF($X$16=2,AQ33,IF($X$16=3,BP33,IF($X$16=4,BI33,IF($X$16=5,CE33,IF($X$16=6,BX33,IF($X$16=7,BB33,)))))))","v":47},{"$f":"IF($X$16=1,AJ33,IF($X$16=2,AR33,IF($X$16=3,BQ33,IF($X$16=4,BJ33,IF($X$16=5,CF33,IF($X$16=6,BY33,IF($X$16=7,BC33,)))))))","v":10.1},{"$f":"IF($X$16=1,AK33,IF($X$16=2,AS33,IF($X$16=3,BR33,IF($X$16=4,BK33,IF($X$16=5,CG33,IF($X$16=6,BZ33,IF($X$16=7,BD33,)))))))","v":239},3656.4289999999996,null,628.49799999999971,null,47,10.1,239,null,null,null,null,null,null,null,null,null,{"$f":"(AG33*((((Tv_cool-Tr_cool)/LN((Tv_cool-Tl_cool)/(Tr_cool-Tl_cool)))/((16-18)/LN((16-27)/(18-27))))^S33))*$G$14","v":0.21019766444444407},{"$f":"((AU33/$G$14)/(IF((237.3*LN((RH*EXP(17.27*(Tl_cool/(Tl_cool+237.3))))))/(17.27-LN((RH*EXP(17.27*(Tl_cool/(Tl_cool+237.3))))))<((Tv_cool+Tr_cool)/2),1,1/(1+((2258*((0.622/((p_atm/(1*611*EXP(17.27*(((Tv_cool+Tr_cool)/2)/(((Tv_cool+Tr_cool)/2)+237.3))))))-1)*1000-(0.622/((p_atm/(RH*611*EXP(17.27*(Tl_cool/(Tl_cool+237.3))))))-1)*1000))/(1005*(((Tv_cool+Tr_cool)/2)-Tl_cool))))+-((-0.000625*$C33+0.00625)*(Tl_cool-(Tv_cool+Tr_cool)/2)-(-0.000625*$C33+0.00625)*10))))*$H$14","v":628.49799999999971}]
[null,{"$f":"IF($S$7=1,NL!A33,IF(cal!$S$7=2,EN!A33,IF(cal!$S$7=3,DE!A33,IF(cal!$S$7=4,FR!A33,IF(cal!$S$7=5,NR!A33,IF(cal!$S$7=6,SP!A33,IF(cal!$S$7=7,SW!A33,IF(cal!$S$7=8,TS!A33,IF(cal!$S$7=9,ExtraTaal1!A33,IF(cal!$S$7=10,ExtraTaal2!A33,IF(cal!$S$7=11,ExtraTaal3!A33,)))))))))))","v":"Freedom height 20 cm width 19 cm length 181 cm (Type 4)"},{"$f":"IF($S$7=1,NL!B33,IF(cal!$S$7=2,EN!B33,IF(cal!$S$7=3,DE!B33,IF(cal!$S$7=4,FR!B33,IF(cal!$S$7=5,NR!B33,IF(cal!$S$7=6,SP!B33,IF(cal!$S$7=7,SW!B33,IF(cal!$S$7=8,TS!B33,IF(cal!$S$7=9,ExtraTaal1!B33,IF(cal!$S$7=10,ExtraTaal2!B33,IF(cal!$S$7=11,ExtraTaal3!B33,)))))))))))","v":0},{"$f":"IF($S$7=1,NL!C33,IF(cal!$S$7=2,EN!C33,IF(cal!$S$7=3,DE!C33,IF(cal!$S$7=4,FR!C33,IF(cal!$S$7=5,NR!C33,IF(cal!$S$7=6,SP!C33,IF(cal!$S$7=7,SW!C33,IF(cal!$S$7=8,TS!C33,IF(cal!$S$7=9,ExtraTaal1!C33,IF(cal!$S$7=10,ExtraTaal2!C33,IF(cal!$S$7=11,ExtraTaal3!C33,)))))))))))","v":0},{"$f":"IF($S$7=1,NL!D33,IF(cal!$S$7=2,EN!D33,IF(cal!$S$7=3,DE!D33,IF(cal!$S$7=4,FR!D33,IF(cal!$S$7=5,NR!D33,IF(cal!$S$7=6,SP!D33,IF(cal!$S$7=7,SW!D33,IF(cal!$S$7=8,TS!D33,IF(cal!$S$7=9,ExtraTaal1!D33,IF(cal!$S$7=10,ExtraTaal2!D33,IF(cal!$S$7=11,ExtraTaal3!D33,)))))))))))","v":0},{"$f":"IF($S$7=1,NL!E33,IF(cal!$S$7=2,EN!E33,IF(cal!$S$7=3,DE!E33,IF(cal!$S$7=4,FR!E33,IF(cal!$S$7=5,NR!E33,IF(cal!$S$7=6,SP!E33,IF(cal!$S$7=7,SW!E33,IF(cal!$S$7=8,TS!E33,IF(cal!$S$7=9,ExtraTaal1!E33,IF(cal!$S$7=10,ExtraTaal2!E33,IF(cal!$S$7=11,ExtraTaal3!E33,)))))))))))","v":0},{"$f":"IF($S$7=1,NL!F33,IF(cal!$S$7=2,EN!F33,IF(cal!$S$7=3,DE!F33,IF(cal!$S$7=4,FR!F33,IF(cal!$S$7=5,NR!F33,IF(cal!$S$7=6,SP!F33,IF(cal!$S$7=7,SW!F33,IF(cal!$S$7=8,TS!F33,IF(cal!$S$7=9,ExtraTaal1!F33,IF(cal!$S$7=10,ExtraTaal2!F33,IF(cal!$S$7=11,ExtraTaal3!F33,)))))))))))","v":0},{"$f":"IF($S$7=1,NL!G33,IF(cal!$S$7=2,EN!G33,IF(cal!$S$7=3,DE!G33,IF(cal!$S$7=4,FR!G33,IF(cal!$S$7=5,NR!G33,IF(cal!$S$7=6,SP!G33,IF(cal!$S$7=7,SW!G33,IF(cal!$S$7=8,TS!G33,IF(cal!$S$7=9,ExtraTaal1!G33,IF(cal!$S$7=10,ExtraTaal2!G33,IF(cal!$S$7=11,ExtraTaal3!G33,)))))))))))","v":0},{"$f":"IF($S$7=1,NL!H33,IF(cal!$S$7=2,EN!H33,IF(cal!$S$7=3,DE!H33,IF(cal!$S$7=4,FR!H33,IF(cal!$S$7=5,NR!H33,IF(cal!$S$7=6,SP!H33,IF(cal!$S$7=7,SW!H33,IF(cal!$S$7=8,TS!H33,IF(cal!$S$7=9,ExtraTaal1!H33,IF(cal!$S$7=10,ExtraTaal2!H33,IF(cal!$S$7=11,ExtraTaal3!H33,)))))))))))","v":0},{"$f":"IF($S$7=1,NL!I33,IF(cal!$S$7=2,EN!I33,IF(cal!$S$7=3,DE!I33,IF(cal!$S$7=4,FR!I33,IF(cal!$S$7=5,NR!I33,IF(cal!$S$7=6,SP!I33,IF(cal!$S$7=7,SW!I33,IF(cal!$S$7=8,TS!I33,IF(cal!$S$7=9,ExtraTaal1!I33,IF(cal!$S$7=10,ExtraTaal2!I33,IF(cal!$S$7=11,ExtraTaal3!I33,)))))))))))","v":0},{"$f":"IF($S$7=1,NL!J33,IF(cal!$S$7=2,EN!J33,IF(cal!$S$7=3,DE!J33,IF(cal!$S$7=4,FR!J33,IF(cal!$S$7=5,NR!J33,IF(cal!$S$7=6,SP!J33,IF(cal!$S$7=7,SW!J33,IF(cal!$S$7=8,TS!J33,IF(cal!$S$7=9,ExtraTaal1!J33,IF(cal!$S$7=10,ExtraTaal2!J33,IF(cal!$S$7=11,ExtraTaal3!J33,)))))))))))","v":0},{"$f":"IF($S$7=1,NL!K33,IF(cal!$S$7=2,EN!K33,IF(cal!$S$7=3,DE!K33,IF(cal!$S$7=4,FR!K33,IF(cal!$S$7=5,NR!K33,IF(cal!$S$7=6,SP!K33,IF(cal!$S$7=7,SW!K33,IF(cal!$S$7=8,TS!K33,IF(cal!$S$7=9,ExtraTaal1!K33,IF(cal!$S$7=10,ExtraTaal2!K33,IF(cal!$S$7=11,ExtraTaal3!K33,)))))))))))","v":0},{"$f":"IF($S$7=1,NL!L33,IF(cal!$S$7=2,EN!L33,IF(cal!$S$7=3,DE!L33,IF(cal!$S$7=4,FR!L33,IF(cal!$S$7=5,NR!L33,IF(cal!$S$7=6,SP!L33,IF(cal!$S$7=7,SW!L33,IF(cal!$S$7=8,TS!L33,IF(cal!$S$7=9,ExtraTaal1!L33,IF(cal!$S$7=10,ExtraTaal2!L33,IF(cal!$S$7=11,ExtraTaal3!L33,)))))))))))","v":0},{"$f":"IF($S$7=1,NL!M33,IF(cal!$S$7=2,EN!M33,IF(cal!$S$7=3,DE!M33,IF(cal!$S$7=4,FR!M33,IF(cal!$S$7=5,NR!M33,IF(cal!$S$7=6,SP!M33,IF(cal!$S$7=7,SW!M33,IF(cal!$S$7=8,TS!M33,IF(cal!$S$7=9,ExtraTaal1!M33,IF(cal!$S$7=10,ExtraTaal2!M33,IF(cal!$S$7=11,ExtraTaal3!M33,)))))))))))","v":0},{"$f":"IF($S$7=1,NL!N33,IF(cal!$S$7=2,EN!N33,IF(cal!$S$7=3,DE!N33,IF(cal!$S$7=4,FR!N33,IF(cal!$S$7=5,NR!N33,IF(cal!$S$7=6,SP!N33,IF(cal!$S$7=7,SW!N33,IF(cal!$S$7=8,TS!N33,IF(cal!$S$7=9,ExtraTaal1!N33,IF(cal!$S$7=10,ExtraTaal2!N33,IF(cal!$S$7=11,ExtraTaal3!N33,)))))))))))","v":0},{"$f":"IF($S$7=1,NL!O33,IF(cal!$S$7=2,EN!O33,IF(cal!$S$7=3,DE!O33,IF(cal!$S$7=4,FR!O33,IF(cal!$S$7=5,NR!O33,IF(cal!$S$7=6,SP!O33,IF(cal!$S$7=7,SW!O33,IF(cal!$S$7=8,TS!O33,IF(cal!$S$7=9,ExtraTaal1!O33,IF(cal!$S$7=10,ExtraTaal2!O33,IF(cal!$S$7=11,ExtraTaal3!O33,)))))))))))","v":0},"n-value",0,null,null,null,null,null,{"$f":"IF($X$16=1,AE34,IF($X$16=2,AM34,IF($X$16=3,BL34,IF($X$16=4,BE34,IF($X$16=5,CA34,IF($X$16=6,BT34,IF($X$16=7,AX34,)))))))","v":"H"},{"$f":"IF($X$16=1,AF34,IF($X$16=2,AN34,IF($X$16=3,BM34,IF($X$16=4,BF34,IF($X$16=5,CB34,IF($X$16=6,BU34,IF($X$16=7,AY34,)))))))","v":20},{"$f":"IF($X$16=1,AG34,IF($X$16=2,AO34,IF($X$16=3,BN34,IF($X$16=4,BG34,IF($X$16=5,CC34,IF($X$16=6,BV34,IF($X$16=7,AZ34,)))))))","v":"B"},{"$f":"IF($X$16=1,AH34,IF($X$16=2,AP34,IF($X$16=3,BO34,IF($X$16=4,BH34,IF($X$16=5,CD34,IF($X$16=6,BW34,IF($X$16=7,BA34,)))))))","v":19},{"$f":"IF($X$16=1,AI34,IF($X$16=2,AQ34,IF($X$16=3,BP34,IF($X$16=4,BI34,IF($X$16=5,CE34,IF($X$16=6,BX34,IF($X$16=7,BB34,)))))))","v":"L"},{"$f":"IF($X$16=1,AJ34,IF($X$16=2,AR34,IF($X$16=3,BQ34,IF($X$16=4,BJ34,IF($X$16=5,CF34,IF($X$16=6,BY34,IF($X$16=7,BC34,)))))))","v":145},{"$f":"IF($X$16=1,AK34,IF($X$16=2,AS34,IF($X$16=3,BR34,IF($X$16=4,BK34,IF($X$16=5,CG34,IF($X$16=6,BZ34,IF($X$16=7,BD34,)))))))","v":0},"H",{"$f":"AF28","v":20},"B",{"$f":"AH28","v":19},"L",145]
[null,0.2,2,{"$f":"(X35*($T$11^$Q35))*Watts*CF_Altit","v":1253.1320000000001},{"$f":"ROUND(((D35/Watts)/(($S$9-$S$10)*1.163))*$E$14,IF($X$4=1,0,IF($X$4=2,2)))","v":108},{"$f":"($Y$36*(E35/$E$14)^$Y$38)*$F$14","v":3.7770275170313137},{"$f":"(Z35*($W$11^R35))*Watts*CF_Altit","v":135.69599999999997},{"$f":"((G35/Watts)/(IF((237.3*LN((RH*EXP(17.27*(Tl_cool/(Tl_cool+237.3))))))/(17.27-LN((RH*EXP(17.27*(Tl_cool/(Tl_cool+237.3))))))<Tavg_cold,1,IF(1/(1+((2258*((0.622/(($Z$11/(1*611*EXP(17.27*(Tavg_cold/(Tavg_cold+237.3))))))-1)*1000-(0.622/(($Z$11/(RH*611*EXP(17.27*(Tl_cool/(Tl_cool+237.3))))))-1)*1000))/(1005*(Tavg_cold-Tl_cool))))*1.039+((-0.000729*$C35+0.001448)*(Tl_cool-Tavg_cold)+(0.016908*$C35-0.033574))*1.039>1,1,1/(1+((2258*((0.622/(($Z$11/(1*611*EXP(17.27*(Tavg_cold/(Tavg_cold+237.3))))))-1)*1000-(0.622/(($Z$11/(RH*611*EXP(17.27*(Tl_cool/(Tl_cool+237.3))))))-1)*1000))/(1005*(Tavg_cold-Tl_cool))))*1.039+((-0.000729*$C35+0.001448)*(Tl_cool-Tavg_cold)+(0.016908*$C35-0.033574))*1.039))))*Watts","v":135.69599999999997},{"$f":"ROUND(((H35/Watts)/((Tr_cool-Tv_cool)*1.163))*$I$14,IF($X$4=1,0,IF($X$4=2,2)))","v":58},{"$f":"($AA$36*(I35/$I$14)^$AA$38)*$J$14","v":1.215650321111023},{"$f":"L35-8","v":18},{"$f":"AB35","v":26},1.2,{"$f":"AD35*Cubics","v":84},{"$f":"((($D35/Watts)/(((p_atm*0.028964)/(8.31447*(20+273.15)))*(($N35/3600)/Cubics)*(1005+1870*((0.622)/(((p_atm)/($E$12*Pvs_Heat_in))-1)))))+Tl_heat)*Celc1+Celc2","v":63.789836370025093},{"$f":"(Tl_cool-(($G35/Watts)/(1006*$N35*kgss)))*Celc1+Celc2","v":22.198623163722925},1,0.9,null,null,null,null,{"$f":"(H35-G35)/H35","v":0},{"$f":"IF($X$16=1,AE35,IF($X$16=2,AM35,IF($X$16=3,BL35,IF($X$16=4,BE35,IF($X$16=5,CA35,IF($X$16=6,BT35,IF($X$16=7,AX35,)))))))","v":1253.1320000000001},{"$f":"IF($X$16=1,AF35,IF($X$16=2,AN35,IF($X$16=3,BM35,IF($X$16=4,BF35,IF($X$16=5,CB35,IF($X$16=6,BU35,IF($X$16=7,AY35,)))))))","v":"a"},{"$f":"IF($X$16=1,AG35,IF($X$16=2,AO35,IF($X$16=3,BN35,IF($X$16=4,BG35,IF($X$16=5,CC35,IF($X$16=6,BV35,IF($X$16=7,AZ35,)))))))","v":135.69599999999997},{"$f":"IF($X$16=1,AH35,IF($X$16=2,AP35,IF($X$16=3,BO35,IF($X$16=4,BH35,IF($X$16=5,CD35,IF($X$16=6,BW35,IF($X$16=7,BA35,)))))))","v":"a"},{"$f":"IF($X$16=1,AI35,IF($X$16=2,AQ35,IF($X$16=3,BP35,IF($X$16=4,BI35,IF($X$16=5,CE35,IF($X$16=6,BX35,IF($X$16=7,BB35,)))))))","v":26},{"$f":"IF($X$16=1,AJ35,IF($X$16=2,AR35,IF($X$16=3,BQ35,IF($X$16=4,BJ35,IF($X$16=5,CF35,IF($X$16=6,BY35,IF($X$16=7,BC35,)))))))","v":1.2},{"$f":"IF($X$16=1,AK35,IF($X$16=2,AS35,IF($X$16=3,BR35,IF($X$16=4,BK35,IF($X$16=5,CG35,IF($X$16=6,BZ35,IF($X$16=7,BD35,)))))))","v":84},1253.1320000000001,"a",135.69599999999997,"a",26,1.2,84,null,null,null,null,null,null,null,null,null,{"$f":"(AG35*((((Tv_cool-Tr_cool)/LN((Tv_cool-Tl_cool)/(Tr_cool-Tl_cool)))/((16-18)/LN((16-27)/(18-27))))^S35))*$G$14","v":4.5382773333333265E-2},{"$f":"((AU35/$G$14)/(IF((237.3*LN((RH*EXP(17.27*(Tl_cool/(Tl_cool+237.3))))))/(17.27-LN((RH*EXP(17.27*(Tl_cool/(Tl_cool+237.3))))))<((Tv_cool+Tr_cool)/2),1,1/(1+((2258*((0.622/((p_atm/(1*611*EXP(17.27*(((Tv_cool+Tr_cool)/2)/(((Tv_cool+Tr_cool)/2)+237.3))))))-1)*1000-(0.622/((p_atm/(RH*611*EXP(17.27*(Tl_cool/(Tl_cool+237.3))))))-1)*1000))/(1005*(((Tv_cool+Tr_cool)/2)-Tl_cool))))+-((-0.000625*$C35+0.00625)*(Tl_cool-(Tv_cool+Tr_cool)/2)-(-0.000625*$C35+0.00625)*10))))*$H$14","v":135.69599999999997}]
[null,0.4,4,{"$f":"(X36*($T$11^$Q36))*Watts*CF_Altit","v":2249.2640000000001},{"$f":"ROUND(((D36/Watts)/(($S$9-$S$10)*1.163))*$E$14,IF($X$4=1,0,IF($X$4=2,2)))","v":193},{"$f":"($Y$36*(E36/$E$14)^$Y$38)*$F$14","v":10.88728553624024},{"$f":"(Z36*($W$11^R36))*Watts*CF_Altit","v":298.11999999999995},{"$f":"((G36/Watts)/(IF((237.3*LN((RH*EXP(17.27*(Tl_cool/(Tl_cool+237.3))))))/(17.27-LN((RH*EXP(17.27*(Tl_cool/(Tl_cool+237.3))))))<Tavg_cold,1,IF(1/(1+((2258*((0.622/(($Z$11/(1*611*EXP(17.27*(Tavg_cold/(Tavg_cold+237.3))))))-1)*1000-(0.622/(($Z$11/(RH*611*EXP(17.27*(Tl_cool/(Tl_cool+237.3))))))-1)*1000))/(1005*(Tavg_cold-Tl_cool))))*1.039+((-0.000729*$C36+0.001448)*(Tl_cool-Tavg_cold)+(0.016908*$C36-0.033574))*1.039>1,1,1/(1+((2258*((0.622/(($Z$11/(1*611*EXP(17.27*(Tavg_cold/(Tavg_cold+237.3))))))-1)*1000-(0.622/(($Z$11/(RH*611*EXP(17.27*(Tl_cool/(Tl_cool+237.3))))))-1)*1000))/(1005*(Tavg_cold-Tl_cool))))*1.039+((-0.000729*$C36+0.001448)*(Tl_cool-Tavg_cold)+(0.016908*$C36-0.033574))*1.039))))*Watts","v":298.11999999999995},{"$f":"ROUND(((H36/Watts)/((Tr_cool-Tv_cool)*1.163))*$I$14,IF($X$4=1,0,IF($X$4=2,2)))","v":128},{"$f":"($AA$36*(I36/$I$14)^$AA$38)*$J$14","v":5.1487340584285928},{"$f":"L36-8","v":22},30,2.5,{"$f":"AD36*Cubics","v":150},{"$f":"((($D36/Watts)/(((p_atm*0.028964)/(8.31447*(20+273.15)))*(($N36/3600)/Cubics)*(1005+1870*((0.622)/(((p_atm)/($E$12*Pvs_Heat_in))-1)))))+Tl_heat)*Celc1+Celc2","v":64.015431261250484},{"$f":"(Tl_cool-(($G36/Watts)/(1006*$N36*kgss)))*Celc1+Celc2","v":21.092851528701537},1,0.9,null,null,null,null,{"$f":"(H36-G36)/H36","v":0},{"$f":"IF($X$16=1,AE36,IF($X$16=2,AM36,IF($X$16=3,BL36,IF($X$16=4,BE36,IF($X$16=5,CA36,IF($X$16=6,BT36,IF($X$16=7,AX36,)))))))","v":2249.2640000000001},{"$f":"IF($X$16=1,AF36,IF($X$16=2,AN36,IF($X$16=3,BM36,IF($X$16=4,BF36,IF($X$16=5,CB36,IF($X$16=6,BU36,IF($X$16=7,AY36,)))))))","v":7.3989525167788965E-4},{"$f":"IF($X$16=1,AG36,IF($X$16=2,AO36,IF($X$16=3,BN36,IF($X$16=4,BG36,IF($X$16=5,CC36,IF($X$16=6,BV36,IF($X$16=7,AZ36,)))))))","v":298.11999999999995},{"$f":"IF($X$16=1,AH36,IF($X$16=2,AP36,IF($X$16=3,BO36,IF($X$16=4,BH36,IF($X$16=5,CD36,IF($X$16=6,BW36,IF($X$16=7,BA36,)))))))","v":7.3989525167788965E-4},{"$f":"IF($X$16=1,AI36,IF($X$16=2,AQ36,IF($X$16=3,BP36,IF($X$16=4,BI36,IF($X$16=5,CE36,IF($X$16=6,BX36,IF($X$16=7,BB36,)))))))","v":30},{"$f":"IF($X$16=1,AJ36,IF($X$16=2,AR36,IF($X$16=3,BQ36,IF($X$16=4,BJ36,IF($X$16=5,CF36,IF($X$16=6,BY36,IF($X$16=7,BC36,)))))))","v":2.5},{"$f":"IF($X$16=1,AK36,IF($X$16=2,AS36,IF($X$16=3,BR36,IF($X$16=4,BK36,IF($X$16=5,CG36,IF($X$16=6,BZ36,IF($X$16=7,BD36,)))))))","v":150},2249.2640000000001,7.3989525167788965E-4,298.11999999999995,{"$f":"AF36","v":7.3989525167788965E-4},30,2.5,150,null,null,null,null,null,null,null,null,null,{"$f":"(AG36*((((Tv_cool-Tr_cool)/LN((Tv_cool-Tl_cool)/(Tr_cool-Tl_cool)))/((16-18)/LN((16-27)/(18-27))))^S36))*$G$14","v":9.9704577777777637E-2},{"$f":"((AU36/$G$14)/(IF((237.3*LN((RH*EXP(17.27*(Tl_cool/(Tl_cool+237.3))))))/(17.27-LN((RH*EXP(17.27*(Tl_cool/(Tl_cool+237.3))))))<((Tv_cool+Tr_cool)/2),1,1/(1+((2258*((0.622/((p_atm/(1*611*EXP(17.27*(((Tv_cool+Tr_cool)/2)/(((Tv_cool+Tr_cool)/2)+237.3))))))-1)*1000-(0.622/((p_atm/(RH*611*EXP(17.27*(Tl_cool/(Tl_cool+237.3))))))-1)*1000))/(1005*(((Tv_cool+Tr_cool)/2)-Tl_cool))))+-((-0.000625*$C36+0.00625)*(Tl_cool-(Tv_cool+Tr_cool)/2)-(-0.000625*$C36+0.00625)*10))))*$H$14","v":298.11999999999995}]
[null,0.6,6,{"$f":"(X37*($T$11^$Q37))*Watts*CF_Altit","v":3168.2960000000003},{"$f":"ROUND(((D37/Watts)/(($S$9-$S$10)*1.163))*$E$14,IF($X$4=1,0,IF($X$4=2,2)))","v":272},{"$f":"($Y$36*(E37/$E$14)^$Y$38)*$F$14","v":20.353756706029522},{"$f":"(Z37*($W$11^R37))*Watts*CF_Altit","v":470.8239999999999},{"$f":"((G37/Watts)/(IF((237.3*LN((RH*EXP(17.27*(Tl_cool/(Tl_cool+237.3))))))/(17.27-LN((RH*EXP(17.27*(Tl_cool/(Tl_cool+237.3))))))<Tavg_cold,1,IF(1/(1+((2258*((0.622/(($Z$11/(1*611*EXP(17.27*(Tavg_cold/(Tavg_cold+237.3))))))-1)*1000-(0.622/(($Z$11/(RH*611*EXP(17.27*(Tl_cool/(Tl_cool+237.3))))))-1)*1000))/(1005*(Tavg_cold-Tl_cool))))*1.039+((-0.000729*$C37+0.001448)*(Tl_cool-Tavg_cold)+(0.016908*$C37-0.033574))*1.039>1,1,1/(1+((2258*((0.622/(($Z$11/(1*611*EXP(17.27*(Tavg_cold/(Tavg_cold+237.3))))))-1)*1000-(0.622/(($Z$11/(RH*611*EXP(17.27*(Tl_cool/(Tl_cool+237.3))))))-1)*1000))/(1005*(Tavg_cold-Tl_cool))))*1.039+((-0.000729*$C37+0.001448)*(Tl_cool-Tavg_cold)+(0.016908*$C37-0.033574))*1.039))))*Watts","v":470.8239999999999},{"$f":"ROUND(((H37/Watts)/((Tr_cool-Tv_cool)*1.163))*$I$14,IF($X$4=1,0,IF($X$4=2,2)))","v":202},{"$f":"($AA$36*(I37/$I$14)^$AA$38)*$J$14","v":11.830807577544526},{"$f":"L37-8","v":32},40,5.4,{"$f":"AD37*Cubics","v":196},{"$f":"((($D37/Watts)/(((p_atm*0.028964)/(8.31447*(20+273.15)))*(($N37/3600)/Cubics)*(1005+1870*((0.622)/(((p_atm)/($E$12*Pvs_Heat_in))-1)))))+Tl_heat)*Celc1+Celc2","v":67.448825392857387},{"$f":"(Tl_cool-(($G37/Watts)/(1006*$N37*kgss)))*Celc1+Celc2","v":19.860290288912662},1,0.9,null,null,null,null,{"$f":"(H37-G37)/H37","v":0},{"$f":"IF($X$16=1,AE37,IF($X$16=2,AM37,IF($X$16=3,BL37,IF($X$16=4,BE37,IF($X$16=5,CA37,IF($X$16=6,BT37,IF($X$16=7,AX37,)))))))","v":3168.2960000000003},{"$f":"IF($X$16=1,AF37,IF($X$16=2,AN37,IF($X$16=3,BM37,IF($X$16=4,BF37,IF($X$16=5,CB37,IF($X$16=6,BU37,IF($X$16=7,AY37,)))))))","v":"b"},{"$f":"IF($X$16=1,AG37,IF($X$16=2,AO37,IF($X$16=3,BN37,IF($X$16=4,BG37,IF($X$16=5,CC37,IF($X$16=6,BV37,IF($X$16=7,AZ37,)))))))","v":470.8239999999999},{"$f":"IF($X$16=1,AH37,IF($X$16=2,AP37,IF($X$16=3,BO37,IF($X$16=4,BH37,IF($X$16=5,CD37,IF($X$16=6,BW37,IF($X$16=7,BA37,)))))))","v":"b"},{"$f":"IF($X$16=1,AI37,IF($X$16=2,AQ37,IF($X$16=3,BP37,IF($X$16=4,BI37,IF($X$16=5,CE37,IF($X$16=6,BX37,IF($X$16=7,BB37,)))))))","v":40},{"$f":"IF($X$16=1,AJ37,IF($X$16=2,AR37,IF($X$16=3,BQ37,IF($X$16=4,BJ37,IF($X$16=5,CF37,IF($X$16=6,BY37,IF($X$16=7,BC37,)))))))","v":5.4},{"$f":"IF($X$16=1,AK37,IF($X$16=2,AS37,IF($X$16=3,BR37,IF($X$16=4,BK37,IF($X$16=5,CG37,IF($X$16=6,BZ37,IF($X$16=7,BD37,)))))))","v":196},3168.2960000000003,"b",470.8239999999999,"b",40,5.4,196,null,null,null,null,null,null,null,null,null,{"$f":"(AG37*((((Tv_cool-Tr_cool)/LN((Tv_cool-Tl_cool)/(Tr_cool-Tl_cool)))/((16-18)/LN((16-27)/(18-27))))^S37))*$G$14","v":0.15746447111111087},{"$f":"((AU37/$G$14)/(IF((237.3*LN((RH*EXP(17.27*(Tl_cool/(Tl_cool+237.3))))))/(17.27-LN((RH*EXP(17.27*(Tl_cool/(Tl_cool+237.3))))))<((Tv_cool+Tr_cool)/2),1,1/(1+((2258*((0.622/((p_atm/(1*611*EXP(17.27*(((Tv_cool+Tr_cool)/2)/(((Tv_cool+Tr_cool)/2)+237.3))))))-1)*1000-(0.622/((p_atm/(RH*611*EXP(17.27*(Tl_cool/(Tl_cool+237.3))))))-1)*1000))/(1005*(((Tv_cool+Tr_cool)/2)-Tl_cool))))+-((-0.000625*$C37+0.00625)*(Tl_cool-(Tv_cool+Tr_cool)/2)-(-0.000625*$C37+0.00625)*10))))*$H$14","v":470.82399999999984}]
[null,0.8,8,{"$f":"(X38*($T$11^$Q38))*Watts*CF_Altit","v":4039.0120000000002},{"$f":"ROUND(((D38/Watts)/(($S$9-$S$10)*1.163))*$E$14,IF($X$4=1,0,IF($X$4=2,2)))","v":347},{"$f":"($Y$36*(E38/$E$14)^$Y$38)*$F$14","v":31.732232524165788},{"$f":"(Z38*($W$11^R38))*Watts*CF_Altit","v":651.75199999999973},{"$f":"((G38/Watts)/(IF((237.3*LN((RH*EXP(17.27*(Tl_cool/(Tl_cool+237.3))))))/(17.27-LN((RH*EXP(17.27*(Tl_cool/(Tl_cool+237.3))))))<Tavg_cold,1,IF(1/(1+((2258*((0.622/(($Z$11/(1*611*EXP(17.27*(Tavg_cold/(Tavg_cold+237.3))))))-1)*1000-(0.622/(($Z$11/(RH*611*EXP(17.27*(Tl_cool/(Tl_cool+237.3))))))-1)*1000))/(1005*(Tavg_cold-Tl_cool))))*1.039+((-0.000729*$C38+0.001448)*(Tl_cool-Tavg_cold)+(0.016908*$C38-0.033574))*1.039>1,1,1/(1+((2258*((0.622/(($Z$11/(1*611*EXP(17.27*(Tavg_cold/(Tavg_cold+237.3))))))-1)*1000-(0.622/(($Z$11/(RH*611*EXP(17.27*(Tl_cool/(Tl_cool+237.3))))))-1)*1000))/(1005*(Tavg_cold-Tl_cool))))*1.039+((-0.000729*$C38+0.001448)*(Tl_cool-Tavg_cold)+(0.016908*$C38-0.033574))*1.039))))*Watts","v":651.75199999999973},{"$f":"ROUND(((H38/Watts)/((Tr_cool-Tv_cool)*1.163))*$I$14,IF($X$4=1,0,IF($X$4=2,2)))","v":280},{"$f":"($AA$36*(I38/$I$14)^$AA$38)*$J$14","v":21.458583421095753},{"$f":"L38-8","v":37},45,9.1,{"$f":"AD38*Cubics","v":250},{"$f":"((($D38/Watts)/(((p_atm*0.028964)/(8.31447*(20+273.15)))*(($N38/3600)/Cubics)*(1005+1870*((0.622)/(((p_atm)/($E$12*Pvs_Heat_in))-1)))))+Tl_heat)*Celc1+Celc2","v":67.423207337875638},{"$f":"(Tl_cool-(($G38/Watts)/(1006*$N38*kgss)))*Celc1+Celc2","v":19.251450763855399},1,0.9,null,null,null,null,{"$f":"(H38-G38)/H38","v":0},{"$f":"IF($X$16=1,AE38,IF($X$16=2,AM38,IF($X$16=3,BL38,IF($X$16=4,BE38,IF($X$16=5,CA38,IF($X$16=6,BT38,IF($X$16=7,AX38,)))))))","v":4039.0120000000002},{"$f":"IF($X$16=1,AF38,IF($X$16=2,AN38,IF($X$16=3,BM38,IF($X$16=4,BF38,IF($X$16=5,CB38,IF($X$16=6,BU38,IF($X$16=7,AY38,)))))))","v":1.8235155847906248},{"$f":"IF($X$16=1,AG38,IF($X$16=2,AO38,IF($X$16=3,BN38,IF($X$16=4,BG38,IF($X$16=5,CC38,IF($X$16=6,BV38,IF($X$16=7,AZ38,)))))))","v":651.75199999999973},{"$f":"IF($X$16=1,AH38,IF($X$16=2,AP38,IF($X$16=3,BO38,IF($X$16=4,BH38,IF($X$16=5,CD38,IF($X$16=6,BW38,IF($X$16=7,BA38,)))))))","v":1.8235155847906248},{"$f":"IF($X$16=1,AI38,IF($X$16=2,AQ38,IF($X$16=3,BP38,IF($X$16=4,BI38,IF($X$16=5,CE38,IF($X$16=6,BX38,IF($X$16=7,BB38,)))))))","v":45},{"$f":"IF($X$16=1,AJ38,IF($X$16=2,AR38,IF($X$16=3,BQ38,IF($X$16=4,BJ38,IF($X$16=5,CF38,IF($X$16=6,BY38,IF($X$16=7,BC38,)))))))","v":9.1},{"$f":"IF($X$16=1,AK38,IF($X$16=2,AS38,IF($X$16=3,BR38,IF($X$16=4,BK38,IF($X$16=5,CG38,IF($X$16=6,BZ38,IF($X$16=7,BD38,)))))))","v":250},4039.0120000000002,1.8235155847906248,651.75199999999973,{"$f":"AF38","v":1.8235155847906248},45,9.1,250,null,null,null,null,null,null,null,null,null,{"$f":"(AG38*((((Tv_cool-Tr_cool)/LN((Tv_cool-Tl_cool)/(Tr_cool-Tl_cool)))/((16-18)/LN((16-27)/(18-27))))^S38))*$G$14","v":0.21797483555555519},{"$f":"((AU38/$G$14)/(IF((237.3*LN((RH*EXP(17.27*(Tl_cool/(Tl_cool+237.3))))))/(17.27-LN((RH*EXP(17.27*(Tl_cool/(Tl_cool+237.3))))))<((Tv_cool+Tr_cool)/2),1,1/(1+((2258*((0.622/((p_atm/(1*611*EXP(17.27*(((Tv_cool+Tr_cool)/2)/(((Tv_cool+Tr_cool)/2)+237.3))))))-1)*1000-(0.622/((p_atm/(RH*611*EXP(17.27*(Tl_cool/(Tl_cool+237.3))))))-1)*1000))/(1005*(((Tv_cool+Tr_cool)/2)-Tl_cool))))+-((-0.000625*$C38+0.00625)*(Tl_cool-(Tv_cool+Tr_cool)/2)-(-0.000625*$C38+0.00625)*10))))*$H$14","v":651.75199999999973}]
[null,1,10,{"$f":"(X39*($T$11^$Q39))*Watts*CF_Altit","v":4876.8320000000003},{"$f":"ROUND(((D39/Watts)/(($S$9-$S$10)*1.163))*$E$14,IF($X$4=1,0,IF($X$4=2,2)))","v":419},{"$f":"($Y$36*(E39/$E$14)^$Y$38)*$F$14","v":44.752610931641868},{"$f":"(Z39*($W$11^R39))*Watts*CF_Altit","v":838.84799999999984},{"$f":"((G39/Watts)/(IF((237.3*LN((RH*EXP(17.27*(Tl_cool/(Tl_cool+237.3))))))/(17.27-LN((RH*EXP(17.27*(Tl_cool/(Tl_cool+237.3))))))<Tavg_cold,1,IF(1/(1+((2258*((0.622/(($Z$11/(1*611*EXP(17.27*(Tavg_cold/(Tavg_cold+237.3))))))-1)*1000-(0.622/(($Z$11/(RH*611*EXP(17.27*(Tl_cool/(Tl_cool+237.3))))))-1)*1000))/(1005*(Tavg_cold-Tl_cool))))*1.039+((-0.000729*$C39+0.001448)*(Tl_cool-Tavg_cold)+(0.016908*$C39-0.033574))*1.039>1,1,1/(1+((2258*((0.622/(($Z$11/(1*611*EXP(17.27*(Tavg_cold/(Tavg_cold+237.3))))))-1)*1000-(0.622/(($Z$11/(RH*611*EXP(17.27*(Tl_cool/(Tl_cool+237.3))))))-1)*1000))/(1005*(Tavg_cold-Tl_cool))))*1.039+((-0.000729*$C39+0.001448)*(Tl_cool-Tavg_cold)+(0.016908*$C39-0.033574))*1.039))))*Watts","v":838.84799999999984},{"$f":"ROUND(((H39/Watts)/((Tr_cool-Tv_cool)*1.163))*$I$14,IF($X$4=1,0,IF($X$4=2,2)))","v":361},{"$f":"($AA$36*(I39/$I$14)^$AA$38)*$J$14","v":34.10550473288},{"$f":"L39-8","v":41},49,14.1,{"$f":"AD39*Cubics","v":320},{"$f":"((($D39/Watts)/(((p_atm*0.028964)/(8.31447*(20+273.15)))*(($N39/3600)/Cubics)*(1005+1870*((0.622)/(((p_atm)/($E$12*Pvs_Heat_in))-1)))))+Tl_heat)*Celc1+Celc2","v":64.734604783914889},{"$f":"(Tl_cool-(($G39/Watts)/(1006*$N39*kgss)))*Celc1+Celc2","v":19.208674861132202},1,0.9,null,null,null,null,{"$f":"(H39-G39)/H39","v":0},{"$f":"IF($X$16=1,AE39,IF($X$16=2,AM39,IF($X$16=3,BL39,IF($X$16=4,BE39,IF($X$16=5,CA39,IF($X$16=6,BT39,IF($X$16=7,AX39,)))))))","v":4876.8320000000003},{"$f":"IF($X$16=1,AF39,IF($X$16=2,AN39,IF($X$16=3,BM39,IF($X$16=4,BF39,IF($X$16=5,CB39,IF($X$16=6,BU39,IF($X$16=7,AY39,)))))))","v":0},{"$f":"IF($X$16=1,AG39,IF($X$16=2,AO39,IF($X$16=3,BN39,IF($X$16=4,BG39,IF($X$16=5,CC39,IF($X$16=6,BV39,IF($X$16=7,AZ39,)))))))","v":838.84799999999984},{"$f":"IF($X$16=1,AH39,IF($X$16=2,AP39,IF($X$16=3,BO39,IF($X$16=4,BH39,IF($X$16=5,CD39,IF($X$16=6,BW39,IF($X$16=7,BA39,)))))))","v":0},{"$f":"IF($X$16=1,AI39,IF($X$16=2,AQ39,IF($X$16=3,BP39,IF($X$16=4,BI39,IF($X$16=5,CE39,IF($X$16=6,BX39,IF($X$16=7,BB39,)))))))","v":49},{"$f":"IF($X$16=1,AJ39,IF($X$16=2,AR39,IF($X$16=3,BQ39,IF($X$16=4,BJ39,IF($X$16=5,CF39,IF($X$16=6,BY39,IF($X$16=7,BC39,)))))))","v":14.1},{"$f":"IF($X$16=1,AK39,IF($X$16=2,AS39,IF($X$16=3,BR39,IF($X$16=4,BK39,IF($X$16=5,CG39,IF($X$16=6,BZ39,IF($X$16=7,BD39,)))))))","v":320},4876.8320000000003,null,838.84799999999984,null,49,14.1,320,null,null,null,null,null,null,null,null,null,{"$f":"(AG39*((((Tv_cool-Tr_cool)/LN((Tv_cool-Tl_cool)/(Tr_cool-Tl_cool)))/((16-18)/LN((16-27)/(18-27))))^S39))*$G$14","v":0.28054805333333294},{"$f":"((AU39/$G$14)/(IF((237.3*LN((RH*EXP(17.27*(Tl_cool/(Tl_cool+237.3))))))/(17.27-LN((RH*EXP(17.27*(Tl_cool/(Tl_cool+237.3))))))<((Tv_cool+Tr_cool)/2),1,1/(1+((2258*((0.622/((p_atm/(1*611*EXP(17.27*(((Tv_cool+Tr_cool)/2)/(((Tv_cool+Tr_cool)/2)+237.3))))))-1)*1000-(0.622/((p_atm/(RH*611*EXP(17.27*(Tl_cool/(Tl_cool+237.3))))))-1)*1000))/(1005*(((Tv_cool+Tr_cool)/2)-Tl_cool))))+-((-0.000625*$C39+0.00625)*(Tl_cool-(Tv_cool+Tr_cool)/2)-(-0.000625*$C39+0.00625)*10))))*$H$14","v":838.84799999999984}]
[null,{"$f":"IF($S$7=1,NL!A39,IF(cal!$S$7=2,EN!A39,IF(cal!$S$7=3,DE!A39,IF(cal!$S$7=4,FR!A39,IF(cal!$S$7=5,NR!A39,IF(cal!$S$7=6,SP!A39,IF(cal!$S$7=7,SW!A39,IF(cal!$S$7=8,TS!A39,IF(cal!$S$7=9,ExtraTaal1!A39,IF(cal!$S$7=10,ExtraTaal2!A39,IF(cal!$S$7=11,ExtraTaal3!A39,)))))))))))","v":"Freedom height 0 cm width 0 cm length 0 cm (Type 5)"},{"$f":"IF($S$7=1,NL!B39,IF(cal!$S$7=2,EN!B39,IF(cal!$S$7=3,DE!B39,IF(cal!$S$7=4,FR!B39,IF(cal!$S$7=5,NR!B39,IF(cal!$S$7=6,SP!B39,IF(cal!$S$7=7,SW!B39,IF(cal!$S$7=8,TS!B39,IF(cal!$S$7=9,ExtraTaal1!B39,IF(cal!$S$7=10,ExtraTaal2!B39,IF(cal!$S$7=11,ExtraTaal3!B39,)))))))))))","v":0},{"$f":"IF($S$7=1,NL!C39,IF(cal!$S$7=2,EN!C39,IF(cal!$S$7=3,DE!C39,IF(cal!$S$7=4,FR!C39,IF(cal!$S$7=5,NR!C39,IF(cal!$S$7=6,SP!C39,IF(cal!$S$7=7,SW!C39,IF(cal!$S$7=8,TS!C39,IF(cal!$S$7=9,ExtraTaal1!C39,IF(cal!$S$7=10,ExtraTaal2!C39,IF(cal!$S$7=11,ExtraTaal3!C39,)))))))))))","v":0},{"$f":"IF($S$7=1,NL!D39,IF(cal!$S$7=2,EN!D39,IF(cal!$S$7=3,DE!D39,IF(cal!$S$7=4,FR!D39,IF(cal!$S$7=5,NR!D39,IF(cal!$S$7=6,SP!D39,IF(cal!$S$7=7,SW!D39,IF(cal!$S$7=8,TS!D39,IF(cal!$S$7=9,ExtraTaal1!D39,IF(cal!$S$7=10,ExtraTaal2!D39,IF(cal!$S$7=11,ExtraTaal3!D39,)))))))))))","v":0},{"$f":"IF($S$7=1,NL!E39,IF(cal!$S$7=2,EN!E39,IF(cal!$S$7=3,DE!E39,IF(cal!$S$7=4,FR!E39,IF(cal!$S$7=5,NR!E39,IF(cal!$S$7=6,SP!E39,IF(cal!$S$7=7,SW!E39,IF(cal!$S$7=8,TS!E39,IF(cal!$S$7=9,ExtraTaal1!E39,IF(cal!$S$7=10,ExtraTaal2!E39,IF(cal!$S$7=11,ExtraTaal3!E39,)))))))))))","v":0},{"$f":"IF($S$7=1,NL!F39,IF(cal!$S$7=2,EN!F39,IF(cal!$S$7=3,DE!F39,IF(cal!$S$7=4,FR!F39,IF(cal!$S$7=5,NR!F39,IF(cal!$S$7=6,SP!F39,IF(cal!$S$7=7,SW!F39,IF(cal!$S$7=8,TS!F39,IF(cal!$S$7=9,ExtraTaal1!F39,IF(cal!$S$7=10,ExtraTaal2!F39,IF(cal!$S$7=11,ExtraTaal3!F39,)))))))))))","v":0},{"$f":"IF($S$7=1,NL!G39,IF(cal!$S$7=2,EN!G39,IF(cal!$S$7=3,DE!G39,IF(cal!$S$7=4,FR!G39,IF(cal!$S$7=5,NR!G39,IF(cal!$S$7=6,SP!G39,IF(cal!$S$7=7,SW!G39,IF(cal!$S$7=8,TS!G39,IF(cal!$S$7=9,ExtraTaal1!G39,IF(cal!$S$7=10,ExtraTaal2!G39,IF(cal!$S$7=11,ExtraTaal3!G39,)))))))))))","v":0},{"$f":"IF($S$7=1,NL!H39,IF(cal!$S$7=2,EN!H39,IF(cal!$S$7=3,DE!H39,IF(cal!$S$7=4,FR!H39,IF(cal!$S$7=5,NR!H39,IF(cal!$S$7=6,SP!H39,IF(cal!$S$7=7,SW!H39,IF(cal!$S$7=8,TS!H39,IF(cal!$S$7=9,ExtraTaal1!H39,IF(cal!$S$7=10,ExtraTaal2!H39,IF(cal!$S$7=11,ExtraTaal3!H39,)))))))))))","v":0},{"$f":"IF($S$7=1,NL!I39,IF(cal!$S$7=2,EN!I39,IF(cal!$S$7=3,DE!I39,IF(cal!$S$7=4,FR!I39,IF(cal!$S$7=5,NR!I39,IF(cal!$S$7=6,SP!I39,IF(cal!$S$7=7,SW!I39,IF(cal!$S$7=8,TS!I39,IF(cal!$S$7=9,ExtraTaal1!I39,IF(cal!$S$7=10,ExtraTaal2!I39,IF(cal!$S$7=11,ExtraTaal3!I39,)))))))))))","v":0},{"$f":"IF($S$7=1,NL!J39,IF(cal!$S$7=2,EN!J39,IF(cal!$S$7=3,DE!J39,IF(cal!$S$7=4,FR!J39,IF(cal!$S$7=5,NR!J39,IF(cal!$S$7=6,SP!J39,IF(cal!$S$7=7,SW!J39,IF(cal!$S$7=8,TS!J39,IF(cal!$S$7=9,ExtraTaal1!J39,IF(cal!$S$7=10,ExtraTaal2!J39,IF(cal!$S$7=11,ExtraTaal3!J39,)))))))))))","v":0},{"$f":"IF($S$7=1,NL!K39,IF(cal!$S$7=2,EN!K39,IF(cal!$S$7=3,DE!K39,IF(cal!$S$7=4,FR!K39,IF(cal!$S$7=5,NR!K39,IF(cal!$S$7=6,SP!K39,IF(cal!$S$7=7,SW!K39,IF(cal!$S$7=8,TS!K39,IF(cal!$S$7=9,ExtraTaal1!K39,IF(cal!$S$7=10,ExtraTaal2!K39,IF(cal!$S$7=11,ExtraTaal3!K39,)))))))))))","v":0},{"$f":"IF($S$7=1,NL!L39,IF(cal!$S$7=2,EN!L39,IF(cal!$S$7=3,DE!L39,IF(cal!$S$7=4,FR!L39,IF(cal!$S$7=5,NR!L39,IF(cal!$S$7=6,SP!L39,IF(cal!$S$7=7,SW!L39,IF(cal!$S$7=8,TS!L39,IF(cal!$S$7=9,ExtraTaal1!L39,IF(cal!$S$7=10,ExtraTaal2!L39,IF(cal!$S$7=11,ExtraTaal3!L39,)))))))))))","v":0},{"$f":"IF($S$7=1,NL!M39,IF(cal!$S$7=2,EN!M39,IF(cal!$S$7=3,DE!M39,IF(cal!$S$7=4,FR!M39,IF(cal!$S$7=5,NR!M39,IF(cal!$S$7=6,SP!M39,IF(cal!$S$7=7,SW!M39,IF(cal!$S$7=8,TS!M39,IF(cal!$S$7=9,ExtraTaal1!M39,IF(cal!$S$7=10,ExtraTaal2!M39,IF(cal!$S$7=11,ExtraTaal3!M39,)))))))))))","v":0},{"$f":"IF($S$7=1,NL!N39,IF(cal!$S$7=2,EN!N39,IF(cal!$S$7=3,DE!N39,IF(cal!$S$7=4,FR!N39,IF(cal!$S$7=5,NR!N39,IF(cal!$S$7=6,SP!N39,IF(cal!$S$7=7,SW!N39,IF(cal!$S$7=8,TS!N39,IF(cal!$S$7=9,ExtraTaal1!N39,IF(cal!$S$7=10,ExtraTaal2!N39,IF(cal!$S$7=11,ExtraTaal3!N39,)))))))))))","v":0},{"$f":"IF($S$7=1,NL!O39,IF(cal!$S$7=2,EN!O39,IF(cal!$S$7=3,DE!O39,IF(cal!$S$7=4,FR!O39,IF(cal!$S$7=5,NR!O39,IF(cal!$S$7=6,SP!O39,IF(cal!$S$7=7,SW!O39,IF(cal!$S$7=8,TS!O39,IF(cal!$S$7=9,ExtraTaal1!O39,IF(cal!$S$7=10,ExtraTaal2!O39,IF(cal!$S$7=11,ExtraTaal3!O39,)))))))))))","v":0},"n-value",0,null,null,null,null,null,{"$f":"IF($X$16=1,AE40,IF($X$16=2,AM40,IF($X$16=3,BL40,IF($X$16=4,BE40,IF($X$16=5,CA40,IF($X$16=6,BT40,IF($X$16=7,AX40,)))))))","v":"H"},{"$f":"IF($X$16=1,AF40,IF($X$16=2,AN40,IF($X$16=3,BM40,IF($X$16=4,BF40,IF($X$16=5,CB40,IF($X$16=6,BU40,IF($X$16=7,AY40,)))))))","v":20},{"$f":"IF($X$16=1,AG40,IF($X$16=2,AO40,IF($X$16=3,BN40,IF($X$16=4,BG40,IF($X$16=5,CC40,IF($X$16=6,BV40,IF($X$16=7,AZ40,)))))))","v":"B"},{"$f":"IF($X$16=1,AH40,IF($X$16=2,AP40,IF($X$16=3,BO40,IF($X$16=4,BH40,IF($X$16=5,CD40,IF($X$16=6,BW40,IF($X$16=7,BA40,)))))))","v":19},{"$f":"IF($X$16=1,AI40,IF($X$16=2,AQ40,IF($X$16=3,BP40,IF($X$16=4,BI40,IF($X$16=5,CE40,IF($X$16=6,BX40,IF($X$16=7,BB40,)))))))","v":"L"},{"$f":"IF($X$16=1,AJ40,IF($X$16=2,AR40,IF($X$16=3,BQ40,IF($X$16=4,BJ40,IF($X$16=5,CF40,IF($X$16=6,BY40,IF($X$16=7,BC40,)))))))","v":181},{"$f":"IF($X$16=1,AK40,IF($X$16=2,AS40,IF($X$16=3,BR40,IF($X$16=4,BK40,IF($X$16=5,CG40,IF($X$16=6,BZ40,IF($X$16=7,BD40,)))))))","v":0},"H",{"$f":"AF34","v":20},"B",{"$f":"AH34","v":19},"L",181]
[null,0.2,2,{"$f":"(X41*($T$11^$Q41))*Watts*CF_Altit","v":0},{"$f":"ROUND(((D41/Watts)/(($S$9-$S$10)*1.163))*$E$14,IF($X$4=1,0,IF($X$4=2,2)))","v":0},{"$f":"($Y$42*(E41/$E$14)^$Y$44)*$F$14","v":{"$error":"#NUM!"}},{"$f":"(Z41*($W$11^R41))*Watts*CF_Altit","v":0},{"$f":"((G41/Watts)/(IF((237.3*LN((RH*EXP(17.27*(Tl_cool/(Tl_cool+237.3))))))/(17.27-LN((RH*EXP(17.27*(Tl_cool/(Tl_cool+237.3))))))<Tavg_cold,1,IF(1/(1+((2258*((0.622/(($Z$11/(1*611*EXP(17.27*(Tavg_cold/(Tavg_cold+237.3))))))-1)*1000-(0.622/(($Z$11/(RH*611*EXP(17.27*(Tl_cool/(Tl_cool+237.3))))))-1)*1000))/(1005*(Tavg_cold-Tl_cool))))*1.039+((-0.000729*$C41+0.001448)*(Tl_cool-Tavg_cold)+(0.016908*$C41-0.033574))*1.039>1,1,1/(1+((2258*((0.622/(($Z$11/(1*611*EXP(17.27*(Tavg_cold/(Tavg_cold+237.3))))))-1)*1000-(0.622/(($Z$11/(RH*611*EXP(17.27*(Tl_cool/(Tl_cool+237.3))))))-1)*1000))/(1005*(Tavg_cold-Tl_cool))))*1.039+((-0.000729*$C41+0.001448)*(Tl_cool-Tavg_cold)+(0.016908*$C41-0.033574))*1.039))))*Watts","v":0},{"$f":"ROUND(((H41/Watts)/((Tr_cool-Tv_cool)*1.163))*$I$14,IF($X$4=1,0,IF($X$4=2,2)))","v":0},{"$f":"($AA$42*(I41/$I$14)^$AA$44)*$J$14","v":{"$error":"#NUM!"}},{"$f":"L41-8","v":-8},{"$f":"AB41","v":0},0,{"$f":"AD41*Cubics","v":0},{"$f":"((($D41/Watts)/(((p_atm*0.028964)/(8.31447*(20+273.15)))*(($N41/3600)/Cubics)*(1005+1870*((0.622)/(((p_atm)/($E$12*Pvs_Heat_in))-1)))))+Tl_heat)*Celc1+Celc2","v":{"$error":"#DIV/0!"}},{"$f":"(Tl_cool-(($G41/Watts)/(1006*$N41*kgss)))*Celc1+Celc2","v":{"$error":"#DIV/0!"}},1,0,null,null,null,null,{"$f":"(H41-G41)/H41","v":{"$error":"#DIV/0!"}},{"$f":"IF($X$16=1,AE41,IF($X$16=2,AM41,IF($X$16=3,BL41,IF($X$16=4,BE41,IF($X$16=5,CA41,IF($X$16=6,BT41,IF($X$16=7,AX41,)))))))","v":0},{"$f":"IF($X$16=1,AF41,IF($X$16=2,AN41,IF($X$16=3,BM41,IF($X$16=4,BF41,IF($X$16=5,CB41,IF($X$16=6,BU41,IF($X$16=7,AY41,)))))))","v":0},{"$f":"IF($X$16=1,AG41,IF($X$16=2,AO41,IF($X$16=3,BN41,IF($X$16=4,BG41,IF($X$16=5,CC41,IF($X$16=6,BV41,IF($X$16=7,AZ41,)))))))","v":0},{"$f":"IF($X$16=1,AH41,IF($X$16=2,AP41,IF($X$16=3,BO41,IF($X$16=4,BH41,IF($X$16=5,CD41,IF($X$16=6,BW41,IF($X$16=7,BA41,)))))))","v":0},{"$f":"IF($X$16=1,AI41,IF($X$16=2,AQ41,IF($X$16=3,BP41,IF($X$16=4,BI41,IF($X$16=5,CE41,IF($X$16=6,BX41,IF($X$16=7,BB41,)))))))","v":0},{"$f":"IF($X$16=1,AJ41,IF($X$16=2,AR41,IF($X$16=3,BQ41,IF($X$16=4,BJ41,IF($X$16=5,CF41,IF($X$16=6,BY41,IF($X$16=7,BC41,)))))))","v":0},{"$f":"IF($X$16=1,AK41,IF($X$16=2,AS41,IF($X$16=3,BR41,IF($X$16=4,BK41,IF($X$16=5,CG41,IF($X$16=6,BZ41,IF($X$16=7,BD41,)))))))","v":0}]
[null,0.4,4,{"$f":"(X42*($T$11^$Q42))*Watts*CF_Altit","v":0},{"$f":"ROUND(((D42/Watts)/(($S$9-$S$10)*1.163))*$E$14,IF($X$4=1,0,IF($X$4=2,2)))","v":0},{"$f":"($Y$42*(E42/$E$14)^$Y$44)*$F$14","v":{"$error":"#NUM!"}},{"$f":"(Z42*($W$11^R42))*Watts*CF_Altit","v":0},{"$f":"((G42/Watts)/(IF((237.3*LN((RH*EXP(17.27*(Tl_cool/(Tl_cool+237.3))))))/(17.27-LN((RH*EXP(17.27*(Tl_cool/(Tl_cool+237.3))))))<Tavg_cold,1,IF(1/(1+((2258*((0.622/(($Z$11/(1*611*EXP(17.27*(Tavg_cold/(Tavg_cold+237.3))))))-1)*1000-(0.622/(($Z$11/(RH*611*EXP(17.27*(Tl_cool/(Tl_cool+237.3))))))-1)*1000))/(1005*(Tavg_cold-Tl_cool))))*1.039+((-0.000729*$C42+0.001448)*(Tl_cool-Tavg_cold)+(0.016908*$C42-0.033574))*1.039>1,1,1/(1+((2258*((0.622/(($Z$11/(1*611*EXP(17.27*(Tavg_cold/(Tavg_cold+237.3))))))-1)*1000-(0.622/(($Z$11/(RH*611*EXP(17.27*(Tl_cool/(Tl_cool+237.3))))))-1)*1000))/(1005*(Tavg_cold-Tl_cool))))*1.039+((-0.000729*$C42+0.001448)*(Tl_cool-Tavg_cold)+(0.016908*$C42-0.033574))*1.039))))*Watts","v":0},{"$f":"ROUND(((H42/Watts)/((Tr_cool-Tv_cool)*1.163))*$I$14,IF($X$4=1,0,IF($X$4=2,2)))","v":0},{"$f":"($AA$42*(I42/$I$14)^$AA$44)*$J$14","v":{"$error":"#NUM!"}},{"$f":"L42-8","v":-8},0,0,{"$f":"AD42*Cubics","v":0},{"$f":"((($D42/Watts)/(((p_atm*0.028964)/(8.31447*(20+273.15)))*(($N42/3600)/Cubics)*(1005+1870*((0.622)/(((p_atm)/($E$12*Pvs_Heat_in))-1)))))+Tl_heat)*Celc1+Celc2","v":{"$error":"#DIV/0!"}},{"$f":"(Tl_cool-(($G42/Watts)/(1006*$N42*kgss)))*Celc1+Celc2","v":{"$error":"#DIV/0!"}},1,0,null,null,null,null,{"$f":"(H42-G42)/H42","v":{"$error":"#DIV/0!"}},{"$f":"IF($X$16=1,AE42,IF($X$16=2,AM42,IF($X$16=3,BL42,IF($X$16=4,BE42,IF($X$16=5,CA42,IF($X$16=6,BT42,IF($X$16=7,AX42,)))))))","v":0},{"$f":"IF($X$16=1,AF42,IF($X$16=2,AN42,IF($X$16=3,BM42,IF($X$16=4,BF42,IF($X$16=5,CB42,IF($X$16=6,BU42,IF($X$16=7,AY42,)))))))","v":0},{"$f":"IF($X$16=1,AG42,IF($X$16=2,AO42,IF($X$16=3,BN42,IF($X$16=4,BG42,IF($X$16=5,CC42,IF($X$16=6,BV42,IF($X$16=7,AZ42,)))))))","v":0},{"$f":"IF($X$16=1,AH42,IF($X$16=2,AP42,IF($X$16=3,BO42,IF($X$16=4,BH42,IF($X$16=5,CD42,IF($X$16=6,BW42,IF($X$16=7,BA42,)))))))","v":0},{"$f":"IF($X$16=1,AI42,IF($X$16=2,AQ42,IF($X$16=3,BP42,IF($X$16=4,BI42,IF($X$16=5,CE42,IF($X$16=6,BX42,IF($X$16=7,BB42,)))))))","v":0},{"$f":"IF($X$16=1,AJ42,IF($X$16=2,AR42,IF($X$16=3,BQ42,IF($X$16=4,BJ42,IF($X$16=5,CF42,IF($X$16=6,BY42,IF($X$16=7,BC42,)))))))","v":0},{"$f":"IF($X$16=1,AK42,IF($X$16=2,AS42,IF($X$16=3,BR42,IF($X$16=4,BK42,IF($X$16=5,CG42,IF($X$16=6,BZ42,IF($X$16=7,BD42,)))))))","v":0}]
[null,0.6,6,{"$f":"(X43*($T$11^$Q43))*Watts*CF_Altit","v":0},{"$f":"ROUND(((D43/Watts)/(($S$9-$S$10)*1.163))*$E$14,IF($X$4=1,0,IF($X$4=2,2)))","v":0},{"$f":"($Y$42*(E43/$E$14)^$Y$44)*$F$14","v":{"$error":"#NUM!"}},{"$f":"(Z43*($W$11^R43))*Watts*CF_Altit","v":0},{"$f":"((G43/Watts)/(IF((237.3*LN((RH*EXP(17.27*(Tl_cool/(Tl_cool+237.3))))))/(17.27-LN((RH*EXP(17.27*(Tl_cool/(Tl_cool+237.3))))))<Tavg_cold,1,IF(1/(1+((2258*((0.622/(($Z$11/(1*611*EXP(17.27*(Tavg_cold/(Tavg_cold+237.3))))))-1)*1000-(0.622/(($Z$11/(RH*611*EXP(17.27*(Tl_cool/(Tl_cool+237.3))))))-1)*1000))/(1005*(Tavg_cold-Tl_cool))))*1.039+((-0.000729*$C43+0.001448)*(Tl_cool-Tavg_cold)+(0.016908*$C43-0.033574))*1.039>1,1,1/(1+((2258*((0.622/(($Z$11/(1*611*EXP(17.27*(Tavg_cold/(Tavg_cold+237.3))))))-1)*1000-(0.622/(($Z$11/(RH*611*EXP(17.27*(Tl_cool/(Tl_cool+237.3))))))-1)*1000))/(1005*(Tavg_cold-Tl_cool))))*1.039+((-0.000729*$C43+0.001448)*(Tl_cool-Tavg_cold)+(0.016908*$C43-0.033574))*1.039))))*Watts","v":0},{"$f":"ROUND(((H43/Watts)/((Tr_cool-Tv_cool)*1.163))*$I$14,IF($X$4=1,0,IF($X$4=2,2)))","v":0},{"$f":"($AA$42*(I43/$I$14)^$AA$44)*$J$14","v":{"$error":"#NUM!"}},{"$f":"L43-8","v":-8},0,0,{"$f":"AD43*Cubics","v":0},{"$f":"((($D43/Watts)/(((p_atm*0.028964)/(8.31447*(20+273.15)))*(($N43/3600)/Cubics)*(1005+1870*((0.622)/(((p_atm)/($E$12*Pvs_Heat_in))-1)))))+Tl_heat)*Celc1+Celc2","v":{"$error":"#DIV/0!"}},{"$f":"(Tl_cool-(($G43/Watts)/(1006*$N43*kgss)))*Celc1+Celc2","v":{"$error":"#DIV/0!"}},1,0,null,null,null,null,{"$f":"(H43-G43)/H43","v":{"$error":"#DIV/0!"}},{"$f":"IF($X$16=1,AE43,IF($X$16=2,AM43,IF($X$16=3,BL43,IF($X$16=4,BE43,IF($X$16=5,CA43,IF($X$16=6,BT43,IF($X$16=7,AX43,)))))))","v":0},{"$f":"IF($X$16=1,AF43,IF($X$16=2,AN43,IF($X$16=3,BM43,IF($X$16=4,BF43,IF($X$16=5,CB43,IF($X$16=6,BU43,IF($X$16=7,AY43,)))))))","v":0},{"$f":"IF($X$16=1,AG43,IF($X$16=2,AO43,IF($X$16=3,BN43,IF($X$16=4,BG43,IF($X$16=5,CC43,IF($X$16=6,BV43,IF($X$16=7,AZ43,)))))))","v":0},{"$f":"IF($X$16=1,AH43,IF($X$16=2,AP43,IF($X$16=3,BO43,IF($X$16=4,BH43,IF($X$16=5,CD43,IF($X$16=6,BW43,IF($X$16=7,BA43,)))))))","v":0},{"$f":"IF($X$16=1,AI43,IF($X$16=2,AQ43,IF($X$16=3,BP43,IF($X$16=4,BI43,IF($X$16=5,CE43,IF($X$16=6,BX43,IF($X$16=7,BB43,)))))))","v":0},{"$f":"IF($X$16=1,AJ43,IF($X$16=2,AR43,IF($X$16=3,BQ43,IF($X$16=4,BJ43,IF($X$16=5,CF43,IF($X$16=6,BY43,IF($X$16=7,BC43,)))))))","v":0},{"$f":"IF($X$16=1,AK43,IF($X$16=2,AS43,IF($X$16=3,BR43,IF($X$16=4,BK43,IF($X$16=5,CG43,IF($X$16=6,BZ43,IF($X$16=7,BD43,)))))))","v":0}]
[null,0.8,8,{"$f":"(X44*($T$11^$Q44))*Watts*CF_Altit","v":0},{"$f":"ROUND(((D44/Watts)/(($S$9-$S$10)*1.163))*$E$14,IF($X$4=1,0,IF($X$4=2,2)))","v":0},{"$f":"($Y$42*(E44/$E$14)^$Y$44)*$F$14","v":{"$error":"#NUM!"}},{"$f":"(Z44*($W$11^R44))*Watts*CF_Altit","v":0},{"$f":"((G44/Watts)/(IF((237.3*LN((RH*EXP(17.27*(Tl_cool/(Tl_cool+237.3))))))/(17.27-LN((RH*EXP(17.27*(Tl_cool/(Tl_cool+237.3))))))<Tavg_cold,1,IF(1/(1+((2258*((0.622/(($Z$11/(1*611*EXP(17.27*(Tavg_cold/(Tavg_cold+237.3))))))-1)*1000-(0.622/(($Z$11/(RH*611*EXP(17.27*(Tl_cool/(Tl_cool+237.3))))))-1)*1000))/(1005*(Tavg_cold-Tl_cool))))*1.039+((-0.000729*$C44+0.001448)*(Tl_cool-Tavg_cold)+(0.016908*$C44-0.033574))*1.039>1,1,1/(1+((2258*((0.622/(($Z$11/(1*611*EXP(17.27*(Tavg_cold/(Tavg_cold+237.3))))))-1)*1000-(0.622/(($Z$11/(RH*611*EXP(17.27*(Tl_cool/(Tl_cool+237.3))))))-1)*1000))/(1005*(Tavg_cold-Tl_cool))))*1.039+((-0.000729*$C44+0.001448)*(Tl_cool-Tavg_cold)+(0.016908*$C44-0.033574))*1.039))))*Watts","v":0},{"$f":"ROUND(((H44/Watts)/((Tr_cool-Tv_cool)*1.163))*$I$14,IF($X$4=1,0,IF($X$4=2,2)))","v":0},{"$f":"($AA$42*(I44/$I$14)^$AA$44)*$J$14","v":{"$error":"#NUM!"}},{"$f":"L44-8","v":-8},0,0,{"$f":"AD44*Cubics","v":0},{"$f":"((($D44/Watts)/(((p_atm*0.028964)/(8.31447*(20+273.15)))*(($N44/3600)/Cubics)*(1005+1870*((0.622)/(((p_atm)/($E$12*Pvs_Heat_in))-1)))))+Tl_heat)*Celc1+Celc2","v":{"$error":"#DIV/0!"}},{"$f":"(Tl_cool-(($G44/Watts)/(1006*$N44*kgss)))*Celc1+Celc2","v":{"$error":"#DIV/0!"}},1,0,null,null,null,null,{"$f":"(H44-G44)/H44","v":{"$error":"#DIV/0!"}},{"$f":"IF($X$16=1,AE44,IF($X$16=2,AM44,IF($X$16=3,BL44,IF($X$16=4,BE44,IF($X$16=5,CA44,IF($X$16=6,BT44,IF($X$16=7,AX44,)))))))","v":0},{"$f":"IF($X$16=1,AF44,IF($X$16=2,AN44,IF($X$16=3,BM44,IF($X$16=4,BF44,IF($X$16=5,CB44,IF($X$16=6,BU44,IF($X$16=7,AY44,)))))))","v":0},{"$f":"IF($X$16=1,AG44,IF($X$16=2,AO44,IF($X$16=3,BN44,IF($X$16=4,BG44,IF($X$16=5,CC44,IF($X$16=6,BV44,IF($X$16=7,AZ44,)))))))","v":0},{"$f":"IF($X$16=1,AH44,IF($X$16=2,AP44,IF($X$16=3,BO44,IF($X$16=4,BH44,IF($X$16=5,CD44,IF($X$16=6,BW44,IF($X$16=7,BA44,)))))))","v":0},{"$f":"IF($X$16=1,AI44,IF($X$16=2,AQ44,IF($X$16=3,BP44,IF($X$16=4,BI44,IF($X$16=5,CE44,IF($X$16=6,BX44,IF($X$16=7,BB44,)))))))","v":0},{"$f":"IF($X$16=1,AJ44,IF($X$16=2,AR44,IF($X$16=3,BQ44,IF($X$16=4,BJ44,IF($X$16=5,CF44,IF($X$16=6,BY44,IF($X$16=7,BC44,)))))))","v":0},{"$f":"IF($X$16=1,AK44,IF($X$16=2,AS44,IF($X$16=3,BR44,IF($X$16=4,BK44,IF($X$16=5,CG44,IF($X$16=6,BZ44,IF($X$16=7,BD44,)))))))","v":0}]
[null,1,10,{"$f":"(X45*($T$11^$Q45))*Watts*CF_Altit","v":0},{"$f":"ROUND(((D45/Watts)/(($S$9-$S$10)*1.163))*$E$14,IF($X$4=1,0,IF($X$4=2,2)))","v":0},{"$f":"($Y$42*(E45/$E$14)^$Y$44)*$F$14","v":{"$error":"#NUM!"}},{"$f":"(Z45*($W$11^R45))*Watts*CF_Altit","v":0},{"$f":"((G45/Watts)/(IF((237.3*LN((RH*EXP(17.27*(Tl_cool/(Tl_cool+237.3))))))/(17.27-LN((RH*EXP(17.27*(Tl_cool/(Tl_cool+237.3))))))<Tavg_cold,1,IF(1/(1+((2258*((0.622/(($Z$11/(1*611*EXP(17.27*(Tavg_cold/(Tavg_cold+237.3))))))-1)*1000-(0.622/(($Z$11/(RH*611*EXP(17.27*(Tl_cool/(Tl_cool+237.3))))))-1)*1000))/(1005*(Tavg_cold-Tl_cool))))*1.039+((-0.000729*$C45+0.001448)*(Tl_cool-Tavg_cold)+(0.016908*$C45-0.033574))*1.039>1,1,1/(1+((2258*((0.622/(($Z$11/(1*611*EXP(17.27*(Tavg_cold/(Tavg_cold+237.3))))))-1)*1000-(0.622/(($Z$11/(RH*611*EXP(17.27*(Tl_cool/(Tl_cool+237.3))))))-1)*1000))/(1005*(Tavg_cold-Tl_cool))))*1.039+((-0.000729*$C45+0.001448)*(Tl_cool-Tavg_cold)+(0.016908*$C45-0.033574))*1.039))))*Watts","v":0},{"$f":"ROUND(((H45/Watts)/((Tr_cool-Tv_cool)*1.163))*$I$14,IF($X$4=1,0,IF($X$4=2,2)))","v":0},{"$f":"($AA$42*(I45/$I$14)^$AA$44)*$J$14","v":{"$error":"#NUM!"}},{"$f":"L45-8","v":-8},0,0,{"$f":"AD45*Cubics","v":0},{"$f":"((($D45/Watts)/(((p_atm*0.028964)/(8.31447*(20+273.15)))*(($N45/3600)/Cubics)*(1005+1870*((0.622)/(((p_atm)/($E$12*Pvs_Heat_in))-1)))))+Tl_heat)*Celc1+Celc2","v":{"$error":"#DIV/0!"}},{"$f":"(Tl_cool-(($G45/Watts)/(1006*$N45*kgss)))*Celc1+Celc2","v":{"$error":"#DIV/0!"}},1,0,null,null,null,null,{"$f":"(H45-G45)/H45","v":{"$error":"#DIV/0!"}},{"$f":"IF($X$16=1,AE45,IF($X$16=2,AM45,IF($X$16=3,BL45,IF($X$16=4,BE45,IF($X$16=5,CA45,IF($X$16=6,BT45,IF($X$16=7,AX45,)))))))","v":0},{"$f":"IF($X$16=1,AF45,IF($X$16=2,AN45,IF($X$16=3,BM45,IF($X$16=4,BF45,IF($X$16=5,CB45,IF($X$16=6,BU45,IF($X$16=7,AY45,)))))))","v":0},{"$f":"IF($X$16=1,AG45,IF($X$16=2,AO45,IF($X$16=3,BN45,IF($X$16=4,BG45,IF($X$16=5,CC45,IF($X$16=6,BV45,IF($X$16=7,AZ45,)))))))","v":0},{"$f":"IF($X$16=1,AH45,IF($X$16=2,AP45,IF($X$16=3,BO45,IF($X$16=4,BH45,IF($X$16=5,CD45,IF($X$16=6,BW45,IF($X$16=7,BA45,)))))))","v":0},{"$f":"IF($X$16=1,AI45,IF($X$16=2,AQ45,IF($X$16=3,BP45,IF($X$16=4,BI45,IF($X$16=5,CE45,IF($X$16=6,BX45,IF($X$16=7,BB45,)))))))","v":0},{"$f":"IF($X$16=1,AJ45,IF($X$16=2,AR45,IF($X$16=3,BQ45,IF($X$16=4,BJ45,IF($X$16=5,CF45,IF($X$16=6,BY45,IF($X$16=7,BC45,)))))))","v":0},{"$f":"IF($X$16=1,AK45,IF($X$16=2,AS45,IF($X$16=3,BR45,IF($X$16=4,BK45,IF($X$16=5,CG45,IF($X$16=6,BZ45,IF($X$16=7,BD45,)))))))","v":0}]
[null,{"$f":"IF($S$7=1,NL!A45,IF(cal!$S$7=2,EN!A45,IF(cal!$S$7=3,DE!A45,IF(cal!$S$7=4,FR!A45,IF(cal!$S$7=5,NR!A45,IF(cal!$S$7=6,SP!A45,IF(cal!$S$7=7,SW!A45,IF(cal!$S$7=8,TS!A45,IF(cal!$S$7=9,ExtraTaal1!A45,IF(cal!$S$7=10,ExtraTaal2!A45,IF(cal!$S$7=11,ExtraTaal3!A45,)))))))))))","v":"Freedom height 0 cm width 0 cm length 0 cm (Type 6)"},{"$f":"IF($S$7=1,NL!B45,IF(cal!$S$7=2,EN!B45,IF(cal!$S$7=3,DE!B45,IF(cal!$S$7=4,FR!B45,IF(cal!$S$7=5,NR!B45,IF(cal!$S$7=6,SP!B45,IF(cal!$S$7=7,SW!B45,IF(cal!$S$7=8,TS!B45,IF(cal!$S$7=9,ExtraTaal1!B45,IF(cal!$S$7=10,ExtraTaal2!B45,IF(cal!$S$7=11,ExtraTaal3!B45,)))))))))))","v":0},{"$f":"IF($S$7=1,NL!C45,IF(cal!$S$7=2,EN!C45,IF(cal!$S$7=3,DE!C45,IF(cal!$S$7=4,FR!C45,IF(cal!$S$7=5,NR!C45,IF(cal!$S$7=6,SP!C45,IF(cal!$S$7=7,SW!C45,IF(cal!$S$7=8,TS!C45,IF(cal!$S$7=9,ExtraTaal1!C45,IF(cal!$S$7=10,ExtraTaal2!C45,IF(cal!$S$7=11,ExtraTaal3!C45,)))))))))))","v":0},{"$f":"IF($S$7=1,NL!D45,IF(cal!$S$7=2,EN!D45,IF(cal!$S$7=3,DE!D45,IF(cal!$S$7=4,FR!D45,IF(cal!$S$7=5,NR!D45,IF(cal!$S$7=6,SP!D45,IF(cal!$S$7=7,SW!D45,IF(cal!$S$7=8,TS!D45,IF(cal!$S$7=9,ExtraTaal1!D45,IF(cal!$S$7=10,ExtraTaal2!D45,IF(cal!$S$7=11,ExtraTaal3!D45,)))))))))))","v":0},{"$f":"IF($S$7=1,NL!E45,IF(cal!$S$7=2,EN!E45,IF(cal!$S$7=3,DE!E45,IF(cal!$S$7=4,FR!E45,IF(cal!$S$7=5,NR!E45,IF(cal!$S$7=6,SP!E45,IF(cal!$S$7=7,SW!E45,IF(cal!$S$7=8,TS!E45,IF(cal!$S$7=9,ExtraTaal1!E45,IF(cal!$S$7=10,ExtraTaal2!E45,IF(cal!$S$7=11,ExtraTaal3!E45,)))))))))))","v":0},{"$f":"IF($S$7=1,NL!F45,IF(cal!$S$7=2,EN!F45,IF(cal!$S$7=3,DE!F45,IF(cal!$S$7=4,FR!F45,IF(cal!$S$7=5,NR!F45,IF(cal!$S$7=6,SP!F45,IF(cal!$S$7=7,SW!F45,IF(cal!$S$7=8,TS!F45,IF(cal!$S$7=9,ExtraTaal1!F45,IF(cal!$S$7=10,ExtraTaal2!F45,IF(cal!$S$7=11,ExtraTaal3!F45,)))))))))))","v":0},{"$f":"IF($S$7=1,NL!G45,IF(cal!$S$7=2,EN!G45,IF(cal!$S$7=3,DE!G45,IF(cal!$S$7=4,FR!G45,IF(cal!$S$7=5,NR!G45,IF(cal!$S$7=6,SP!G45,IF(cal!$S$7=7,SW!G45,IF(cal!$S$7=8,TS!G45,IF(cal!$S$7=9,ExtraTaal1!G45,IF(cal!$S$7=10,ExtraTaal2!G45,IF(cal!$S$7=11,ExtraTaal3!G45,)))))))))))","v":0},{"$f":"IF($S$7=1,NL!H45,IF(cal!$S$7=2,EN!H45,IF(cal!$S$7=3,DE!H45,IF(cal!$S$7=4,FR!H45,IF(cal!$S$7=5,NR!H45,IF(cal!$S$7=6,SP!H45,IF(cal!$S$7=7,SW!H45,IF(cal!$S$7=8,TS!H45,IF(cal!$S$7=9,ExtraTaal1!H45,IF(cal!$S$7=10,ExtraTaal2!H45,IF(cal!$S$7=11,ExtraTaal3!H45,)))))))))))","v":0},{"$f":"IF($S$7=1,NL!I45,IF(cal!$S$7=2,EN!I45,IF(cal!$S$7=3,DE!I45,IF(cal!$S$7=4,FR!I45,IF(cal!$S$7=5,NR!I45,IF(cal!$S$7=6,SP!I45,IF(cal!$S$7=7,SW!I45,IF(cal!$S$7=8,TS!I45,IF(cal!$S$7=9,ExtraTaal1!I45,IF(cal!$S$7=10,ExtraTaal2!I45,IF(cal!$S$7=11,ExtraTaal3!I45,)))))))))))","v":0},{"$f":"IF($S$7=1,NL!J45,IF(cal!$S$7=2,EN!J45,IF(cal!$S$7=3,DE!J45,IF(cal!$S$7=4,FR!J45,IF(cal!$S$7=5,NR!J45,IF(cal!$S$7=6,SP!J45,IF(cal!$S$7=7,SW!J45,IF(cal!$S$7=8,TS!J45,IF(cal!$S$7=9,ExtraTaal1!J45,IF(cal!$S$7=10,ExtraTaal2!J45,IF(cal!$S$7=11,ExtraTaal3!J45,)))))))))))","v":0},{"$f":"IF($S$7=1,NL!K45,IF(cal!$S$7=2,EN!K45,IF(cal!$S$7=3,DE!K45,IF(cal!$S$7=4,FR!K45,IF(cal!$S$7=5,NR!K45,IF(cal!$S$7=6,SP!K45,IF(cal!$S$7=7,SW!K45,IF(cal!$S$7=8,TS!K45,IF(cal!$S$7=9,ExtraTaal1!K45,IF(cal!$S$7=10,ExtraTaal2!K45,IF(cal!$S$7=11,ExtraTaal3!K45,)))))))))))","v":0},{"$f":"IF($S$7=1,NL!L45,IF(cal!$S$7=2,EN!L45,IF(cal!$S$7=3,DE!L45,IF(cal!$S$7=4,FR!L45,IF(cal!$S$7=5,NR!L45,IF(cal!$S$7=6,SP!L45,IF(cal!$S$7=7,SW!L45,IF(cal!$S$7=8,TS!L45,IF(cal!$S$7=9,ExtraTaal1!L45,IF(cal!$S$7=10,ExtraTaal2!L45,IF(cal!$S$7=11,ExtraTaal3!L45,)))))))))))","v":0},{"$f":"IF($S$7=1,NL!M45,IF(cal!$S$7=2,EN!M45,IF(cal!$S$7=3,DE!M45,IF(cal!$S$7=4,FR!M45,IF(cal!$S$7=5,NR!M45,IF(cal!$S$7=6,SP!M45,IF(cal!$S$7=7,SW!M45,IF(cal!$S$7=8,TS!M45,IF(cal!$S$7=9,ExtraTaal1!M45,IF(cal!$S$7=10,ExtraTaal2!M45,IF(cal!$S$7=11,ExtraTaal3!M45,)))))))))))","v":0},{"$f":"IF($S$7=1,NL!N45,IF(cal!$S$7=2,EN!N45,IF(cal!$S$7=3,DE!N45,IF(cal!$S$7=4,FR!N45,IF(cal!$S$7=5,NR!N45,IF(cal!$S$7=6,SP!N45,IF(cal!$S$7=7,SW!N45,IF(cal!$S$7=8,TS!N45,IF(cal!$S$7=9,ExtraTaal1!N45,IF(cal!$S$7=10,ExtraTaal2!N45,IF(cal!$S$7=11,ExtraTaal3!N45,)))))))))))","v":0},{"$f":"IF($S$7=1,NL!O45,IF(cal!$S$7=2,EN!O45,IF(cal!$S$7=3,DE!O45,IF(cal!$S$7=4,FR!O45,IF(cal!$S$7=5,NR!O45,IF(cal!$S$7=6,SP!O45,IF(cal!$S$7=7,SW!O45,IF(cal!$S$7=8,TS!O45,IF(cal!$S$7=9,ExtraTaal1!O45,IF(cal!$S$7=10,ExtraTaal2!O45,IF(cal!$S$7=11,ExtraTaal3!O45,)))))))))))","v":0},"n-value",0,null,null,null,null,null,{"$f":"IF($X$16=1,AE46,IF($X$16=2,AM46,IF($X$16=3,BL46,IF($X$16=4,BE46,IF($X$16=5,CA46,IF($X$16=6,BT46,IF($X$16=7,AX46,)))))))","v":0},{"$f":"IF($X$16=1,AF46,IF($X$16=2,AN46,IF($X$16=3,BM46,IF($X$16=4,BF46,IF($X$16=5,CB46,IF($X$16=6,BU46,IF($X$16=7,AY46,)))))))","v":0},{"$f":"IF($X$16=1,AG46,IF($X$16=2,AO46,IF($X$16=3,BN46,IF($X$16=4,BG46,IF($X$16=5,CC46,IF($X$16=6,BV46,IF($X$16=7,AZ46,)))))))","v":0},{"$f":"IF($X$16=1,AH46,IF($X$16=2,AP46,IF($X$16=3,BO46,IF($X$16=4,BH46,IF($X$16=5,CD46,IF($X$16=6,BW46,IF($X$16=7,BA46,)))))))","v":0},{"$f":"IF($X$16=1,AI46,IF($X$16=2,AQ46,IF($X$16=3,BP46,IF($X$16=4,BI46,IF($X$16=5,CE46,IF($X$16=6,BX46,IF($X$16=7,BB46,)))))))","v":0},{"$f":"IF($X$16=1,AJ46,IF($X$16=2,AR46,IF($X$16=3,BQ46,IF($X$16=4,BJ46,IF($X$16=5,CF46,IF($X$16=6,BY46,IF($X$16=7,BC46,)))))))","v":0},{"$f":"IF($X$16=1,AK46,IF($X$16=2,AS46,IF($X$16=3,BR46,IF($X$16=4,BK46,IF($X$16=5,CG46,IF($X$16=6,BZ46,IF($X$16=7,BD46,)))))))","v":0}]
[null,0.2,2,{"$f":"(X47*($T$11^$Q47))*Watts*CF_Altit","v":0},{"$f":"ROUND(((D47/Watts)/(($S$9-$S$10)*1.163))*$E$14,IF($X$4=1,0,IF($X$4=2,2)))","v":0},{"$f":"($Y$48*(E47/$E$14)^$Y$50)*$F$14","v":{"$error":"#NUM!"}},{"$f":"(Z47*($W$11^R47))*Watts*CF_Altit","v":0},{"$f":"((G47/Watts)/(IF((237.3*LN((RH*EXP(17.27*(Tl_cool/(Tl_cool+237.3))))))/(17.27-LN((RH*EXP(17.27*(Tl_cool/(Tl_cool+237.3))))))<Tavg_cold,1,IF(1/(1+((2258*((0.622/(($Z$11/(1*611*EXP(17.27*(Tavg_cold/(Tavg_cold+237.3))))))-1)*1000-(0.622/(($Z$11/(RH*611*EXP(17.27*(Tl_cool/(Tl_cool+237.3))))))-1)*1000))/(1005*(Tavg_cold-Tl_cool))))*1.039+((-0.000729*$C47+0.001448)*(Tl_cool-Tavg_cold)+(0.016908*$C47-0.033574))*1.039>1,1,1/(1+((2258*((0.622/(($Z$11/(1*611*EXP(17.27*(Tavg_cold/(Tavg_cold+237.3))))))-1)*1000-(0.622/(($Z$11/(RH*611*EXP(17.27*(Tl_cool/(Tl_cool+237.3))))))-1)*1000))/(1005*(Tavg_cold-Tl_cool))))*1.039+((-0.000729*$C47+0.001448)*(Tl_cool-Tavg_cold)+(0.016908*$C47-0.033574))*1.039))))*Watts","v":0},{"$f":"ROUND(((H47/Watts)/((Tr_cool-Tv_cool)*1.163))*$I$14,IF($X$4=1,0,IF($X$4=2,2)))","v":0},{"$f":"($AA$48*(I47/$I$14)^$AA$50)*$J$14","v":{"$error":"#NUM!"}},{"$f":"L47-8","v":-8},{"$f":"AB47","v":0},0,{"$f":"AD47*Cubics","v":0},{"$f":"((($D47/Watts)/(((p_atm*0.028964)/(8.31447*(20+273.15)))*(($N47/3600)/Cubics)*(1005+1870*((0.622)/(((p_atm)/($E$12*Pvs_Heat_in))-1)))))+Tl_heat)*Celc1+Celc2","v":{"$error":"#DIV/0!"}},{"$f":"(Tl_cool-(($G47/Watts)/(1006*$N47*kgss)))*Celc1+Celc2","v":{"$error":"#DIV/0!"}},1,0,null,null,null,null,{"$f":"(H47-G47)/H47","v":{"$error":"#DIV/0!"}},{"$f":"IF($X$16=1,AE47,IF($X$16=2,AM47,IF($X$16=3,BL47,IF($X$16=4,BE47,IF($X$16=5,CA47,IF($X$16=6,BT47,IF($X$16=7,AX47,)))))))","v":0},{"$f":"IF($X$16=1,AF47,IF($X$16=2,AN47,IF($X$16=3,BM47,IF($X$16=4,BF47,IF($X$16=5,CB47,IF($X$16=6,BU47,IF($X$16=7,AY47,)))))))","v":0},{"$f":"IF($X$16=1,AG47,IF($X$16=2,AO47,IF($X$16=3,BN47,IF($X$16=4,BG47,IF($X$16=5,CC47,IF($X$16=6,BV47,IF($X$16=7,AZ47,)))))))","v":0},{"$f":"IF($X$16=1,AH47,IF($X$16=2,AP47,IF($X$16=3,BO47,IF($X$16=4,BH47,IF($X$16=5,CD47,IF($X$16=6,BW47,IF($X$16=7,BA47,)))))))","v":0},{"$f":"IF($X$16=1,AI47,IF($X$16=2,AQ47,IF($X$16=3,BP47,IF($X$16=4,BI47,IF($X$16=5,CE47,IF($X$16=6,BX47,IF($X$16=7,BB47,)))))))","v":0},{"$f":"IF($X$16=1,AJ47,IF($X$16=2,AR47,IF($X$16=3,BQ47,IF($X$16=4,BJ47,IF($X$16=5,CF47,IF($X$16=6,BY47,IF($X$16=7,BC47,)))))))","v":0},{"$f":"IF($X$16=1,AK47,IF($X$16=2,AS47,IF($X$16=3,BR47,IF($X$16=4,BK47,IF($X$16=5,CG47,IF($X$16=6,BZ47,IF($X$16=7,BD47,)))))))","v":0}]
[null,0.4,4,{"$f":"(X48*($T$11^$Q48))*Watts*CF_Altit","v":0},{"$f":"ROUND(((D48/Watts)/(($S$9-$S$10)*1.163))*$E$14,IF($X$4=1,0,IF($X$4=2,2)))","v":0},{"$f":"($Y$48*(E48/$E$14)^$Y$50)*$F$14","v":{"$error":"#NUM!"}},{"$f":"(Z48*($W$11^R48))*Watts*CF_Altit","v":0},{"$f":"((G48/Watts)/(IF((237.3*LN((RH*EXP(17.27*(Tl_cool/(Tl_cool+237.3))))))/(17.27-LN((RH*EXP(17.27*(Tl_cool/(Tl_cool+237.3))))))<Tavg_cold,1,IF(1/(1+((2258*((0.622/(($Z$11/(1*611*EXP(17.27*(Tavg_cold/(Tavg_cold+237.3))))))-1)*1000-(0.622/(($Z$11/(RH*611*EXP(17.27*(Tl_cool/(Tl_cool+237.3))))))-1)*1000))/(1005*(Tavg_cold-Tl_cool))))*1.039+((-0.000729*$C48+0.001448)*(Tl_cool-Tavg_cold)+(0.016908*$C48-0.033574))*1.039>1,1,1/(1+((2258*((0.622/(($Z$11/(1*611*EXP(17.27*(Tavg_cold/(Tavg_cold+237.3))))))-1)*1000-(0.622/(($Z$11/(RH*611*EXP(17.27*(Tl_cool/(Tl_cool+237.3))))))-1)*1000))/(1005*(Tavg_cold-Tl_cool))))*1.039+((-0.000729*$C48+0.001448)*(Tl_cool-Tavg_cold)+(0.016908*$C48-0.033574))*1.039))))*Watts","v":0},{"$f":"ROUND(((H48/Watts)/((Tr_cool-Tv_cool)*1.163))*$I$14,IF($X$4=1,0,IF($X$4=2,2)))","v":0},{"$f":"($AA$48*(I48/$I$14)^$AA$50)*$J$14","v":{"$error":"#NUM!"}},{"$f":"L48-8","v":-8},0,0,{"$f":"AD48*Cubics","v":0},{"$f":"((($D48/Watts)/(((p_atm*0.028964)/(8.31447*(20+273.15)))*(($N48/3600)/Cubics)*(1005+1870*((0.622)/(((p_atm)/($E$12*Pvs_Heat_in))-1)))))+Tl_heat)*Celc1+Celc2","v":{"$error":"#DIV/0!"}},{"$f":"(Tl_cool-(($G48/Watts)/(1006*$N48*kgss)))*Celc1+Celc2","v":{"$error":"#DIV/0!"}},1,0,null,null,null,null,{"$f":"(H48-G48)/H48","v":{"$error":"#DIV/0!"}},{"$f":"IF($X$16=1,AE48,IF($X$16=2,AM48,IF($X$16=3,BL48,IF($X$16=4,BE48,IF($X$16=5,CA48,IF($X$16=6,BT48,IF($X$16=7,AX48,)))))))","v":0},{"$f":"IF($X$16=1,AF48,IF($X$16=2,AN48,IF($X$16=3,BM48,IF($X$16=4,BF48,IF($X$16=5,CB48,IF($X$16=6,BU48,IF($X$16=7,AY48,)))))))","v":0},{"$f":"IF($X$16=1,AG48,IF($X$16=2,AO48,IF($X$16=3,BN48,IF($X$16=4,BG48,IF($X$16=5,CC48,IF($X$16=6,BV48,IF($X$16=7,AZ48,)))))))","v":0},{"$f":"IF($X$16=1,AH48,IF($X$16=2,AP48,IF($X$16=3,BO48,IF($X$16=4,BH48,IF($X$16=5,CD48,IF($X$16=6,BW48,IF($X$16=7,BA48,)))))))","v":0},{"$f":"IF($X$16=1,AI48,IF($X$16=2,AQ48,IF($X$16=3,BP48,IF($X$16=4,BI48,IF($X$16=5,CE48,IF($X$16=6,BX48,IF($X$16=7,BB48,)))))))","v":0},{"$f":"IF($X$16=1,AJ48,IF($X$16=2,AR48,IF($X$16=3,BQ48,IF($X$16=4,BJ48,IF($X$16=5,CF48,IF($X$16=6,BY48,IF($X$16=7,BC48,)))))))","v":0},{"$f":"IF($X$16=1,AK48,IF($X$16=2,AS48,IF($X$16=3,BR48,IF($X$16=4,BK48,IF($X$16=5,CG48,IF($X$16=6,BZ48,IF($X$16=7,BD48,)))))))","v":0}]
[null,0.6,6,{"$f":"(X49*($T$11^$Q49))*Watts*CF_Altit","v":0},{"$f":"ROUND(((D49/Watts)/(($S$9-$S$10)*1.163))*$E$14,IF($X$4=1,0,IF($X$4=2,2)))","v":0},{"$f":"($Y$48*(E49/$E$14)^$Y$50)*$F$14","v":{"$error":"#NUM!"}},{"$f":"(Z49*($W$11^R49))*Watts*CF_Altit","v":0},{"$f":"((G49/Watts)/(IF((237.3*LN((RH*EXP(17.27*(Tl_cool/(Tl_cool+237.3))))))/(17.27-LN((RH*EXP(17.27*(Tl_cool/(Tl_cool+237.3))))))<Tavg_cold,1,IF(1/(1+((2258*((0.622/(($Z$11/(1*611*EXP(17.27*(Tavg_cold/(Tavg_cold+237.3))))))-1)*1000-(0.622/(($Z$11/(RH*611*EXP(17.27*(Tl_cool/(Tl_cool+237.3))))))-1)*1000))/(1005*(Tavg_cold-Tl_cool))))*1.039+((-0.000729*$C49+0.001448)*(Tl_cool-Tavg_cold)+(0.016908*$C49-0.033574))*1.039>1,1,1/(1+((2258*((0.622/(($Z$11/(1*611*EXP(17.27*(Tavg_cold/(Tavg_cold+237.3))))))-1)*1000-(0.622/(($Z$11/(RH*611*EXP(17.27*(Tl_cool/(Tl_cool+237.3))))))-1)*1000))/(1005*(Tavg_cold-Tl_cool))))*1.039+((-0.000729*$C49+0.001448)*(Tl_cool-Tavg_cold)+(0.016908*$C49-0.033574))*1.039))))*Watts","v":0},{"$f":"ROUND(((H49/Watts)/((Tr_cool-Tv_cool)*1.163))*$I$14,IF($X$4=1,0,IF($X$4=2,2)))","v":0},{"$f":"($AA$48*(I49/$I$14)^$AA$50)*$J$14","v":{"$error":"#NUM!"}},{"$f":"L49-8","v":-8},0,0,{"$f":"AD49*Cubics","v":0},{"$f":"((($D49/Watts)/(((p_atm*0.028964)/(8.31447*(20+273.15)))*(($N49/3600)/Cubics)*(1005+1870*((0.622)/(((p_atm)/($E$12*Pvs_Heat_in))-1)))))+Tl_heat)*Celc1+Celc2","v":{"$error":"#DIV/0!"}},{"$f":"(Tl_cool-(($G49/Watts)/(1006*$N49*kgss)))*Celc1+Celc2","v":{"$error":"#DIV/0!"}},1,0,null,null,null,null,{"$f":"(H49-G49)/H49","v":{"$error":"#DIV/0!"}},{"$f":"IF($X$16=1,AE49,IF($X$16=2,AM49,IF($X$16=3,BL49,IF($X$16=4,BE49,IF($X$16=5,CA49,IF($X$16=6,BT49,IF($X$16=7,AX49,)))))))","v":0},{"$f":"IF($X$16=1,AF49,IF($X$16=2,AN49,IF($X$16=3,BM49,IF($X$16=4,BF49,IF($X$16=5,CB49,IF($X$16=6,BU49,IF($X$16=7,AY49,)))))))","v":0},{"$f":"IF($X$16=1,AG49,IF($X$16=2,AO49,IF($X$16=3,BN49,IF($X$16=4,BG49,IF($X$16=5,CC49,IF($X$16=6,BV49,IF($X$16=7,AZ49,)))))))","v":0},{"$f":"IF($X$16=1,AH49,IF($X$16=2,AP49,IF($X$16=3,BO49,IF($X$16=4,BH49,IF($X$16=5,CD49,IF($X$16=6,BW49,IF($X$16=7,BA49,)))))))","v":0},{"$f":"IF($X$16=1,AI49,IF($X$16=2,AQ49,IF($X$16=3,BP49,IF($X$16=4,BI49,IF($X$16=5,CE49,IF($X$16=6,BX49,IF($X$16=7,BB49,)))))))","v":0},{"$f":"IF($X$16=1,AJ49,IF($X$16=2,AR49,IF($X$16=3,BQ49,IF($X$16=4,BJ49,IF($X$16=5,CF49,IF($X$16=6,BY49,IF($X$16=7,BC49,)))))))","v":0},{"$f":"IF($X$16=1,AK49,IF($X$16=2,AS49,IF($X$16=3,BR49,IF($X$16=4,BK49,IF($X$16=5,CG49,IF($X$16=6,BZ49,IF($X$16=7,BD49,)))))))","v":0}]
[null,0.8,8,{"$f":"(X50*($T$11^$Q50))*Watts*CF_Altit","v":0},{"$f":"ROUND(((D50/Watts)/(($S$9-$S$10)*1.163))*$E$14,IF($X$4=1,0,IF($X$4=2,2)))","v":0},{"$f":"($Y$48*(E50/$E$14)^$Y$50)*$F$14","v":{"$error":"#NUM!"}},{"$f":"(Z50*($W$11^R50))*Watts*CF_Altit","v":0},{"$f":"((G50/Watts)/(IF((237.3*LN((RH*EXP(17.27*(Tl_cool/(Tl_cool+237.3))))))/(17.27-LN((RH*EXP(17.27*(Tl_cool/(Tl_cool+237.3))))))<Tavg_cold,1,IF(1/(1+((2258*((0.622/(($Z$11/(1*611*EXP(17.27*(Tavg_cold/(Tavg_cold+237.3))))))-1)*1000-(0.622/(($Z$11/(RH*611*EXP(17.27*(Tl_cool/(Tl_cool+237.3))))))-1)*1000))/(1005*(Tavg_cold-Tl_cool))))*1.039+((-0.000729*$C50+0.001448)*(Tl_cool-Tavg_cold)+(0.016908*$C50-0.033574))*1.039>1,1,1/(1+((2258*((0.622/(($Z$11/(1*611*EXP(17.27*(Tavg_cold/(Tavg_cold+237.3))))))-1)*1000-(0.622/(($Z$11/(RH*611*EXP(17.27*(Tl_cool/(Tl_cool+237.3))))))-1)*1000))/(1005*(Tavg_cold-Tl_cool))))*1.039+((-0.000729*$C50+0.001448)*(Tl_cool-Tavg_cold)+(0.016908*$C50-0.033574))*1.039))))*Watts","v":0},{"$f":"ROUND(((H50/Watts)/((Tr_cool-Tv_cool)*1.163))*$I$14,IF($X$4=1,0,IF($X$4=2,2)))","v":0},{"$f":"($AA$48*(I50/$I$14)^$AA$50)*$J$14","v":{"$error":"#NUM!"}},{"$f":"L50-8","v":-8},0,0,{"$f":"AD50*Cubics","v":0},{"$f":"((($D50/Watts)/(((p_atm*0.028964)/(8.31447*(20+273.15)))*(($N50/3600)/Cubics)*(1005+1870*((0.622)/(((p_atm)/($E$12*Pvs_Heat_in))-1)))))+Tl_heat)*Celc1+Celc2","v":{"$error":"#DIV/0!"}},{"$f":"(Tl_cool-(($G50/Watts)/(1006*$N50*kgss)))*Celc1+Celc2","v":{"$error":"#DIV/0!"}},1,0,null,null,null,null,{"$f":"(H50-G50)/H50","v":{"$error":"#DIV/0!"}},{"$f":"IF($X$16=1,AE50,IF($X$16=2,AM50,IF($X$16=3,BL50,IF($X$16=4,BE50,IF($X$16=5,CA50,IF($X$16=6,BT50,IF($X$16=7,AX50,)))))))","v":0},{"$f":"IF($X$16=1,AF50,IF($X$16=2,AN50,IF($X$16=3,BM50,IF($X$16=4,BF50,IF($X$16=5,CB50,IF($X$16=6,BU50,IF($X$16=7,AY50,)))))))","v":0},{"$f":"IF($X$16=1,AG50,IF($X$16=2,AO50,IF($X$16=3,BN50,IF($X$16=4,BG50,IF($X$16=5,CC50,IF($X$16=6,BV50,IF($X$16=7,AZ50,)))))))","v":0},{"$f":"IF($X$16=1,AH50,IF($X$16=2,AP50,IF($X$16=3,BO50,IF($X$16=4,BH50,IF($X$16=5,CD50,IF($X$16=6,BW50,IF($X$16=7,BA50,)))))))","v":0},{"$f":"IF($X$16=1,AI50,IF($X$16=2,AQ50,IF($X$16=3,BP50,IF($X$16=4,BI50,IF($X$16=5,CE50,IF($X$16=6,BX50,IF($X$16=7,BB50,)))))))","v":0},{"$f":"IF($X$16=1,AJ50,IF($X$16=2,AR50,IF($X$16=3,BQ50,IF($X$16=4,BJ50,IF($X$16=5,CF50,IF($X$16=6,BY50,IF($X$16=7,BC50,)))))))","v":0},{"$f":"IF($X$16=1,AK50,IF($X$16=2,AS50,IF($X$16=3,BR50,IF($X$16=4,BK50,IF($X$16=5,CG50,IF($X$16=6,BZ50,IF($X$16=7,BD50,)))))))","v":0}]
[null,1,10,{"$f":"(X51*($T$11^$Q51))*Watts*CF_Altit","v":0},{"$f":"ROUND(((D51/Watts)/(($S$9-$S$10)*1.163))*$E$14,IF($X$4=1,0,IF($X$4=2,2)))","v":0},{"$f":"($Y$48*(E51/$E$14)^$Y$50)*$F$14","v":{"$error":"#NUM!"}},{"$f":"(Z51*($W$11^R51))*Watts*CF_Altit","v":0},{"$f":"((G51/Watts)/(IF((237.3*LN((RH*EXP(17.27*(Tl_cool/(Tl_cool+237.3))))))/(17.27-LN((RH*EXP(17.27*(Tl_cool/(Tl_cool+237.3))))))<Tavg_cold,1,IF(1/(1+((2258*((0.622/(($Z$11/(1*611*EXP(17.27*(Tavg_cold/(Tavg_cold+237.3))))))-1)*1000-(0.622/(($Z$11/(RH*611*EXP(17.27*(Tl_cool/(Tl_cool+237.3))))))-1)*1000))/(1005*(Tavg_cold-Tl_cool))))*1.039+((-0.000729*$C51+0.001448)*(Tl_cool-Tavg_cold)+(0.016908*$C51-0.033574))*1.039>1,1,1/(1+((2258*((0.622/(($Z$11/(1*611*EXP(17.27*(Tavg_cold/(Tavg_cold+237.3))))))-1)*1000-(0.622/(($Z$11/(RH*611*EXP(17.27*(Tl_cool/(Tl_cool+237.3))))))-1)*1000))/(1005*(Tavg_cold-Tl_cool))))*1.039+((-0.000729*$C51+0.001448)*(Tl_cool-Tavg_cold)+(0.016908*$C51-0.033574))*1.039))))*Watts","v":0},{"$f":"ROUND(((H51/Watts)/((Tr_cool-Tv_cool)*1.163))*$I$14,IF($X$4=1,0,IF($X$4=2,2)))","v":0},{"$f":"($AA$48*(I51/$I$14)^$AA$50)*$J$14","v":{"$error":"#NUM!"}},{"$f":"L51-8","v":-8},0,0,{"$f":"AD51*Cubics","v":0},{"$f":"((($D51/Watts)/(((p_atm*0.028964)/(8.31447*(20+273.15)))*(($N51/3600)/Cubics)*(1005+1870*((0.622)/(((p_atm)/($E$12*Pvs_Heat_in))-1)))))+Tl_heat)*Celc1+Celc2","v":{"$error":"#DIV/0!"}},{"$f":"(Tl_cool-(($G51/Watts)/(1006*$N51*kgss)))*Celc1+Celc2","v":{"$error":"#DIV/0!"}},1,0,null,null,null,null,{"$f":"(H51-G51)/H51","v":{"$error":"#DIV/0!"}},{"$f":"IF($X$16=1,AE51,IF($X$16=2,AM51,IF($X$16=3,BL51,IF($X$16=4,BE51,IF($X$16=5,CA51,IF($X$16=6,BT51,IF($X$16=7,AX51,)))))))","v":0},{"$f":"IF($X$16=1,AF51,IF($X$16=2,AN51,IF($X$16=3,BM51,IF($X$16=4,BF51,IF($X$16=5,CB51,IF($X$16=6,BU51,IF($X$16=7,AY51,)))))))","v":0},{"$f":"IF($X$16=1,AG51,IF($X$16=2,AO51,IF($X$16=3,BN51,IF($X$16=4,BG51,IF($X$16=5,CC51,IF($X$16=6,BV51,IF($X$16=7,AZ51,)))))))","v":0},{"$f":"IF($X$16=1,AH51,IF($X$16=2,AP51,IF($X$16=3,BO51,IF($X$16=4,BH51,IF($X$16=5,CD51,IF($X$16=6,BW51,IF($X$16=7,BA51,)))))))","v":0},{"$f":"IF($X$16=1,AI51,IF($X$16=2,AQ51,IF($X$16=3,BP51,IF($X$16=4,BI51,IF($X$16=5,CE51,IF($X$16=6,BX51,IF($X$16=7,BB51,)))))))","v":0},{"$f":"IF($X$16=1,AJ51,IF($X$16=2,AR51,IF($X$16=3,BQ51,IF($X$16=4,BJ51,IF($X$16=5,CF51,IF($X$16=6,BY51,IF($X$16=7,BC51,)))))))","v":0},{"$f":"IF($X$16=1,AK51,IF($X$16=2,AS51,IF($X$16=3,BR51,IF($X$16=4,BK51,IF($X$16=5,CG51,IF($X$16=6,BZ51,IF($X$16=7,BD51,)))))))","v":0}]
[null,{"$f":"IF($S$7=1,NL!A51,IF(cal!$S$7=2,EN!A51,IF(cal!$S$7=3,DE!A51,IF(cal!$S$7=4,FR!A51,IF(cal!$S$7=5,NR!A51,IF(cal!$S$7=6,SP!A51,IF(cal!$S$7=7,SW!A51,IF(cal!$S$7=8,TS!A51,IF(cal!$S$7=9,ExtraTaal1!A51,IF(cal!$S$7=10,ExtraTaal2!A51,IF(cal!$S$7=11,ExtraTaal3!A51,)))))))))))","v":"Freedom height 0 cm width 0 cm length 0 cm (Type 7)"},{"$f":"IF($S$7=1,NL!B51,IF(cal!$S$7=2,EN!B51,IF(cal!$S$7=3,DE!B51,IF(cal!$S$7=4,FR!B51,IF(cal!$S$7=5,NR!B51,IF(cal!$S$7=6,SP!B51,IF(cal!$S$7=7,SW!B51,IF(cal!$S$7=8,TS!B51,IF(cal!$S$7=9,ExtraTaal1!B51,IF(cal!$S$7=10,ExtraTaal2!B51,IF(cal!$S$7=11,ExtraTaal3!B51,)))))))))))","v":0},{"$f":"IF($S$7=1,NL!C51,IF(cal!$S$7=2,EN!C51,IF(cal!$S$7=3,DE!C51,IF(cal!$S$7=4,FR!C51,IF(cal!$S$7=5,NR!C51,IF(cal!$S$7=6,SP!C51,IF(cal!$S$7=7,SW!C51,IF(cal!$S$7=8,TS!C51,IF(cal!$S$7=9,ExtraTaal1!C51,IF(cal!$S$7=10,ExtraTaal2!C51,IF(cal!$S$7=11,ExtraTaal3!C51,)))))))))))","v":0},{"$f":"IF($S$7=1,NL!D51,IF(cal!$S$7=2,EN!D51,IF(cal!$S$7=3,DE!D51,IF(cal!$S$7=4,FR!D51,IF(cal!$S$7=5,NR!D51,IF(cal!$S$7=6,SP!D51,IF(cal!$S$7=7,SW!D51,IF(cal!$S$7=8,TS!D51,IF(cal!$S$7=9,ExtraTaal1!D51,IF(cal!$S$7=10,ExtraTaal2!D51,IF(cal!$S$7=11,ExtraTaal3!D51,)))))))))))","v":0},{"$f":"IF($S$7=1,NL!E51,IF(cal!$S$7=2,EN!E51,IF(cal!$S$7=3,DE!E51,IF(cal!$S$7=4,FR!E51,IF(cal!$S$7=5,NR!E51,IF(cal!$S$7=6,SP!E51,IF(cal!$S$7=7,SW!E51,IF(cal!$S$7=8,TS!E51,IF(cal!$S$7=9,ExtraTaal1!E51,IF(cal!$S$7=10,ExtraTaal2!E51,IF(cal!$S$7=11,ExtraTaal3!E51,)))))))))))","v":0},{"$f":"IF($S$7=1,NL!F51,IF(cal!$S$7=2,EN!F51,IF(cal!$S$7=3,DE!F51,IF(cal!$S$7=4,FR!F51,IF(cal!$S$7=5,NR!F51,IF(cal!$S$7=6,SP!F51,IF(cal!$S$7=7,SW!F51,IF(cal!$S$7=8,TS!F51,IF(cal!$S$7=9,ExtraTaal1!F51,IF(cal!$S$7=10,ExtraTaal2!F51,IF(cal!$S$7=11,ExtraTaal3!F51,)))))))))))","v":0},{"$f":"IF($S$7=1,NL!G51,IF(cal!$S$7=2,EN!G51,IF(cal!$S$7=3,DE!G51,IF(cal!$S$7=4,FR!G51,IF(cal!$S$7=5,NR!G51,IF(cal!$S$7=6,SP!G51,IF(cal!$S$7=7,SW!G51,IF(cal!$S$7=8,TS!G51,IF(cal!$S$7=9,ExtraTaal1!G51,IF(cal!$S$7=10,ExtraTaal2!G51,IF(cal!$S$7=11,ExtraTaal3!G51,)))))))))))","v":0},{"$f":"IF($S$7=1,NL!H51,IF(cal!$S$7=2,EN!H51,IF(cal!$S$7=3,DE!H51,IF(cal!$S$7=4,FR!H51,IF(cal!$S$7=5,NR!H51,IF(cal!$S$7=6,SP!H51,IF(cal!$S$7=7,SW!H51,IF(cal!$S$7=8,TS!H51,IF(cal!$S$7=9,ExtraTaal1!H51,IF(cal!$S$7=10,ExtraTaal2!H51,IF(cal!$S$7=11,ExtraTaal3!H51,)))))))))))","v":0},{"$f":"IF($S$7=1,NL!I51,IF(cal!$S$7=2,EN!I51,IF(cal!$S$7=3,DE!I51,IF(cal!$S$7=4,FR!I51,IF(cal!$S$7=5,NR!I51,IF(cal!$S$7=6,SP!I51,IF(cal!$S$7=7,SW!I51,IF(cal!$S$7=8,TS!I51,IF(cal!$S$7=9,ExtraTaal1!I51,IF(cal!$S$7=10,ExtraTaal2!I51,IF(cal!$S$7=11,ExtraTaal3!I51,)))))))))))","v":0},{"$f":"IF($S$7=1,NL!J51,IF(cal!$S$7=2,EN!J51,IF(cal!$S$7=3,DE!J51,IF(cal!$S$7=4,FR!J51,IF(cal!$S$7=5,NR!J51,IF(cal!$S$7=6,SP!J51,IF(cal!$S$7=7,SW!J51,IF(cal!$S$7=8,TS!J51,IF(cal!$S$7=9,ExtraTaal1!J51,IF(cal!$S$7=10,ExtraTaal2!J51,IF(cal!$S$7=11,ExtraTaal3!J51,)))))))))))","v":0},{"$f":"IF($S$7=1,NL!K51,IF(cal!$S$7=2,EN!K51,IF(cal!$S$7=3,DE!K51,IF(cal!$S$7=4,FR!K51,IF(cal!$S$7=5,NR!K51,IF(cal!$S$7=6,SP!K51,IF(cal!$S$7=7,SW!K51,IF(cal!$S$7=8,TS!K51,IF(cal!$S$7=9,ExtraTaal1!K51,IF(cal!$S$7=10,ExtraTaal2!K51,IF(cal!$S$7=11,ExtraTaal3!K51,)))))))))))","v":0},{"$f":"IF($S$7=1,NL!L51,IF(cal!$S$7=2,EN!L51,IF(cal!$S$7=3,DE!L51,IF(cal!$S$7=4,FR!L51,IF(cal!$S$7=5,NR!L51,IF(cal!$S$7=6,SP!L51,IF(cal!$S$7=7,SW!L51,IF(cal!$S$7=8,TS!L51,IF(cal!$S$7=9,ExtraTaal1!L51,IF(cal!$S$7=10,ExtraTaal2!L51,IF(cal!$S$7=11,ExtraTaal3!L51,)))))))))))","v":0},{"$f":"IF($S$7=1,NL!M51,IF(cal!$S$7=2,EN!M51,IF(cal!$S$7=3,DE!M51,IF(cal!$S$7=4,FR!M51,IF(cal!$S$7=5,NR!M51,IF(cal!$S$7=6,SP!M51,IF(cal!$S$7=7,SW!M51,IF(cal!$S$7=8,TS!M51,IF(cal!$S$7=9,ExtraTaal1!M51,IF(cal!$S$7=10,ExtraTaal2!M51,IF(cal!$S$7=11,ExtraTaal3!M51,)))))))))))","v":0},{"$f":"IF($S$7=1,NL!N51,IF(cal!$S$7=2,EN!N51,IF(cal!$S$7=3,DE!N51,IF(cal!$S$7=4,FR!N51,IF(cal!$S$7=5,NR!N51,IF(cal!$S$7=6,SP!N51,IF(cal!$S$7=7,SW!N51,IF(cal!$S$7=8,TS!N51,IF(cal!$S$7=9,ExtraTaal1!N51,IF(cal!$S$7=10,ExtraTaal2!N51,IF(cal!$S$7=11,ExtraTaal3!N51,)))))))))))","v":0},{"$f":"IF($S$7=1,NL!O51,IF(cal!$S$7=2,EN!O51,IF(cal!$S$7=3,DE!O51,IF(cal!$S$7=4,FR!O51,IF(cal!$S$7=5,NR!O51,IF(cal!$S$7=6,SP!O51,IF(cal!$S$7=7,SW!O51,IF(cal!$S$7=8,TS!O51,IF(cal!$S$7=9,ExtraTaal1!O51,IF(cal!$S$7=10,ExtraTaal2!O51,IF(cal!$S$7=11,ExtraTaal3!O51,)))))))))))","v":0},"n-value",0,null,null,null,null,null,{"$f":"IF($X$16=1,AE52,IF($X$16=2,AM52,IF($X$16=3,BL52,IF($X$16=4,BE52,IF($X$16=5,CA52,IF($X$16=6,BT52,IF($X$16=7,AX52,)))))))","v":0},{"$f":"IF($X$16=1,AF52,IF($X$16=2,AN52,IF($X$16=3,BM52,IF($X$16=4,BF52,IF($X$16=5,CB52,IF($X$16=6,BU52,IF($X$16=7,AY52,)))))))","v":0},{"$f":"IF($X$16=1,AG52,IF($X$16=2,AO52,IF($X$16=3,BN52,IF($X$16=4,BG52,IF($X$16=5,CC52,IF($X$16=6,BV52,IF($X$16=7,AZ52,)))))))","v":0},{"$f":"IF($X$16=1,AH52,IF($X$16=2,AP52,IF($X$16=3,BO52,IF($X$16=4,BH52,IF($X$16=5,CD52,IF($X$16=6,BW52,IF($X$16=7,BA52,)))))))","v":0},{"$f":"IF($X$16=1,AI52,IF($X$16=2,AQ52,IF($X$16=3,BP52,IF($X$16=4,BI52,IF($X$16=5,CE52,IF($X$16=6,BX52,IF($X$16=7,BB52,)))))))","v":0},{"$f":"IF($X$16=1,AJ52,IF($X$16=2,AR52,IF($X$16=3,BQ52,IF($X$16=4,BJ52,IF($X$16=5,CF52,IF($X$16=6,BY52,IF($X$16=7,BC52,)))))))","v":0},{"$f":"IF($X$16=1,AK52,IF($X$16=2,AS52,IF($X$16=3,BR52,IF($X$16=4,BK52,IF($X$16=5,CG52,IF($X$16=6,BZ52,IF($X$16=7,BD52,)))))))","v":0}]
[null,0.2,2,{"$f":"(X53*($T$11^$Q53))*Watts*CF_Altit","v":0},{"$f":"ROUND(((D53/Watts)/(($S$9-$S$10)*1.163))*$E$14,IF($X$4=1,0,IF($X$4=2,2)))","v":0},{"$f":"($Y$54*(E53/$E$14)^$Y$56)*$F$14","v":{"$error":"#NUM!"}},{"$f":"(Z53*($W$11^R53))*Watts*CF_Altit","v":0},{"$f":"((G53/Watts)/(IF((237.3*LN((RH*EXP(17.27*(Tl_cool/(Tl_cool+237.3))))))/(17.27-LN((RH*EXP(17.27*(Tl_cool/(Tl_cool+237.3))))))<Tavg_cold,1,IF(1/(1+((2258*((0.622/(($Z$11/(1*611*EXP(17.27*(Tavg_cold/(Tavg_cold+237.3))))))-1)*1000-(0.622/(($Z$11/(RH*611*EXP(17.27*(Tl_cool/(Tl_cool+237.3))))))-1)*1000))/(1005*(Tavg_cold-Tl_cool))))*1.039+((-0.000729*$C53+0.001448)*(Tl_cool-Tavg_cold)+(0.016908*$C53-0.033574))*1.039>1,1,1/(1+((2258*((0.622/(($Z$11/(1*611*EXP(17.27*(Tavg_cold/(Tavg_cold+237.3))))))-1)*1000-(0.622/(($Z$11/(RH*611*EXP(17.27*(Tl_cool/(Tl_cool+237.3))))))-1)*1000))/(1005*(Tavg_cold-Tl_cool))))*1.039+((-0.000729*$C53+0.001448)*(Tl_cool-Tavg_cold)+(0.016908*$C53-0.033574))*1.039))))*Watts","v":0},{"$f":"ROUND(((H53/Watts)/((Tr_cool-Tv_cool)*1.163))*$I$14,IF($X$4=1,0,IF($X$4=2,2)))","v":0},{"$f":"($AA$54*(I53/$I$14)^$AA$56)*$J$14","v":{"$error":"#NUM!"}},{"$f":"L53-8","v":-8},{"$f":"AB53","v":0},0,{"$f":"AD53*Cubics","v":0},{"$f":"((($D53/Watts)/(((p_atm*0.028964)/(8.31447*(20+273.15)))*(($N53/3600)/Cubics)*(1005+1870*((0.622)/(((p_atm)/($E$12*Pvs_Heat_in))-1)))))+Tl_heat)*Celc1+Celc2","v":{"$error":"#DIV/0!"}},{"$f":"(Tl_cool-(($G53/Watts)/(1006*$N53*kgss)))*Celc1+Celc2","v":{"$error":"#DIV/0!"}},1,0,null,null,null,null,{"$f":"(H53-G53)/H53","v":{"$error":"#DIV/0!"}},{"$f":"IF($X$16=1,AE53,IF($X$16=2,AM53,IF($X$16=3,BL53,IF($X$16=4,BE53,IF($X$16=5,CA53,IF($X$16=6,BT53,IF($X$16=7,AX53,)))))))","v":0},{"$f":"IF($X$16=1,AF53,IF($X$16=2,AN53,IF($X$16=3,BM53,IF($X$16=4,BF53,IF($X$16=5,CB53,IF($X$16=6,BU53,IF($X$16=7,AY53,)))))))","v":0},{"$f":"IF($X$16=1,AG53,IF($X$16=2,AO53,IF($X$16=3,BN53,IF($X$16=4,BG53,IF($X$16=5,CC53,IF($X$16=6,BV53,IF($X$16=7,AZ53,)))))))","v":0},{"$f":"IF($X$16=1,AH53,IF($X$16=2,AP53,IF($X$16=3,BO53,IF($X$16=4,BH53,IF($X$16=5,CD53,IF($X$16=6,BW53,IF($X$16=7,BA53,)))))))","v":0},{"$f":"IF($X$16=1,AI53,IF($X$16=2,AQ53,IF($X$16=3,BP53,IF($X$16=4,BI53,IF($X$16=5,CE53,IF($X$16=6,BX53,IF($X$16=7,BB53,)))))))","v":0},{"$f":"IF($X$16=1,AJ53,IF($X$16=2,AR53,IF($X$16=3,BQ53,IF($X$16=4,BJ53,IF($X$16=5,CF53,IF($X$16=6,BY53,IF($X$16=7,BC53,)))))))","v":0},{"$f":"IF($X$16=1,AK53,IF($X$16=2,AS53,IF($X$16=3,BR53,IF($X$16=4,BK53,IF($X$16=5,CG53,IF($X$16=6,BZ53,IF($X$16=7,BD53,)))))))","v":0}]
[null,0.4,4,{"$f":"(X54*($T$11^$Q54))*Watts*CF_Altit","v":0},{"$f":"ROUND(((D54/Watts)/(($S$9-$S$10)*1.163))*$E$14,IF($X$4=1,0,IF($X$4=2,2)))","v":0},{"$f":"($Y$54*(E54/$E$14)^$Y$56)*$F$14","v":{"$error":"#NUM!"}},{"$f":"(Z54*($W$11^R54))*Watts*CF_Altit","v":0},{"$f":"((G54/Watts)/(IF((237.3*LN((RH*EXP(17.27*(Tl_cool/(Tl_cool+237.3))))))/(17.27-LN((RH*EXP(17.27*(Tl_cool/(Tl_cool+237.3))))))<Tavg_cold,1,IF(1/(1+((2258*((0.622/(($Z$11/(1*611*EXP(17.27*(Tavg_cold/(Tavg_cold+237.3))))))-1)*1000-(0.622/(($Z$11/(RH*611*EXP(17.27*(Tl_cool/(Tl_cool+237.3))))))-1)*1000))/(1005*(Tavg_cold-Tl_cool))))*1.039+((-0.000729*$C54+0.001448)*(Tl_cool-Tavg_cold)+(0.016908*$C54-0.033574))*1.039>1,1,1/(1+((2258*((0.622/(($Z$11/(1*611*EXP(17.27*(Tavg_cold/(Tavg_cold+237.3))))))-1)*1000-(0.622/(($Z$11/(RH*611*EXP(17.27*(Tl_cool/(Tl_cool+237.3))))))-1)*1000))/(1005*(Tavg_cold-Tl_cool))))*1.039+((-0.000729*$C54+0.001448)*(Tl_cool-Tavg_cold)+(0.016908*$C54-0.033574))*1.039))))*Watts","v":0},{"$f":"ROUND(((H54/Watts)/((Tr_cool-Tv_cool)*1.163))*$I$14,IF($X$4=1,0,IF($X$4=2,2)))","v":0},{"$f":"($AA$54*(I54/$I$14)^$AA$56)*$J$14","v":{"$error":"#NUM!"}},{"$f":"L54-8","v":-8},0,0,{"$f":"AD54*Cubics","v":0},{"$f":"((($D54/Watts)/(((p_atm*0.028964)/(8.31447*(20+273.15)))*(($N54/3600)/Cubics)*(1005+1870*((0.622)/(((p_atm)/($E$12*Pvs_Heat_in))-1)))))+Tl_heat)*Celc1+Celc2","v":{"$error":"#DIV/0!"}},{"$f":"(Tl_cool-(($G54/Watts)/(1006*$N54*kgss)))*Celc1+Celc2","v":{"$error":"#DIV/0!"}},1,0,null,null,null,null,{"$f":"(H54-G54)/H54","v":{"$error":"#DIV/0!"}},{"$f":"IF($X$16=1,AE54,IF($X$16=2,AM54,IF($X$16=3,BL54,IF($X$16=4,BE54,IF($X$16=5,CA54,IF($X$16=6,BT54,IF($X$16=7,AX54,)))))))","v":0},{"$f":"IF($X$16=1,AF54,IF($X$16=2,AN54,IF($X$16=3,BM54,IF($X$16=4,BF54,IF($X$16=5,CB54,IF($X$16=6,BU54,IF($X$16=7,AY54,)))))))","v":0},{"$f":"IF($X$16=1,AG54,IF($X$16=2,AO54,IF($X$16=3,BN54,IF($X$16=4,BG54,IF($X$16=5,CC54,IF($X$16=6,BV54,IF($X$16=7,AZ54,)))))))","v":0},{"$f":"IF($X$16=1,AH54,IF($X$16=2,AP54,IF($X$16=3,BO54,IF($X$16=4,BH54,IF($X$16=5,CD54,IF($X$16=6,BW54,IF($X$16=7,BA54,)))))))","v":0},{"$f":"IF($X$16=1,AI54,IF($X$16=2,AQ54,IF($X$16=3,BP54,IF($X$16=4,BI54,IF($X$16=5,CE54,IF($X$16=6,BX54,IF($X$16=7,BB54,)))))))","v":0},{"$f":"IF($X$16=1,AJ54,IF($X$16=2,AR54,IF($X$16=3,BQ54,IF($X$16=4,BJ54,IF($X$16=5,CF54,IF($X$16=6,BY54,IF($X$16=7,BC54,)))))))","v":0},{"$f":"IF($X$16=1,AK54,IF($X$16=2,AS54,IF($X$16=3,BR54,IF($X$16=4,BK54,IF($X$16=5,CG54,IF($X$16=6,BZ54,IF($X$16=7,BD54,)))))))","v":0}]
[null,0.6,6,{"$f":"(X55*($T$11^$Q55))*Watts*CF_Altit","v":0},{"$f":"ROUND(((D55/Watts)/(($S$9-$S$10)*1.163))*$E$14,IF($X$4=1,0,IF($X$4=2,2)))","v":0},{"$f":"($Y$54*(E55/$E$14)^$Y$56)*$F$14","v":{"$error":"#NUM!"}},{"$f":"(Z55*($W$11^R55))*Watts*CF_Altit","v":0},{"$f":"((G55/Watts)/(IF((237.3*LN((RH*EXP(17.27*(Tl_cool/(Tl_cool+237.3))))))/(17.27-LN((RH*EXP(17.27*(Tl_cool/(Tl_cool+237.3))))))<Tavg_cold,1,IF(1/(1+((2258*((0.622/(($Z$11/(1*611*EXP(17.27*(Tavg_cold/(Tavg_cold+237.3))))))-1)*1000-(0.622/(($Z$11/(RH*611*EXP(17.27*(Tl_cool/(Tl_cool+237.3))))))-1)*1000))/(1005*(Tavg_cold-Tl_cool))))*1.039+((-0.000729*$C55+0.001448)*(Tl_cool-Tavg_cold)+(0.016908*$C55-0.033574))*1.039>1,1,1/(1+((2258*((0.622/(($Z$11/(1*611*EXP(17.27*(Tavg_cold/(Tavg_cold+237.3))))))-1)*1000-(0.622/(($Z$11/(RH*611*EXP(17.27*(Tl_cool/(Tl_cool+237.3))))))-1)*1000))/(1005*(Tavg_cold-Tl_cool))))*1.039+((-0.000729*$C55+0.001448)*(Tl_cool-Tavg_cold)+(0.016908*$C55-0.033574))*1.039))))*Watts","v":0},{"$f":"ROUND(((H55/Watts)/((Tr_cool-Tv_cool)*1.163))*$I$14,IF($X$4=1,0,IF($X$4=2,2)))","v":0},{"$f":"($AA$54*(I55/$I$14)^$AA$56)*$J$14","v":{"$error":"#NUM!"}},{"$f":"L55-8","v":-8},0,0,{"$f":"AD55*Cubics","v":0},{"$f":"((($D55/Watts)/(((p_atm*0.028964)/(8.31447*(20+273.15)))*(($N55/3600)/Cubics)*(1005+1870*((0.622)/(((p_atm)/($E$12*Pvs_Heat_in))-1)))))+Tl_heat)*Celc1+Celc2","v":{"$error":"#DIV/0!"}},{"$f":"(Tl_cool-(($G55/Watts)/(1006*$N55*kgss)))*Celc1+Celc2","v":{"$error":"#DIV/0!"}},1,0,null,null,null,null,{"$f":"(H55-G55)/H55","v":{"$error":"#DIV/0!"}},{"$f":"IF($X$16=1,AE55,IF($X$16=2,AM55,IF($X$16=3,BL55,IF($X$16=4,BE55,IF($X$16=5,CA55,IF($X$16=6,BT55,IF($X$16=7,AX55,)))))))","v":0},{"$f":"IF($X$16=1,AF55,IF($X$16=2,AN55,IF($X$16=3,BM55,IF($X$16=4,BF55,IF($X$16=5,CB55,IF($X$16=6,BU55,IF($X$16=7,AY55,)))))))","v":0},{"$f":"IF($X$16=1,AG55,IF($X$16=2,AO55,IF($X$16=3,BN55,IF($X$16=4,BG55,IF($X$16=5,CC55,IF($X$16=6,BV55,IF($X$16=7,AZ55,)))))))","v":0},{"$f":"IF($X$16=1,AH55,IF($X$16=2,AP55,IF($X$16=3,BO55,IF($X$16=4,BH55,IF($X$16=5,CD55,IF($X$16=6,BW55,IF($X$16=7,BA55,)))))))","v":0},{"$f":"IF($X$16=1,AI55,IF($X$16=2,AQ55,IF($X$16=3,BP55,IF($X$16=4,BI55,IF($X$16=5,CE55,IF($X$16=6,BX55,IF($X$16=7,BB55,)))))))","v":0},{"$f":"IF($X$16=1,AJ55,IF($X$16=2,AR55,IF($X$16=3,BQ55,IF($X$16=4,BJ55,IF($X$16=5,CF55,IF($X$16=6,BY55,IF($X$16=7,BC55,)))))))","v":0},{"$f":"IF($X$16=1,AK55,IF($X$16=2,AS55,IF($X$16=3,BR55,IF($X$16=4,BK55,IF($X$16=5,CG55,IF($X$16=6,BZ55,IF($X$16=7,BD55,)))))))","v":0}]
[null,0.8,8,{"$f":"(X56*($T$11^$Q56))*Watts*CF_Altit","v":0},{"$f":"ROUND(((D56/Watts)/(($S$9-$S$10)*1.163))*$E$14,IF($X$4=1,0,IF($X$4=2,2)))","v":0},{"$f":"($Y$54*(E56/$E$14)^$Y$56)*$F$14","v":{"$error":"#NUM!"}},{"$f":"(Z56*($W$11^R56))*Watts*CF_Altit","v":0},{"$f":"((G56/Watts)/(IF((237.3*LN((RH*EXP(17.27*(Tl_cool/(Tl_cool+237.3))))))/(17.27-LN((RH*EXP(17.27*(Tl_cool/(Tl_cool+237.3))))))<Tavg_cold,1,IF(1/(1+((2258*((0.622/(($Z$11/(1*611*EXP(17.27*(Tavg_cold/(Tavg_cold+237.3))))))-1)*1000-(0.622/(($Z$11/(RH*611*EXP(17.27*(Tl_cool/(Tl_cool+237.3))))))-1)*1000))/(1005*(Tavg_cold-Tl_cool))))*1.039+((-0.000729*$C56+0.001448)*(Tl_cool-Tavg_cold)+(0.016908*$C56-0.033574))*1.039>1,1,1/(1+((2258*((0.622/(($Z$11/(1*611*EXP(17.27*(Tavg_cold/(Tavg_cold+237.3))))))-1)*1000-(0.622/(($Z$11/(RH*611*EXP(17.27*(Tl_cool/(Tl_cool+237.3))))))-1)*1000))/(1005*(Tavg_cold-Tl_cool))))*1.039+((-0.000729*$C56+0.001448)*(Tl_cool-Tavg_cold)+(0.016908*$C56-0.033574))*1.039))))*Watts","v":0},{"$f":"ROUND(((H56/Watts)/((Tr_cool-Tv_cool)*1.163))*$I$14,IF($X$4=1,0,IF($X$4=2,2)))","v":0},{"$f":"($AA$54*(I56/$I$14)^$AA$56)*$J$14","v":{"$error":"#NUM!"}},{"$f":"L56-8","v":-8},0,0,{"$f":"AD56*Cubics","v":0},{"$f":"((($D56/Watts)/(((p_atm*0.028964)/(8.31447*(20+273.15)))*(($N56/3600)/Cubics)*(1005+1870*((0.622)/(((p_atm)/($E$12*Pvs_Heat_in))-1)))))+Tl_heat)*Celc1+Celc2","v":{"$error":"#DIV/0!"}},{"$f":"(Tl_cool-(($G56/Watts)/(1006*$N56*kgss)))*Celc1+Celc2","v":{"$error":"#DIV/0!"}},1,0,null,null,null,null,{"$f":"(H56-G56)/H56","v":{"$error":"#DIV/0!"}},{"$f":"IF($X$16=1,AE56,IF($X$16=2,AM56,IF($X$16=3,BL56,IF($X$16=4,BE56,IF($X$16=5,CA56,IF($X$16=6,BT56,IF($X$16=7,AX56,)))))))","v":0},{"$f":"IF($X$16=1,AF56,IF($X$16=2,AN56,IF($X$16=3,BM56,IF($X$16=4,BF56,IF($X$16=5,CB56,IF($X$16=6,BU56,IF($X$16=7,AY56,)))))))","v":0},{"$f":"IF($X$16=1,AG56,IF($X$16=2,AO56,IF($X$16=3,BN56,IF($X$16=4,BG56,IF($X$16=5,CC56,IF($X$16=6,BV56,IF($X$16=7,AZ56,)))))))","v":0},{"$f":"IF($X$16=1,AH56,IF($X$16=2,AP56,IF($X$16=3,BO56,IF($X$16=4,BH56,IF($X$16=5,CD56,IF($X$16=6,BW56,IF($X$16=7,BA56,)))))))","v":0},{"$f":"IF($X$16=1,AI56,IF($X$16=2,AQ56,IF($X$16=3,BP56,IF($X$16=4,BI56,IF($X$16=5,CE56,IF($X$16=6,BX56,IF($X$16=7,BB56,)))))))","v":0},{"$f":"IF($X$16=1,AJ56,IF($X$16=2,AR56,IF($X$16=3,BQ56,IF($X$16=4,BJ56,IF($X$16=5,CF56,IF($X$16=6,BY56,IF($X$16=7,BC56,)))))))","v":0},{"$f":"IF($X$16=1,AK56,IF($X$16=2,AS56,IF($X$16=3,BR56,IF($X$16=4,BK56,IF($X$16=5,CG56,IF($X$16=6,BZ56,IF($X$16=7,BD56,)))))))","v":0}]
[null,1,10,{"$f":"(X57*($T$11^$Q57))*Watts*CF_Altit","v":0},{"$f":"ROUND(((D57/Watts)/(($S$9-$S$10)*1.163))*$E$14,IF($X$4=1,0,IF($X$4=2,2)))","v":0},{"$f":"($Y$54*(E57/$E$14)^$Y$56)*$F$14","v":{"$error":"#NUM!"}},{"$f":"(Z57*($W$11^R57))*Watts*CF_Altit","v":0},{"$f":"((G57/Watts)/(IF((237.3*LN((RH*EXP(17.27*(Tl_cool/(Tl_cool+237.3))))))/(17.27-LN((RH*EXP(17.27*(Tl_cool/(Tl_cool+237.3))))))<Tavg_cold,1,IF(1/(1+((2258*((0.622/(($Z$11/(1*611*EXP(17.27*(Tavg_cold/(Tavg_cold+237.3))))))-1)*1000-(0.622/(($Z$11/(RH*611*EXP(17.27*(Tl_cool/(Tl_cool+237.3))))))-1)*1000))/(1005*(Tavg_cold-Tl_cool))))*1.039+((-0.000729*$C57+0.001448)*(Tl_cool-Tavg_cold)+(0.016908*$C57-0.033574))*1.039>1,1,1/(1+((2258*((0.622/(($Z$11/(1*611*EXP(17.27*(Tavg_cold/(Tavg_cold+237.3))))))-1)*1000-(0.622/(($Z$11/(RH*611*EXP(17.27*(Tl_cool/(Tl_cool+237.3))))))-1)*1000))/(1005*(Tavg_cold-Tl_cool))))*1.039+((-0.000729*$C57+0.001448)*(Tl_cool-Tavg_cold)+(0.016908*$C57-0.033574))*1.039))))*Watts","v":0},{"$f":"ROUND(((H57/Watts)/((Tr_cool-Tv_cool)*1.163))*$I$14,IF($X$4=1,0,IF($X$4=2,2)))","v":0},{"$f":"($AA$54*(I57/$I$14)^$AA$56)*$J$14","v":{"$error":"#NUM!"}},{"$f":"L57-8","v":-8},0,0,{"$f":"AD57*Cubics","v":0},{"$f":"((($D57/Watts)/(((p_atm*0.028964)/(8.31447*(20+273.15)))*(($N57/3600)/Cubics)*(1005+1870*((0.622)/(((p_atm)/($E$12*Pvs_Heat_in))-1)))))+Tl_heat)*Celc1+Celc2","v":{"$error":"#DIV/0!"}},{"$f":"(Tl_cool-(($G57/Watts)/(1006*$N57*kgss)))*Celc1+Celc2","v":{"$error":"#DIV/0!"}},1,0,null,null,null,null,{"$f":"(H57-G57)/H57","v":{"$error":"#DIV/0!"}},{"$f":"IF($X$16=1,AE57,IF($X$16=2,AM57,IF($X$16=3,BL57,IF($X$16=4,BE57,IF($X$16=5,CA57,IF($X$16=6,BT57,IF($X$16=7,AX57,)))))))","v":0},{"$f":"IF($X$16=1,AF57,IF($X$16=2,AN57,IF($X$16=3,BM57,IF($X$16=4,BF57,IF($X$16=5,CB57,IF($X$16=6,BU57,IF($X$16=7,AY57,)))))))","v":0},{"$f":"IF($X$16=1,AG57,IF($X$16=2,AO57,IF($X$16=3,BN57,IF($X$16=4,BG57,IF($X$16=5,CC57,IF($X$16=6,BV57,IF($X$16=7,AZ57,)))))))","v":0},{"$f":"IF($X$16=1,AH57,IF($X$16=2,AP57,IF($X$16=3,BO57,IF($X$16=4,BH57,IF($X$16=5,CD57,IF($X$16=6,BW57,IF($X$16=7,BA57,)))))))","v":0},{"$f":"IF($X$16=1,AI57,IF($X$16=2,AQ57,IF($X$16=3,BP57,IF($X$16=4,BI57,IF($X$16=5,CE57,IF($X$16=6,BX57,IF($X$16=7,BB57,)))))))","v":0},{"$f":"IF($X$16=1,AJ57,IF($X$16=2,AR57,IF($X$16=3,BQ57,IF($X$16=4,BJ57,IF($X$16=5,CF57,IF($X$16=6,BY57,IF($X$16=7,BC57,)))))))","v":0},{"$f":"IF($X$16=1,AK57,IF($X$16=2,AS57,IF($X$16=3,BR57,IF($X$16=4,BK57,IF($X$16=5,CG57,IF($X$16=6,BZ57,IF($X$16=7,BD57,)))))))","v":0}]
[null,{"$f":"IF($S$7=1,NL!A57,IF(cal!$S$7=2,EN!A57,IF(cal!$S$7=3,DE!A57,IF(cal!$S$7=4,FR!A57,IF(cal!$S$7=5,NR!A57,IF(cal!$S$7=6,SP!A57,IF(cal!$S$7=7,SW!A57,IF(cal!$S$7=8,TS!A57,IF(cal!$S$7=9,ExtraTaal1!A57,IF(cal!$S$7=10,ExtraTaal2!A57,IF(cal!$S$7=11,ExtraTaal3!A57,)))))))))))","v":"Freedom height 0 cm width 0 cm length 0 cm (Type 8)"},{"$f":"IF($S$7=1,NL!B57,IF(cal!$S$7=2,EN!B57,IF(cal!$S$7=3,DE!B57,IF(cal!$S$7=4,FR!B57,IF(cal!$S$7=5,NR!B57,IF(cal!$S$7=6,SP!B57,IF(cal!$S$7=7,SW!B57,IF(cal!$S$7=8,TS!B57,IF(cal!$S$7=9,ExtraTaal1!B57,IF(cal!$S$7=10,ExtraTaal2!B57,IF(cal!$S$7=11,ExtraTaal3!B57,)))))))))))","v":0},{"$f":"IF($S$7=1,NL!C57,IF(cal!$S$7=2,EN!C57,IF(cal!$S$7=3,DE!C57,IF(cal!$S$7=4,FR!C57,IF(cal!$S$7=5,NR!C57,IF(cal!$S$7=6,SP!C57,IF(cal!$S$7=7,SW!C57,IF(cal!$S$7=8,TS!C57,IF(cal!$S$7=9,ExtraTaal1!C57,IF(cal!$S$7=10,ExtraTaal2!C57,IF(cal!$S$7=11,ExtraTaal3!C57,)))))))))))","v":0},{"$f":"IF($S$7=1,NL!D57,IF(cal!$S$7=2,EN!D57,IF(cal!$S$7=3,DE!D57,IF(cal!$S$7=4,FR!D57,IF(cal!$S$7=5,NR!D57,IF(cal!$S$7=6,SP!D57,IF(cal!$S$7=7,SW!D57,IF(cal!$S$7=8,TS!D57,IF(cal!$S$7=9,ExtraTaal1!D57,IF(cal!$S$7=10,ExtraTaal2!D57,IF(cal!$S$7=11,ExtraTaal3!D57,)))))))))))","v":0},{"$f":"IF($S$7=1,NL!E57,IF(cal!$S$7=2,EN!E57,IF(cal!$S$7=3,DE!E57,IF(cal!$S$7=4,FR!E57,IF(cal!$S$7=5,NR!E57,IF(cal!$S$7=6,SP!E57,IF(cal!$S$7=7,SW!E57,IF(cal!$S$7=8,TS!E57,IF(cal!$S$7=9,ExtraTaal1!E57,IF(cal!$S$7=10,ExtraTaal2!E57,IF(cal!$S$7=11,ExtraTaal3!E57,)))))))))))","v":0},{"$f":"IF($S$7=1,NL!F57,IF(cal!$S$7=2,EN!F57,IF(cal!$S$7=3,DE!F57,IF(cal!$S$7=4,FR!F57,IF(cal!$S$7=5,NR!F57,IF(cal!$S$7=6,SP!F57,IF(cal!$S$7=7,SW!F57,IF(cal!$S$7=8,TS!F57,IF(cal!$S$7=9,ExtraTaal1!F57,IF(cal!$S$7=10,ExtraTaal2!F57,IF(cal!$S$7=11,ExtraTaal3!F57,)))))))))))","v":0},{"$f":"IF($S$7=1,NL!G57,IF(cal!$S$7=2,EN!G57,IF(cal!$S$7=3,DE!G57,IF(cal!$S$7=4,FR!G57,IF(cal!$S$7=5,NR!G57,IF(cal!$S$7=6,SP!G57,IF(cal!$S$7=7,SW!G57,IF(cal!$S$7=8,TS!G57,IF(cal!$S$7=9,ExtraTaal1!G57,IF(cal!$S$7=10,ExtraTaal2!G57,IF(cal!$S$7=11,ExtraTaal3!G57,)))))))))))","v":0},{"$f":"IF($S$7=1,NL!H57,IF(cal!$S$7=2,EN!H57,IF(cal!$S$7=3,DE!H57,IF(cal!$S$7=4,FR!H57,IF(cal!$S$7=5,NR!H57,IF(cal!$S$7=6,SP!H57,IF(cal!$S$7=7,SW!H57,IF(cal!$S$7=8,TS!H57,IF(cal!$S$7=9,ExtraTaal1!H57,IF(cal!$S$7=10,ExtraTaal2!H57,IF(cal!$S$7=11,ExtraTaal3!H57,)))))))))))","v":0},{"$f":"IF($S$7=1,NL!I57,IF(cal!$S$7=2,EN!I57,IF(cal!$S$7=3,DE!I57,IF(cal!$S$7=4,FR!I57,IF(cal!$S$7=5,NR!I57,IF(cal!$S$7=6,SP!I57,IF(cal!$S$7=7,SW!I57,IF(cal!$S$7=8,TS!I57,IF(cal!$S$7=9,ExtraTaal1!I57,IF(cal!$S$7=10,ExtraTaal2!I57,IF(cal!$S$7=11,ExtraTaal3!I57,)))))))))))","v":0},{"$f":"IF($S$7=1,NL!J57,IF(cal!$S$7=2,EN!J57,IF(cal!$S$7=3,DE!J57,IF(cal!$S$7=4,FR!J57,IF(cal!$S$7=5,NR!J57,IF(cal!$S$7=6,SP!J57,IF(cal!$S$7=7,SW!J57,IF(cal!$S$7=8,TS!J57,IF(cal!$S$7=9,ExtraTaal1!J57,IF(cal!$S$7=10,ExtraTaal2!J57,IF(cal!$S$7=11,ExtraTaal3!J57,)))))))))))","v":0},{"$f":"IF($S$7=1,NL!K57,IF(cal!$S$7=2,EN!K57,IF(cal!$S$7=3,DE!K57,IF(cal!$S$7=4,FR!K57,IF(cal!$S$7=5,NR!K57,IF(cal!$S$7=6,SP!K57,IF(cal!$S$7=7,SW!K57,IF(cal!$S$7=8,TS!K57,IF(cal!$S$7=9,ExtraTaal1!K57,IF(cal!$S$7=10,ExtraTaal2!K57,IF(cal!$S$7=11,ExtraTaal3!K57,)))))))))))","v":0},{"$f":"IF($S$7=1,NL!L57,IF(cal!$S$7=2,EN!L57,IF(cal!$S$7=3,DE!L57,IF(cal!$S$7=4,FR!L57,IF(cal!$S$7=5,NR!L57,IF(cal!$S$7=6,SP!L57,IF(cal!$S$7=7,SW!L57,IF(cal!$S$7=8,TS!L57,IF(cal!$S$7=9,ExtraTaal1!L57,IF(cal!$S$7=10,ExtraTaal2!L57,IF(cal!$S$7=11,ExtraTaal3!L57,)))))))))))","v":0},{"$f":"IF($S$7=1,NL!M57,IF(cal!$S$7=2,EN!M57,IF(cal!$S$7=3,DE!M57,IF(cal!$S$7=4,FR!M57,IF(cal!$S$7=5,NR!M57,IF(cal!$S$7=6,SP!M57,IF(cal!$S$7=7,SW!M57,IF(cal!$S$7=8,TS!M57,IF(cal!$S$7=9,ExtraTaal1!M57,IF(cal!$S$7=10,ExtraTaal2!M57,IF(cal!$S$7=11,ExtraTaal3!M57,)))))))))))","v":0},{"$f":"IF($S$7=1,NL!N57,IF(cal!$S$7=2,EN!N57,IF(cal!$S$7=3,DE!N57,IF(cal!$S$7=4,FR!N57,IF(cal!$S$7=5,NR!N57,IF(cal!$S$7=6,SP!N57,IF(cal!$S$7=7,SW!N57,IF(cal!$S$7=8,TS!N57,IF(cal!$S$7=9,ExtraTaal1!N57,IF(cal!$S$7=10,ExtraTaal2!N57,IF(cal!$S$7=11,ExtraTaal3!N57,)))))))))))","v":0},{"$f":"IF($S$7=1,NL!O57,IF(cal!$S$7=2,EN!O57,IF(cal!$S$7=3,DE!O57,IF(cal!$S$7=4,FR!O57,IF(cal!$S$7=5,NR!O57,IF(cal!$S$7=6,SP!O57,IF(cal!$S$7=7,SW!O57,IF(cal!$S$7=8,TS!O57,IF(cal!$S$7=9,ExtraTaal1!O57,IF(cal!$S$7=10,ExtraTaal2!O57,IF(cal!$S$7=11,ExtraTaal3!O57,)))))))))))","v":0},"n-value",0,null,null,null,null,null,{"$f":"IF($X$16=1,AE58,IF($X$16=2,AM58,IF($X$16=3,BL58,IF($X$16=4,BE58,IF($X$16=5,CA58,IF($X$16=6,BT58,IF($X$16=7,AX58,)))))))","v":0},{"$f":"IF($X$16=1,AF58,IF($X$16=2,AN58,IF($X$16=3,BM58,IF($X$16=4,BF58,IF($X$16=5,CB58,IF($X$16=6,BU58,IF($X$16=7,AY58,)))))))","v":0},{"$f":"IF($X$16=1,AG58,IF($X$16=2,AO58,IF($X$16=3,BN58,IF($X$16=4,BG58,IF($X$16=5,CC58,IF($X$16=6,BV58,IF($X$16=7,AZ58,)))))))","v":0},{"$f":"IF($X$16=1,AH58,IF($X$16=2,AP58,IF($X$16=3,BO58,IF($X$16=4,BH58,IF($X$16=5,CD58,IF($X$16=6,BW58,IF($X$16=7,BA58,)))))))","v":0},{"$f":"IF($X$16=1,AI58,IF($X$16=2,AQ58,IF($X$16=3,BP58,IF($X$16=4,BI58,IF($X$16=5,CE58,IF($X$16=6,BX58,IF($X$16=7,BB58,)))))))","v":0},{"$f":"IF($X$16=1,AJ58,IF($X$16=2,AR58,IF($X$16=3,BQ58,IF($X$16=4,BJ58,IF($X$16=5,CF58,IF($X$16=6,BY58,IF($X$16=7,BC58,)))))))","v":0},{"$f":"IF($X$16=1,AK58,IF($X$16=2,AS58,IF($X$16=3,BR58,IF($X$16=4,BK58,IF($X$16=5,CG58,IF($X$16=6,BZ58,IF($X$16=7,BD58,)))))))","v":0}]
[null,0.2,2,{"$f":"(X59*($T$11^$Q59))*Watts*CF_Altit","v":0},{"$f":"ROUND(((D59/Watts)/(($S$9-$S$10)*1.163))*$E$14,IF($X$4=1,0,IF($X$4=2,2)))","v":0},{"$f":"($Y$66*(E59/$E$14)^$Y$68)*$F$14","v":{"$error":"#NUM!"}},{"$f":"(Z59*($W$11^R59))*Watts*CF_Altit","v":0},{"$f":"((G59/Watts)/(IF((237.3*LN((RH*EXP(17.27*(Tl_cool/(Tl_cool+237.3))))))/(17.27-LN((RH*EXP(17.27*(Tl_cool/(Tl_cool+237.3))))))<Tavg_cold,1,IF(1/(1+((2258*((0.622/(($Z$11/(1*611*EXP(17.27*(Tavg_cold/(Tavg_cold+237.3))))))-1)*1000-(0.622/(($Z$11/(RH*611*EXP(17.27*(Tl_cool/(Tl_cool+237.3))))))-1)*1000))/(1005*(Tavg_cold-Tl_cool))))*1.039+((-0.000729*$C59+0.001448)*(Tl_cool-Tavg_cold)+(0.016908*$C59-0.033574))*1.039>1,1,1/(1+((2258*((0.622/(($Z$11/(1*611*EXP(17.27*(Tavg_cold/(Tavg_cold+237.3))))))-1)*1000-(0.622/(($Z$11/(RH*611*EXP(17.27*(Tl_cool/(Tl_cool+237.3))))))-1)*1000))/(1005*(Tavg_cold-Tl_cool))))*1.039+((-0.000729*$C59+0.001448)*(Tl_cool-Tavg_cold)+(0.016908*$C59-0.033574))*1.039))))*Watts","v":0},{"$f":"ROUND(((H59/Watts)/((Tr_cool-Tv_cool)*1.163))*$I$14,IF($X$4=1,0,IF($X$4=2,2)))","v":0},{"$f":"($AA$60*(I59/$I$14)^$AA$62)*$J$14","v":{"$error":"#NUM!"}},{"$f":"L59-8","v":-8},{"$f":"AB59","v":0},0,{"$f":"AD59*Cubics","v":0},{"$f":"((($D59/Watts)/(((p_atm*0.028964)/(8.31447*(20+273.15)))*(($N59/3600)/Cubics)*(1005+1870*((0.622)/(((p_atm)/($E$12*Pvs_Heat_in))-1)))))+Tl_heat)*Celc1+Celc2","v":{"$error":"#DIV/0!"}},{"$f":"(Tl_cool-(($G59/Watts)/(1006*$N59*kgss)))*Celc1+Celc2","v":{"$error":"#DIV/0!"}},1,0,null,null,null,null,{"$f":"(H59-G59)/H59","v":{"$error":"#DIV/0!"}},{"$f":"IF($X$16=1,AE59,IF($X$16=2,AM59,IF($X$16=3,BL59,IF($X$16=4,BE59,IF($X$16=5,CA59,IF($X$16=6,BT59,IF($X$16=7,AX59,)))))))","v":0},{"$f":"IF($X$16=1,AF59,IF($X$16=2,AN59,IF($X$16=3,BM59,IF($X$16=4,BF59,IF($X$16=5,CB59,IF($X$16=6,BU59,IF($X$16=7,AY59,)))))))","v":0},{"$f":"IF($X$16=1,AG59,IF($X$16=2,AO59,IF($X$16=3,BN59,IF($X$16=4,BG59,IF($X$16=5,CC59,IF($X$16=6,BV59,IF($X$16=7,AZ59,)))))))","v":0},{"$f":"IF($X$16=1,AH59,IF($X$16=2,AP59,IF($X$16=3,BO59,IF($X$16=4,BH59,IF($X$16=5,CD59,IF($X$16=6,BW59,IF($X$16=7,BA59,)))))))","v":0},{"$f":"IF($X$16=1,AI59,IF($X$16=2,AQ59,IF($X$16=3,BP59,IF($X$16=4,BI59,IF($X$16=5,CE59,IF($X$16=6,BX59,IF($X$16=7,BB59,)))))))","v":0},{"$f":"IF($X$16=1,AJ59,IF($X$16=2,AR59,IF($X$16=3,BQ59,IF($X$16=4,BJ59,IF($X$16=5,CF59,IF($X$16=6,BY59,IF($X$16=7,BC59,)))))))","v":0},{"$f":"IF($X$16=1,AK59,IF($X$16=2,AS59,IF($X$16=3,BR59,IF($X$16=4,BK59,IF($X$16=5,CG59,IF($X$16=6,BZ59,IF($X$16=7,BD59,)))))))","v":0}]
[null,0.4,4,{"$f":"(X60*($T$11^$Q60))*Watts*CF_Altit","v":0},{"$f":"ROUND(((D60/Watts)/(($S$9-$S$10)*1.163))*$E$14,IF($X$4=1,0,IF($X$4=2,2)))","v":0},{"$f":"($Y$66*(E60/$E$14)^$Y$68)*$F$14","v":{"$error":"#NUM!"}},{"$f":"(Z60*($W$11^R60))*Watts*CF_Altit","v":0},{"$f":"((G60/Watts)/(IF((237.3*LN((RH*EXP(17.27*(Tl_cool/(Tl_cool+237.3))))))/(17.27-LN((RH*EXP(17.27*(Tl_cool/(Tl_cool+237.3))))))<Tavg_cold,1,IF(1/(1+((2258*((0.622/(($Z$11/(1*611*EXP(17.27*(Tavg_cold/(Tavg_cold+237.3))))))-1)*1000-(0.622/(($Z$11/(RH*611*EXP(17.27*(Tl_cool/(Tl_cool+237.3))))))-1)*1000))/(1005*(Tavg_cold-Tl_cool))))*1.039+((-0.000729*$C60+0.001448)*(Tl_cool-Tavg_cold)+(0.016908*$C60-0.033574))*1.039>1,1,1/(1+((2258*((0.622/(($Z$11/(1*611*EXP(17.27*(Tavg_cold/(Tavg_cold+237.3))))))-1)*1000-(0.622/(($Z$11/(RH*611*EXP(17.27*(Tl_cool/(Tl_cool+237.3))))))-1)*1000))/(1005*(Tavg_cold-Tl_cool))))*1.039+((-0.000729*$C60+0.001448)*(Tl_cool-Tavg_cold)+(0.016908*$C60-0.033574))*1.039))))*Watts","v":0},{"$f":"ROUND(((H60/Watts)/((Tr_cool-Tv_cool)*1.163))*$I$14,IF($X$4=1,0,IF($X$4=2,2)))","v":0},{"$f":"($AA$60*(I60/$I$14)^$AA$62)*$J$14","v":{"$error":"#NUM!"}},{"$f":"L60-8","v":-8},0,0,{"$f":"AD60*Cubics","v":0},{"$f":"((($D60/Watts)/(((p_atm*0.028964)/(8.31447*(20+273.15)))*(($N60/3600)/Cubics)*(1005+1870*((0.622)/(((p_atm)/($E$12*Pvs_Heat_in))-1)))))+Tl_heat)*Celc1+Celc2","v":{"$error":"#DIV/0!"}},{"$f":"(Tl_cool-(($G60/Watts)/(1006*$N60*kgss)))*Celc1+Celc2","v":{"$error":"#DIV/0!"}},1,0,null,null,null,null,{"$f":"(H60-G60)/H60","v":{"$error":"#DIV/0!"}},{"$f":"IF($X$16=1,AE60,IF($X$16=2,AM60,IF($X$16=3,BL60,IF($X$16=4,BE60,IF($X$16=5,CA60,IF($X$16=6,BT60,IF($X$16=7,AX60,)))))))","v":0},{"$f":"IF($X$16=1,AF60,IF($X$16=2,AN60,IF($X$16=3,BM60,IF($X$16=4,BF60,IF($X$16=5,CB60,IF($X$16=6,BU60,IF($X$16=7,AY60,)))))))","v":0},{"$f":"IF($X$16=1,AG60,IF($X$16=2,AO60,IF($X$16=3,BN60,IF($X$16=4,BG60,IF($X$16=5,CC60,IF($X$16=6,BV60,IF($X$16=7,AZ60,)))))))","v":0},{"$f":"IF($X$16=1,AH60,IF($X$16=2,AP60,IF($X$16=3,BO60,IF($X$16=4,BH60,IF($X$16=5,CD60,IF($X$16=6,BW60,IF($X$16=7,BA60,)))))))","v":0},{"$f":"IF($X$16=1,AI60,IF($X$16=2,AQ60,IF($X$16=3,BP60,IF($X$16=4,BI60,IF($X$16=5,CE60,IF($X$16=6,BX60,IF($X$16=7,BB60,)))))))","v":0},{"$f":"IF($X$16=1,AJ60,IF($X$16=2,AR60,IF($X$16=3,BQ60,IF($X$16=4,BJ60,IF($X$16=5,CF60,IF($X$16=6,BY60,IF($X$16=7,BC60,)))))))","v":0},{"$f":"IF($X$16=1,AK60,IF($X$16=2,AS60,IF($X$16=3,BR60,IF($X$16=4,BK60,IF($X$16=5,CG60,IF($X$16=6,BZ60,IF($X$16=7,BD60,)))))))","v":0}]
[null,0.6,6,{"$f":"(X61*($T$11^$Q61))*Watts*CF_Altit","v":0},{"$f":"ROUND(((D61/Watts)/(($S$9-$S$10)*1.163))*$E$14,IF($X$4=1,0,IF($X$4=2,2)))","v":0},{"$f":"($Y$66*(E61/$E$14)^$Y$68)*$F$14","v":{"$error":"#NUM!"}},{"$f":"(Z61*($W$11^R61))*Watts*CF_Altit","v":0},{"$f":"((G61/Watts)/(IF((237.3*LN((RH*EXP(17.27*(Tl_cool/(Tl_cool+237.3))))))/(17.27-LN((RH*EXP(17.27*(Tl_cool/(Tl_cool+237.3))))))<Tavg_cold,1,IF(1/(1+((2258*((0.622/(($Z$11/(1*611*EXP(17.27*(Tavg_cold/(Tavg_cold+237.3))))))-1)*1000-(0.622/(($Z$11/(RH*611*EXP(17.27*(Tl_cool/(Tl_cool+237.3))))))-1)*1000))/(1005*(Tavg_cold-Tl_cool))))*1.039+((-0.000729*$C61+0.001448)*(Tl_cool-Tavg_cold)+(0.016908*$C61-0.033574))*1.039>1,1,1/(1+((2258*((0.622/(($Z$11/(1*611*EXP(17.27*(Tavg_cold/(Tavg_cold+237.3))))))-1)*1000-(0.622/(($Z$11/(RH*611*EXP(17.27*(Tl_cool/(Tl_cool+237.3))))))-1)*1000))/(1005*(Tavg_cold-Tl_cool))))*1.039+((-0.000729*$C61+0.001448)*(Tl_cool-Tavg_cold)+(0.016908*$C61-0.033574))*1.039))))*Watts","v":0},{"$f":"ROUND(((H61/Watts)/((Tr_cool-Tv_cool)*1.163))*$I$14,IF($X$4=1,0,IF($X$4=2,2)))","v":0},{"$f":"($AA$60*(I61/$I$14)^$AA$62)*$J$14","v":{"$error":"#NUM!"}},{"$f":"L61-8","v":-8},0,0,{"$f":"AD61*Cubics","v":0},{"$f":"((($D61/Watts)/(((p_atm*0.028964)/(8.31447*(20+273.15)))*(($N61/3600)/Cubics)*(1005+1870*((0.622)/(((p_atm)/($E$12*Pvs_Heat_in))-1)))))+Tl_heat)*Celc1+Celc2","v":{"$error":"#DIV/0!"}},{"$f":"(Tl_cool-(($G61/Watts)/(1006*$N61*kgss)))*Celc1+Celc2","v":{"$error":"#DIV/0!"}},1,0,null,null,null,null,{"$f":"(H61-G61)/H61","v":{"$error":"#DIV/0!"}},{"$f":"IF($X$16=1,AE61,IF($X$16=2,AM61,IF($X$16=3,BL61,IF($X$16=4,BE61,IF($X$16=5,CA61,IF($X$16=6,BT61,IF($X$16=7,AX61,)))))))","v":0},{"$f":"IF($X$16=1,AF61,IF($X$16=2,AN61,IF($X$16=3,BM61,IF($X$16=4,BF61,IF($X$16=5,CB61,IF($X$16=6,BU61,IF($X$16=7,AY61,)))))))","v":0},{"$f":"IF($X$16=1,AG61,IF($X$16=2,AO61,IF($X$16=3,BN61,IF($X$16=4,BG61,IF($X$16=5,CC61,IF($X$16=6,BV61,IF($X$16=7,AZ61,)))))))","v":0},{"$f":"IF($X$16=1,AH61,IF($X$16=2,AP61,IF($X$16=3,BO61,IF($X$16=4,BH61,IF($X$16=5,CD61,IF($X$16=6,BW61,IF($X$16=7,BA61,)))))))","v":0},{"$f":"IF($X$16=1,AI61,IF($X$16=2,AQ61,IF($X$16=3,BP61,IF($X$16=4,BI61,IF($X$16=5,CE61,IF($X$16=6,BX61,IF($X$16=7,BB61,)))))))","v":0},{"$f":"IF($X$16=1,AJ61,IF($X$16=2,AR61,IF($X$16=3,BQ61,IF($X$16=4,BJ61,IF($X$16=5,CF61,IF($X$16=6,BY61,IF($X$16=7,BC61,)))))))","v":0},{"$f":"IF($X$16=1,AK61,IF($X$16=2,AS61,IF($X$16=3,BR61,IF($X$16=4,BK61,IF($X$16=5,CG61,IF($X$16=6,BZ61,IF($X$16=7,BD61,)))))))","v":0}]
[null,0.8,8,{"$f":"(X62*($T$11^$Q62))*Watts*CF_Altit","v":0},{"$f":"ROUND(((D62/Watts)/(($S$9-$S$10)*1.163))*$E$14,IF($X$4=1,0,IF($X$4=2,2)))","v":0},{"$f":"($Y$66*(E62/$E$14)^$Y$68)*$F$14","v":{"$error":"#NUM!"}},{"$f":"(Z62*($W$11^R62))*Watts*CF_Altit","v":0},{"$f":"((G62/Watts)/(IF((237.3*LN((RH*EXP(17.27*(Tl_cool/(Tl_cool+237.3))))))/(17.27-LN((RH*EXP(17.27*(Tl_cool/(Tl_cool+237.3))))))<Tavg_cold,1,IF(1/(1+((2258*((0.622/(($Z$11/(1*611*EXP(17.27*(Tavg_cold/(Tavg_cold+237.3))))))-1)*1000-(0.622/(($Z$11/(RH*611*EXP(17.27*(Tl_cool/(Tl_cool+237.3))))))-1)*1000))/(1005*(Tavg_cold-Tl_cool))))*1.039+((-0.000729*$C62+0.001448)*(Tl_cool-Tavg_cold)+(0.016908*$C62-0.033574))*1.039>1,1,1/(1+((2258*((0.622/(($Z$11/(1*611*EXP(17.27*(Tavg_cold/(Tavg_cold+237.3))))))-1)*1000-(0.622/(($Z$11/(RH*611*EXP(17.27*(Tl_cool/(Tl_cool+237.3))))))-1)*1000))/(1005*(Tavg_cold-Tl_cool))))*1.039+((-0.000729*$C62+0.001448)*(Tl_cool-Tavg_cold)+(0.016908*$C62-0.033574))*1.039))))*Watts","v":0},{"$f":"ROUND(((H62/Watts)/((Tr_cool-Tv_cool)*1.163))*$I$14,IF($X$4=1,0,IF($X$4=2,2)))","v":0},{"$f":"($AA$60*(I62/$I$14)^$AA$62)*$J$14","v":{"$error":"#NUM!"}},{"$f":"L62-8","v":-8},0,0,{"$f":"AD62*Cubics","v":0},{"$f":"((($D62/Watts)/(((p_atm*0.028964)/(8.31447*(20+273.15)))*(($N62/3600)/Cubics)*(1005+1870*((0.622)/(((p_atm)/($E$12*Pvs_Heat_in))-1)))))+Tl_heat)*Celc1+Celc2","v":{"$error":"#DIV/0!"}},{"$f":"(Tl_cool-(($G62/Watts)/(1006*$N62*kgss)))*Celc1+Celc2","v":{"$error":"#DIV/0!"}},1,0,null,null,null,null,{"$f":"(H62-G62)/H62","v":{"$error":"#DIV/0!"}},{"$f":"IF($X$16=1,AE62,IF($X$16=2,AM62,IF($X$16=3,BL62,IF($X$16=4,BE62,IF($X$16=5,CA62,IF($X$16=6,BT62,IF($X$16=7,AX62,)))))))","v":0},{"$f":"IF($X$16=1,AF62,IF($X$16=2,AN62,IF($X$16=3,BM62,IF($X$16=4,BF62,IF($X$16=5,CB62,IF($X$16=6,BU62,IF($X$16=7,AY62,)))))))","v":0},{"$f":"IF($X$16=1,AG62,IF($X$16=2,AO62,IF($X$16=3,BN62,IF($X$16=4,BG62,IF($X$16=5,CC62,IF($X$16=6,BV62,IF($X$16=7,AZ62,)))))))","v":0},{"$f":"IF($X$16=1,AH62,IF($X$16=2,AP62,IF($X$16=3,BO62,IF($X$16=4,BH62,IF($X$16=5,CD62,IF($X$16=6,BW62,IF($X$16=7,BA62,)))))))","v":0},{"$f":"IF($X$16=1,AI62,IF($X$16=2,AQ62,IF($X$16=3,BP62,IF($X$16=4,BI62,IF($X$16=5,CE62,IF($X$16=6,BX62,IF($X$16=7,BB62,)))))))","v":0},{"$f":"IF($X$16=1,AJ62,IF($X$16=2,AR62,IF($X$16=3,BQ62,IF($X$16=4,BJ62,IF($X$16=5,CF62,IF($X$16=6,BY62,IF($X$16=7,BC62,)))))))","v":0},{"$f":"IF($X$16=1,AK62,IF($X$16=2,AS62,IF($X$16=3,BR62,IF($X$16=4,BK62,IF($X$16=5,CG62,IF($X$16=6,BZ62,IF($X$16=7,BD62,)))))))","v":0}]
[null,1,10,{"$f":"(X63*($T$11^$Q63))*Watts*CF_Altit","v":0},{"$f":"ROUND(((D63/Watts)/(($S$9-$S$10)*1.163))*$E$14,IF($X$4=1,0,IF($X$4=2,2)))","v":0},{"$f":"($Y$66*(E63/$E$14)^$Y$68)*$F$14","v":{"$error":"#NUM!"}},{"$f":"(Z63*($W$11^R63))*Watts*CF_Altit","v":0},{"$f":"((G63/Watts)/(IF((237.3*LN((RH*EXP(17.27*(Tl_cool/(Tl_cool+237.3))))))/(17.27-LN((RH*EXP(17.27*(Tl_cool/(Tl_cool+237.3))))))<Tavg_cold,1,IF(1/(1+((2258*((0.622/(($Z$11/(1*611*EXP(17.27*(Tavg_cold/(Tavg_cold+237.3))))))-1)*1000-(0.622/(($Z$11/(RH*611*EXP(17.27*(Tl_cool/(Tl_cool+237.3))))))-1)*1000))/(1005*(Tavg_cold-Tl_cool))))*1.039+((-0.000729*$C63+0.001448)*(Tl_cool-Tavg_cold)+(0.016908*$C63-0.033574))*1.039>1,1,1/(1+((2258*((0.622/(($Z$11/(1*611*EXP(17.27*(Tavg_cold/(Tavg_cold+237.3))))))-1)*1000-(0.622/(($Z$11/(RH*611*EXP(17.27*(Tl_cool/(Tl_cool+237.3))))))-1)*1000))/(1005*(Tavg_cold-Tl_cool))))*1.039+((-0.000729*$C63+0.001448)*(Tl_cool-Tavg_cold)+(0.016908*$C63-0.033574))*1.039))))*Watts","v":0},{"$f":"ROUND(((H63/Watts)/((Tr_cool-Tv_cool)*1.163))*$I$14,IF($X$4=1,0,IF($X$4=2,2)))","v":0},{"$f":"($AA$60*(I63/$I$14)^$AA$62)*$J$14","v":{"$error":"#NUM!"}},{"$f":"L63-8","v":-8},0,0,{"$f":"AD63*Cubics","v":0},{"$f":"((($D63/Watts)/(((p_atm*0.028964)/(8.31447*(20+273.15)))*(($N63/3600)/Cubics)*(1005+1870*((0.622)/(((p_atm)/($E$12*Pvs_Heat_in))-1)))))+Tl_heat)*Celc1+Celc2","v":{"$error":"#DIV/0!"}},{"$f":"(Tl_cool-(($G63/Watts)/(1006*$N63*kgss)))*Celc1+Celc2","v":{"$error":"#DIV/0!"}},1,0,null,null,null,null,{"$f":"(H63-G63)/H63","v":{"$error":"#DIV/0!"}},{"$f":"IF($X$16=1,AE63,IF($X$16=2,AM63,IF($X$16=3,BL63,IF($X$16=4,BE63,IF($X$16=5,CA63,IF($X$16=6,BT63,IF($X$16=7,AX63,)))))))","v":0},{"$f":"IF($X$16=1,AF63,IF($X$16=2,AN63,IF($X$16=3,BM63,IF($X$16=4,BF63,IF($X$16=5,CB63,IF($X$16=6,BU63,IF($X$16=7,AY63,)))))))","v":0},{"$f":"IF($X$16=1,AG63,IF($X$16=2,AO63,IF($X$16=3,BN63,IF($X$16=4,BG63,IF($X$16=5,CC63,IF($X$16=6,BV63,IF($X$16=7,AZ63,)))))))","v":0},{"$f":"IF($X$16=1,AH63,IF($X$16=2,AP63,IF($X$16=3,BO63,IF($X$16=4,BH63,IF($X$16=5,CD63,IF($X$16=6,BW63,IF($X$16=7,BA63,)))))))","v":0},{"$f":"IF($X$16=1,AI63,IF($X$16=2,AQ63,IF($X$16=3,BP63,IF($X$16=4,BI63,IF($X$16=5,CE63,IF($X$16=6,BX63,IF($X$16=7,BB63,)))))))","v":0},{"$f":"IF($X$16=1,AJ63,IF($X$16=2,AR63,IF($X$16=3,BQ63,IF($X$16=4,BJ63,IF($X$16=5,CF63,IF($X$16=6,BY63,IF($X$16=7,BC63,)))))))","v":0},{"$f":"IF($X$16=1,AK63,IF($X$16=2,AS63,IF($X$16=3,BR63,IF($X$16=4,BK63,IF($X$16=5,CG63,IF($X$16=6,BZ63,IF($X$16=7,BD63,)))))))","v":0}]
[null,{"$f":"IF($S$7=1,NL!A63,IF(cal!$S$7=2,EN!A63,IF(cal!$S$7=3,DE!A63,IF(cal!$S$7=4,FR!A63,IF(cal!$S$7=5,NR!A63,IF(cal!$S$7=6,SP!A63,IF(cal!$S$7=7,SW!A63,IF(cal!$S$7=8,TS!A63,IF(cal!$S$7=9,ExtraTaal1!A63,IF(cal!$S$7=10,ExtraTaal2!A63,IF(cal!$S$7=11,ExtraTaal3!A63,)))))))))))","v":"Freedom height 0 cm width 0 cm length 0 cm (Type 9)"},{"$f":"IF($S$7=1,NL!B63,IF(cal!$S$7=2,EN!B63,IF(cal!$S$7=3,DE!B63,IF(cal!$S$7=4,FR!B63,IF(cal!$S$7=5,NR!B63,IF(cal!$S$7=6,SP!B63,IF(cal!$S$7=7,SW!B63,IF(cal!$S$7=8,TS!B63,IF(cal!$S$7=9,ExtraTaal1!B63,IF(cal!$S$7=10,ExtraTaal2!B63,IF(cal!$S$7=11,ExtraTaal3!B63,)))))))))))","v":0},{"$f":"IF($S$7=1,NL!C63,IF(cal!$S$7=2,EN!C63,IF(cal!$S$7=3,DE!C63,IF(cal!$S$7=4,FR!C63,IF(cal!$S$7=5,NR!C63,IF(cal!$S$7=6,SP!C63,IF(cal!$S$7=7,SW!C63,IF(cal!$S$7=8,TS!C63,IF(cal!$S$7=9,ExtraTaal1!C63,IF(cal!$S$7=10,ExtraTaal2!C63,IF(cal!$S$7=11,ExtraTaal3!C63,)))))))))))","v":0},{"$f":"IF($S$7=1,NL!D63,IF(cal!$S$7=2,EN!D63,IF(cal!$S$7=3,DE!D63,IF(cal!$S$7=4,FR!D63,IF(cal!$S$7=5,NR!D63,IF(cal!$S$7=6,SP!D63,IF(cal!$S$7=7,SW!D63,IF(cal!$S$7=8,TS!D63,IF(cal!$S$7=9,ExtraTaal1!D63,IF(cal!$S$7=10,ExtraTaal2!D63,IF(cal!$S$7=11,ExtraTaal3!D63,)))))))))))","v":0},{"$f":"IF($S$7=1,NL!E63,IF(cal!$S$7=2,EN!E63,IF(cal!$S$7=3,DE!E63,IF(cal!$S$7=4,FR!E63,IF(cal!$S$7=5,NR!E63,IF(cal!$S$7=6,SP!E63,IF(cal!$S$7=7,SW!E63,IF(cal!$S$7=8,TS!E63,IF(cal!$S$7=9,ExtraTaal1!E63,IF(cal!$S$7=10,ExtraTaal2!E63,IF(cal!$S$7=11,ExtraTaal3!E63,)))))))))))","v":0},{"$f":"IF($S$7=1,NL!F63,IF(cal!$S$7=2,EN!F63,IF(cal!$S$7=3,DE!F63,IF(cal!$S$7=4,FR!F63,IF(cal!$S$7=5,NR!F63,IF(cal!$S$7=6,SP!F63,IF(cal!$S$7=7,SW!F63,IF(cal!$S$7=8,TS!F63,IF(cal!$S$7=9,ExtraTaal1!F63,IF(cal!$S$7=10,ExtraTaal2!F63,IF(cal!$S$7=11,ExtraTaal3!F63,)))))))))))","v":0},{"$f":"IF($S$7=1,NL!G63,IF(cal!$S$7=2,EN!G63,IF(cal!$S$7=3,DE!G63,IF(cal!$S$7=4,FR!G63,IF(cal!$S$7=5,NR!G63,IF(cal!$S$7=6,SP!G63,IF(cal!$S$7=7,SW!G63,IF(cal!$S$7=8,TS!G63,IF(cal!$S$7=9,ExtraTaal1!G63,IF(cal!$S$7=10,ExtraTaal2!G63,IF(cal!$S$7=11,ExtraTaal3!G63,)))))))))))","v":0},{"$f":"IF($S$7=1,NL!H63,IF(cal!$S$7=2,EN!H63,IF(cal!$S$7=3,DE!H63,IF(cal!$S$7=4,FR!H63,IF(cal!$S$7=5,NR!H63,IF(cal!$S$7=6,SP!H63,IF(cal!$S$7=7,SW!H63,IF(cal!$S$7=8,TS!H63,IF(cal!$S$7=9,ExtraTaal1!H63,IF(cal!$S$7=10,ExtraTaal2!H63,IF(cal!$S$7=11,ExtraTaal3!H63,)))))))))))","v":0},{"$f":"IF($S$7=1,NL!I63,IF(cal!$S$7=2,EN!I63,IF(cal!$S$7=3,DE!I63,IF(cal!$S$7=4,FR!I63,IF(cal!$S$7=5,NR!I63,IF(cal!$S$7=6,SP!I63,IF(cal!$S$7=7,SW!I63,IF(cal!$S$7=8,TS!I63,IF(cal!$S$7=9,ExtraTaal1!I63,IF(cal!$S$7=10,ExtraTaal2!I63,IF(cal!$S$7=11,ExtraTaal3!I63,)))))))))))","v":0},{"$f":"IF($S$7=1,NL!J63,IF(cal!$S$7=2,EN!J63,IF(cal!$S$7=3,DE!J63,IF(cal!$S$7=4,FR!J63,IF(cal!$S$7=5,NR!J63,IF(cal!$S$7=6,SP!J63,IF(cal!$S$7=7,SW!J63,IF(cal!$S$7=8,TS!J63,IF(cal!$S$7=9,ExtraTaal1!J63,IF(cal!$S$7=10,ExtraTaal2!J63,IF(cal!$S$7=11,ExtraTaal3!J63,)))))))))))","v":0},{"$f":"IF($S$7=1,NL!K63,IF(cal!$S$7=2,EN!K63,IF(cal!$S$7=3,DE!K63,IF(cal!$S$7=4,FR!K63,IF(cal!$S$7=5,NR!K63,IF(cal!$S$7=6,SP!K63,IF(cal!$S$7=7,SW!K63,IF(cal!$S$7=8,TS!K63,IF(cal!$S$7=9,ExtraTaal1!K63,IF(cal!$S$7=10,ExtraTaal2!K63,IF(cal!$S$7=11,ExtraTaal3!K63,)))))))))))","v":0},{"$f":"IF($S$7=1,NL!L63,IF(cal!$S$7=2,EN!L63,IF(cal!$S$7=3,DE!L63,IF(cal!$S$7=4,FR!L63,IF(cal!$S$7=5,NR!L63,IF(cal!$S$7=6,SP!L63,IF(cal!$S$7=7,SW!L63,IF(cal!$S$7=8,TS!L63,IF(cal!$S$7=9,ExtraTaal1!L63,IF(cal!$S$7=10,ExtraTaal2!L63,IF(cal!$S$7=11,ExtraTaal3!L63,)))))))))))","v":0},{"$f":"IF($S$7=1,NL!M63,IF(cal!$S$7=2,EN!M63,IF(cal!$S$7=3,DE!M63,IF(cal!$S$7=4,FR!M63,IF(cal!$S$7=5,NR!M63,IF(cal!$S$7=6,SP!M63,IF(cal!$S$7=7,SW!M63,IF(cal!$S$7=8,TS!M63,IF(cal!$S$7=9,ExtraTaal1!M63,IF(cal!$S$7=10,ExtraTaal2!M63,IF(cal!$S$7=11,ExtraTaal3!M63,)))))))))))","v":0},{"$f":"IF($S$7=1,NL!N63,IF(cal!$S$7=2,EN!N63,IF(cal!$S$7=3,DE!N63,IF(cal!$S$7=4,FR!N63,IF(cal!$S$7=5,NR!N63,IF(cal!$S$7=6,SP!N63,IF(cal!$S$7=7,SW!N63,IF(cal!$S$7=8,TS!N63,IF(cal!$S$7=9,ExtraTaal1!N63,IF(cal!$S$7=10,ExtraTaal2!N63,IF(cal!$S$7=11,ExtraTaal3!N63,)))))))))))","v":0},{"$f":"IF($S$7=1,NL!O63,IF(cal!$S$7=2,EN!O63,IF(cal!$S$7=3,DE!O63,IF(cal!$S$7=4,FR!O63,IF(cal!$S$7=5,NR!O63,IF(cal!$S$7=6,SP!O63,IF(cal!$S$7=7,SW!O63,IF(cal!$S$7=8,TS!O63,IF(cal!$S$7=9,ExtraTaal1!O63,IF(cal!$S$7=10,ExtraTaal2!O63,IF(cal!$S$7=11,ExtraTaal3!O63,)))))))))))","v":0},"n-value",0,null,null,null,null,null,{"$f":"IF($X$16=1,AE64,IF($X$16=2,AM64,IF($X$16=3,BL64,IF($X$16=4,BE64,IF($X$16=5,CA64,IF($X$16=6,BT64,IF($X$16=7,AX64,)))))))","v":0},{"$f":"IF($X$16=1,AF64,IF($X$16=2,AN64,IF($X$16=3,BM64,IF($X$16=4,BF64,IF($X$16=5,CB64,IF($X$16=6,BU64,IF($X$16=7,AY64,)))))))","v":0},{"$f":"IF($X$16=1,AG64,IF($X$16=2,AO64,IF($X$16=3,BN64,IF($X$16=4,BG64,IF($X$16=5,CC64,IF($X$16=6,BV64,IF($X$16=7,AZ64,)))))))","v":0},{"$f":"IF($X$16=1,AH64,IF($X$16=2,AP64,IF($X$16=3,BO64,IF($X$16=4,BH64,IF($X$16=5,CD64,IF($X$16=6,BW64,IF($X$16=7,BA64,)))))))","v":0},{"$f":"IF($X$16=1,AI64,IF($X$16=2,AQ64,IF($X$16=3,BP64,IF($X$16=4,BI64,IF($X$16=5,CE64,IF($X$16=6,BX64,IF($X$16=7,BB64,)))))))","v":0},{"$f":"IF($X$16=1,AJ64,IF($X$16=2,AR64,IF($X$16=3,BQ64,IF($X$16=4,BJ64,IF($X$16=5,CF64,IF($X$16=6,BY64,IF($X$16=7,BC64,)))))))","v":0},{"$f":"IF($X$16=1,AK64,IF($X$16=2,AS64,IF($X$16=3,BR64,IF($X$16=4,BK64,IF($X$16=5,CG64,IF($X$16=6,BZ64,IF($X$16=7,BD64,)))))))","v":0}]
[null,0.2,2,{"$f":"(X65*($T$11^$Q65))*Watts*CF_Altit","v":0},{"$f":"ROUND(((D65/Watts)/(($S$9-$S$10)*1.163))*$E$14,IF($X$4=1,0,IF($X$4=2,2)))","v":0},{"$f":"($Y$66*(E65/$E$14)^$Y$68)*$F$14","v":{"$error":"#NUM!"}},{"$f":"(Z65*($W$11^R65))*Watts*CF_Altit","v":0},{"$f":"((G65/Watts)/(IF((237.3*LN((RH*EXP(17.27*(Tl_cool/(Tl_cool+237.3))))))/(17.27-LN((RH*EXP(17.27*(Tl_cool/(Tl_cool+237.3))))))<Tavg_cold,1,IF(1/(1+((2258*((0.622/(($Z$11/(1*611*EXP(17.27*(Tavg_cold/(Tavg_cold+237.3))))))-1)*1000-(0.622/(($Z$11/(RH*611*EXP(17.27*(Tl_cool/(Tl_cool+237.3))))))-1)*1000))/(1005*(Tavg_cold-Tl_cool))))*1.039+((-0.000729*$C65+0.001448)*(Tl_cool-Tavg_cold)+(0.016908*$C65-0.033574))*1.039>1,1,1/(1+((2258*((0.622/(($Z$11/(1*611*EXP(17.27*(Tavg_cold/(Tavg_cold+237.3))))))-1)*1000-(0.622/(($Z$11/(RH*611*EXP(17.27*(Tl_cool/(Tl_cool+237.3))))))-1)*1000))/(1005*(Tavg_cold-Tl_cool))))*1.039+((-0.000729*$C65+0.001448)*(Tl_cool-Tavg_cold)+(0.016908*$C65-0.033574))*1.039))))*Watts","v":0},{"$f":"ROUND(((H65/Watts)/((Tr_cool-Tv_cool)*1.163))*$I$14,IF($X$4=1,0,IF($X$4=2,2)))","v":0},{"$f":"($AA$66*(I65/$I$14)^$AA$68)*$J$14","v":{"$error":"#NUM!"}},{"$f":"L65-8","v":-8},{"$f":"AB65","v":0},0,{"$f":"AD65*Cubics","v":0},{"$f":"((($D65/Watts)/(((p_atm*0.028964)/(8.31447*(20+273.15)))*(($N65/3600)/Cubics)*(1005+1870*((0.622)/(((p_atm)/($E$12*Pvs_Heat_in))-1)))))+Tl_heat)*Celc1+Celc2","v":{"$error":"#DIV/0!"}},{"$f":"(Tl_cool-(($G65/Watts)/(1006*$N65*kgss)))*Celc1+Celc2","v":{"$error":"#DIV/0!"}},1,0,null,null,null,null,{"$f":"(H65-G65)/H65","v":{"$error":"#DIV/0!"}},{"$f":"IF($X$16=1,AE65,IF($X$16=2,AM65,IF($X$16=3,BL65,IF($X$16=4,BE65,IF($X$16=5,CA65,IF($X$16=6,BT65,IF($X$16=7,AX65,)))))))","v":0},{"$f":"IF($X$16=1,AF65,IF($X$16=2,AN65,IF($X$16=3,BM65,IF($X$16=4,BF65,IF($X$16=5,CB65,IF($X$16=6,BU65,IF($X$16=7,AY65,)))))))","v":0},{"$f":"IF($X$16=1,AG65,IF($X$16=2,AO65,IF($X$16=3,BN65,IF($X$16=4,BG65,IF($X$16=5,CC65,IF($X$16=6,BV65,IF($X$16=7,AZ65,)))))))","v":0},{"$f":"IF($X$16=1,AH65,IF($X$16=2,AP65,IF($X$16=3,BO65,IF($X$16=4,BH65,IF($X$16=5,CD65,IF($X$16=6,BW65,IF($X$16=7,BA65,)))))))","v":0},{"$f":"IF($X$16=1,AI65,IF($X$16=2,AQ65,IF($X$16=3,BP65,IF($X$16=4,BI65,IF($X$16=5,CE65,IF($X$16=6,BX65,IF($X$16=7,BB65,)))))))","v":0},{"$f":"IF($X$16=1,AJ65,IF($X$16=2,AR65,IF($X$16=3,BQ65,IF($X$16=4,BJ65,IF($X$16=5,CF65,IF($X$16=6,BY65,IF($X$16=7,BC65,)))))))","v":0},{"$f":"IF($X$16=1,AK65,IF($X$16=2,AS65,IF($X$16=3,BR65,IF($X$16=4,BK65,IF($X$16=5,CG65,IF($X$16=6,BZ65,IF($X$16=7,BD65,)))))))","v":0}]
[null,0.4,4,{"$f":"(X66*($T$11^$Q66))*Watts*CF_Altit","v":0},{"$f":"ROUND(((D66/Watts)/(($S$9-$S$10)*1.163))*$E$14,IF($X$4=1,0,IF($X$4=2,2)))","v":0},{"$f":"($Y$66*(E66/$E$14)^$Y$68)*$F$14","v":{"$error":"#NUM!"}},{"$f":"(Z66*($W$11^R66))*Watts*CF_Altit","v":0},{"$f":"((G66/Watts)/(IF((237.3*LN((RH*EXP(17.27*(Tl_cool/(Tl_cool+237.3))))))/(17.27-LN((RH*EXP(17.27*(Tl_cool/(Tl_cool+237.3))))))<Tavg_cold,1,IF(1/(1+((2258*((0.622/(($Z$11/(1*611*EXP(17.27*(Tavg_cold/(Tavg_cold+237.3))))))-1)*1000-(0.622/(($Z$11/(RH*611*EXP(17.27*(Tl_cool/(Tl_cool+237.3))))))-1)*1000))/(1005*(Tavg_cold-Tl_cool))))*1.039+((-0.000729*$C66+0.001448)*(Tl_cool-Tavg_cold)+(0.016908*$C66-0.033574))*1.039>1,1,1/(1+((2258*((0.622/(($Z$11/(1*611*EXP(17.27*(Tavg_cold/(Tavg_cold+237.3))))))-1)*1000-(0.622/(($Z$11/(RH*611*EXP(17.27*(Tl_cool/(Tl_cool+237.3))))))-1)*1000))/(1005*(Tavg_cold-Tl_cool))))*1.039+((-0.000729*$C66+0.001448)*(Tl_cool-Tavg_cold)+(0.016908*$C66-0.033574))*1.039))))*Watts","v":0},{"$f":"ROUND(((H66/Watts)/((Tr_cool-Tv_cool)*1.163))*$I$14,IF($X$4=1,0,IF($X$4=2,2)))","v":0},{"$f":"($AA$66*(I66/$I$14)^$AA$68)*$J$14","v":{"$error":"#NUM!"}},{"$f":"L66-8","v":-8},0,0,{"$f":"AD66*Cubics","v":0},{"$f":"((($D66/Watts)/(((p_atm*0.028964)/(8.31447*(20+273.15)))*(($N66/3600)/Cubics)*(1005+1870*((0.622)/(((p_atm)/($E$12*Pvs_Heat_in))-1)))))+Tl_heat)*Celc1+Celc2","v":{"$error":"#DIV/0!"}},{"$f":"(Tl_cool-(($G66/Watts)/(1006*$N66*kgss)))*Celc1+Celc2","v":{"$error":"#DIV/0!"}},1,0,null,null,null,null,{"$f":"(H66-G66)/H66","v":{"$error":"#DIV/0!"}},{"$f":"IF($X$16=1,AE66,IF($X$16=2,AM66,IF($X$16=3,BL66,IF($X$16=4,BE66,IF($X$16=5,CA66,IF($X$16=6,BT66,IF($X$16=7,AX66,)))))))","v":0},{"$f":"IF($X$16=1,AF66,IF($X$16=2,AN66,IF($X$16=3,BM66,IF($X$16=4,BF66,IF($X$16=5,CB66,IF($X$16=6,BU66,IF($X$16=7,AY66,)))))))","v":0},{"$f":"IF($X$16=1,AG66,IF($X$16=2,AO66,IF($X$16=3,BN66,IF($X$16=4,BG66,IF($X$16=5,CC66,IF($X$16=6,BV66,IF($X$16=7,AZ66,)))))))","v":0},{"$f":"IF($X$16=1,AH66,IF($X$16=2,AP66,IF($X$16=3,BO66,IF($X$16=4,BH66,IF($X$16=5,CD66,IF($X$16=6,BW66,IF($X$16=7,BA66,)))))))","v":0},{"$f":"IF($X$16=1,AI66,IF($X$16=2,AQ66,IF($X$16=3,BP66,IF($X$16=4,BI66,IF($X$16=5,CE66,IF($X$16=6,BX66,IF($X$16=7,BB66,)))))))","v":0},{"$f":"IF($X$16=1,AJ66,IF($X$16=2,AR66,IF($X$16=3,BQ66,IF($X$16=4,BJ66,IF($X$16=5,CF66,IF($X$16=6,BY66,IF($X$16=7,BC66,)))))))","v":0},{"$f":"IF($X$16=1,AK66,IF($X$16=2,AS66,IF($X$16=3,BR66,IF($X$16=4,BK66,IF($X$16=5,CG66,IF($X$16=6,BZ66,IF($X$16=7,BD66,)))))))","v":0}]
[null,0.6,6,{"$f":"(X67*($T$11^$Q67))*Watts*CF_Altit","v":0},{"$f":"ROUND(((D67/Watts)/(($S$9-$S$10)*1.163))*$E$14,IF($X$4=1,0,IF($X$4=2,2)))","v":0},{"$f":"($Y$66*(E67/$E$14)^$Y$68)*$F$14","v":{"$error":"#NUM!"}},{"$f":"(Z67*($W$11^R67))*Watts*CF_Altit","v":0},{"$f":"((G67/Watts)/(IF((237.3*LN((RH*EXP(17.27*(Tl_cool/(Tl_cool+237.3))))))/(17.27-LN((RH*EXP(17.27*(Tl_cool/(Tl_cool+237.3))))))<Tavg_cold,1,IF(1/(1+((2258*((0.622/(($Z$11/(1*611*EXP(17.27*(Tavg_cold/(Tavg_cold+237.3))))))-1)*1000-(0.622/(($Z$11/(RH*611*EXP(17.27*(Tl_cool/(Tl_cool+237.3))))))-1)*1000))/(1005*(Tavg_cold-Tl_cool))))*1.039+((-0.000729*$C67+0.001448)*(Tl_cool-Tavg_cold)+(0.016908*$C67-0.033574))*1.039>1,1,1/(1+((2258*((0.622/(($Z$11/(1*611*EXP(17.27*(Tavg_cold/(Tavg_cold+237.3))))))-1)*1000-(0.622/(($Z$11/(RH*611*EXP(17.27*(Tl_cool/(Tl_cool+237.3))))))-1)*1000))/(1005*(Tavg_cold-Tl_cool))))*1.039+((-0.000729*$C67+0.001448)*(Tl_cool-Tavg_cold)+(0.016908*$C67-0.033574))*1.039))))*Watts","v":0},{"$f":"ROUND(((H67/Watts)/((Tr_cool-Tv_cool)*1.163))*$I$14,IF($X$4=1,0,IF($X$4=2,2)))","v":0},{"$f":"($AA$66*(I67/$I$14)^$AA$68)*$J$14","v":{"$error":"#NUM!"}},{"$f":"L67-8","v":-8},0,0,{"$f":"AD67*Cubics","v":0},{"$f":"((($D67/Watts)/(((p_atm*0.028964)/(8.31447*(20+273.15)))*(($N67/3600)/Cubics)*(1005+1870*((0.622)/(((p_atm)/($E$12*Pvs_Heat_in))-1)))))+Tl_heat)*Celc1+Celc2","v":{"$error":"#DIV/0!"}},{"$f":"(Tl_cool-(($G67/Watts)/(1006*$N67*kgss)))*Celc1+Celc2","v":{"$error":"#DIV/0!"}},1,0,null,null,null,null,{"$f":"(H67-G67)/H67","v":{"$error":"#DIV/0!"}},{"$f":"IF($X$16=1,AE67,IF($X$16=2,AM67,IF($X$16=3,BL67,IF($X$16=4,BE67,IF($X$16=5,CA67,IF($X$16=6,BT67,IF($X$16=7,AX67,)))))))","v":0},{"$f":"IF($X$16=1,AF67,IF($X$16=2,AN67,IF($X$16=3,BM67,IF($X$16=4,BF67,IF($X$16=5,CB67,IF($X$16=6,BU67,IF($X$16=7,AY67,)))))))","v":0},{"$f":"IF($X$16=1,AG67,IF($X$16=2,AO67,IF($X$16=3,BN67,IF($X$16=4,BG67,IF($X$16=5,CC67,IF($X$16=6,BV67,IF($X$16=7,AZ67,)))))))","v":0},{"$f":"IF($X$16=1,AH67,IF($X$16=2,AP67,IF($X$16=3,BO67,IF($X$16=4,BH67,IF($X$16=5,CD67,IF($X$16=6,BW67,IF($X$16=7,BA67,)))))))","v":0},{"$f":"IF($X$16=1,AI67,IF($X$16=2,AQ67,IF($X$16=3,BP67,IF($X$16=4,BI67,IF($X$16=5,CE67,IF($X$16=6,BX67,IF($X$16=7,BB67,)))))))","v":0},{"$f":"IF($X$16=1,AJ67,IF($X$16=2,AR67,IF($X$16=3,BQ67,IF($X$16=4,BJ67,IF($X$16=5,CF67,IF($X$16=6,BY67,IF($X$16=7,BC67,)))))))","v":0},{"$f":"IF($X$16=1,AK67,IF($X$16=2,AS67,IF($X$16=3,BR67,IF($X$16=4,BK67,IF($X$16=5,CG67,IF($X$16=6,BZ67,IF($X$16=7,BD67,)))))))","v":0}]
[null,0.8,8,{"$f":"(X68*($T$11^$Q68))*Watts*CF_Altit","v":0},{"$f":"ROUND(((D68/Watts)/(($S$9-$S$10)*1.163))*$E$14,IF($X$4=1,0,IF($X$4=2,2)))","v":0},{"$f":"($Y$66*(E68/$E$14)^$Y$68)*$F$14","v":{"$error":"#NUM!"}},{"$f":"(Z68*($W$11^R68))*Watts*CF_Altit","v":0},{"$f":"((G68/Watts)/(IF((237.3*LN((RH*EXP(17.27*(Tl_cool/(Tl_cool+237.3))))))/(17.27-LN((RH*EXP(17.27*(Tl_cool/(Tl_cool+237.3))))))<Tavg_cold,1,IF(1/(1+((2258*((0.622/(($Z$11/(1*611*EXP(17.27*(Tavg_cold/(Tavg_cold+237.3))))))-1)*1000-(0.622/(($Z$11/(RH*611*EXP(17.27*(Tl_cool/(Tl_cool+237.3))))))-1)*1000))/(1005*(Tavg_cold-Tl_cool))))*1.039+((-0.000729*$C68+0.001448)*(Tl_cool-Tavg_cold)+(0.016908*$C68-0.033574))*1.039>1,1,1/(1+((2258*((0.622/(($Z$11/(1*611*EXP(17.27*(Tavg_cold/(Tavg_cold+237.3))))))-1)*1000-(0.622/(($Z$11/(RH*611*EXP(17.27*(Tl_cool/(Tl_cool+237.3))))))-1)*1000))/(1005*(Tavg_cold-Tl_cool))))*1.039+((-0.000729*$C68+0.001448)*(Tl_cool-Tavg_cold)+(0.016908*$C68-0.033574))*1.039))))*Watts","v":0},{"$f":"ROUND(((H68/Watts)/((Tr_cool-Tv_cool)*1.163))*$I$14,IF($X$4=1,0,IF($X$4=2,2)))","v":0},{"$f":"($AA$66*(I68/$I$14)^$AA$68)*$J$14","v":{"$error":"#NUM!"}},{"$f":"L68-8","v":-8},0,0,{"$f":"AD68*Cubics","v":0},{"$f":"((($D68/Watts)/(((p_atm*0.028964)/(8.31447*(20+273.15)))*(($N68/3600)/Cubics)*(1005+1870*((0.622)/(((p_atm)/($E$12*Pvs_Heat_in))-1)))))+Tl_heat)*Celc1+Celc2","v":{"$error":"#DIV/0!"}},{"$f":"(Tl_cool-(($G68/Watts)/(1006*$N68*kgss)))*Celc1+Celc2","v":{"$error":"#DIV/0!"}},1,0,null,null,null,null,{"$f":"(H68-G68)/H68","v":{"$error":"#DIV/0!"}},{"$f":"IF($X$16=1,AE68,IF($X$16=2,AM68,IF($X$16=3,BL68,IF($X$16=4,BE68,IF($X$16=5,CA68,IF($X$16=6,BT68,IF($X$16=7,AX68,)))))))","v":0},{"$f":"IF($X$16=1,AF68,IF($X$16=2,AN68,IF($X$16=3,BM68,IF($X$16=4,BF68,IF($X$16=5,CB68,IF($X$16=6,BU68,IF($X$16=7,AY68,)))))))","v":0},{"$f":"IF($X$16=1,AG68,IF($X$16=2,AO68,IF($X$16=3,BN68,IF($X$16=4,BG68,IF($X$16=5,CC68,IF($X$16=6,BV68,IF($X$16=7,AZ68,)))))))","v":0},{"$f":"IF($X$16=1,AH68,IF($X$16=2,AP68,IF($X$16=3,BO68,IF($X$16=4,BH68,IF($X$16=5,CD68,IF($X$16=6,BW68,IF($X$16=7,BA68,)))))))","v":0},{"$f":"IF($X$16=1,AI68,IF($X$16=2,AQ68,IF($X$16=3,BP68,IF($X$16=4,BI68,IF($X$16=5,CE68,IF($X$16=6,BX68,IF($X$16=7,BB68,)))))))","v":0},{"$f":"IF($X$16=1,AJ68,IF($X$16=2,AR68,IF($X$16=3,BQ68,IF($X$16=4,BJ68,IF($X$16=5,CF68,IF($X$16=6,BY68,IF($X$16=7,BC68,)))))))","v":0},{"$f":"IF($X$16=1,AK68,IF($X$16=2,AS68,IF($X$16=3,BR68,IF($X$16=4,BK68,IF($X$16=5,CG68,IF($X$16=6,BZ68,IF($X$16=7,BD68,)))))))","v":0}]
[null,1,10,{"$f":"(X69*($T$11^$Q69))*Watts*CF_Altit","v":0},{"$f":"ROUND(((D69/Watts)/(($S$9-$S$10)*1.163))*$E$14,IF($X$4=1,0,IF($X$4=2,2)))","v":0},{"$f":"($Y$66*(E69/$E$14)^$Y$68)*$F$14","v":{"$error":"#NUM!"}},{"$f":"(Z69*($W$11^R69))*Watts*CF_Altit","v":0},{"$f":"((G69/Watts)/(IF((237.3*LN((RH*EXP(17.27*(Tl_cool/(Tl_cool+237.3))))))/(17.27-LN((RH*EXP(17.27*(Tl_cool/(Tl_cool+237.3))))))<Tavg_cold,1,IF(1/(1+((2258*((0.622/(($Z$11/(1*611*EXP(17.27*(Tavg_cold/(Tavg_cold+237.3))))))-1)*1000-(0.622/(($Z$11/(RH*611*EXP(17.27*(Tl_cool/(Tl_cool+237.3))))))-1)*1000))/(1005*(Tavg_cold-Tl_cool))))*1.039+((-0.000729*$C69+0.001448)*(Tl_cool-Tavg_cold)+(0.016908*$C69-0.033574))*1.039>1,1,1/(1+((2258*((0.622/(($Z$11/(1*611*EXP(17.27*(Tavg_cold/(Tavg_cold+237.3))))))-1)*1000-(0.622/(($Z$11/(RH*611*EXP(17.27*(Tl_cool/(Tl_cool+237.3))))))-1)*1000))/(1005*(Tavg_cold-Tl_cool))))*1.039+((-0.000729*$C69+0.001448)*(Tl_cool-Tavg_cold)+(0.016908*$C69-0.033574))*1.039))))*Watts","v":0},{"$f":"ROUND(((H69/Watts)/((Tr_cool-Tv_cool)*1.163))*$I$14,IF($X$4=1,0,IF($X$4=2,2)))","v":0},{"$f":"($AA$66*(I69/$I$14)^$AA$68)*$J$14","v":{"$error":"#NUM!"}},{"$f":"L69-8","v":-8},0,0,{"$f":"AD69*Cubics","v":0},{"$f":"((($D69/Watts)/(((p_atm*0.028964)/(8.31447*(20+273.15)))*(($N69/3600)/Cubics)*(1005+1870*((0.622)/(((p_atm)/($E$12*Pvs_Heat_in))-1)))))+Tl_heat)*Celc1+Celc2","v":{"$error":"#DIV/0!"}},{"$f":"(Tl_cool-(($G69/Watts)/(1006*$N69*kgss)))*Celc1+Celc2","v":{"$error":"#DIV/0!"}},1,0,null,null,null,null,{"$f":"(H69-G69)/H69","v":{"$error":"#DIV/0!"}},{"$f":"IF($X$16=1,AE69,IF($X$16=2,AM69,IF($X$16=3,BL69,IF($X$16=4,BE69,IF($X$16=5,CA69,IF($X$16=6,BT69,IF($X$16=7,AX69,)))))))","v":0},{"$f":"IF($X$16=1,AF69,IF($X$16=2,AN69,IF($X$16=3,BM69,IF($X$16=4,BF69,IF($X$16=5,CB69,IF($X$16=6,BU69,IF($X$16=7,AY69,)))))))","v":0},{"$f":"IF($X$16=1,AG69,IF($X$16=2,AO69,IF($X$16=3,BN69,IF($X$16=4,BG69,IF($X$16=5,CC69,IF($X$16=6,BV69,IF($X$16=7,AZ69,)))))))","v":0},{"$f":"IF($X$16=1,AH69,IF($X$16=2,AP69,IF($X$16=3,BO69,IF($X$16=4,BH69,IF($X$16=5,CD69,IF($X$16=6,BW69,IF($X$16=7,BA69,)))))))","v":0},{"$f":"IF($X$16=1,AI69,IF($X$16=2,AQ69,IF($X$16=3,BP69,IF($X$16=4,BI69,IF($X$16=5,CE69,IF($X$16=6,BX69,IF($X$16=7,BB69,)))))))","v":0},{"$f":"IF($X$16=1,AJ69,IF($X$16=2,AR69,IF($X$16=3,BQ69,IF($X$16=4,BJ69,IF($X$16=5,CF69,IF($X$16=6,BY69,IF($X$16=7,BC69,)))))))","v":0},{"$f":"IF($X$16=1,AK69,IF($X$16=2,AS69,IF($X$16=3,BR69,IF($X$16=4,BK69,IF($X$16=5,CG69,IF($X$16=6,BZ69,IF($X$16=7,BD69,)))))))","v":0}]
[null,{"$f":"IF($S$7=1,NL!A69,IF(cal!$S$7=2,EN!A69,IF(cal!$S$7=3,DE!A69,IF(cal!$S$7=4,FR!A69,IF(cal!$S$7=5,NR!A69,IF(cal!$S$7=6,SP!A69,IF(cal!$S$7=7,SW!A69,IF(cal!$S$7=8,TS!A69,IF(cal!$S$7=9,ExtraTaal1!A69,IF(cal!$S$7=10,ExtraTaal2!A69,IF(cal!$S$7=11,ExtraTaal3!A69,)))))))))))","v":"*Values according to EN 16430"},null,null,null,null,null,null,null,null,null,null,null,{"$f":"Freedom!P71","v":"v2022-08-26"},null,null,null,null,null,null,null,null,null,{"$f":"IF($X$16=1,AE70,IF($X$16=2,AM70,IF($X$16=3,BL70,IF($X$16=4,BE70,IF($X$16=5,CA70,IF($X$16=6,BT70,IF($X$16=7,AX70,)))))))","v":0},{"$f":"IF($X$16=1,AF70,IF($X$16=2,AN70,IF($X$16=3,BM70,IF($X$16=4,BF70,IF($X$16=5,CB70,IF($X$16=6,BU70,IF($X$16=7,AY70,)))))))","v":0},{"$f":"IF($X$16=1,AG70,IF($X$16=2,AO70,IF($X$16=3,BN70,IF($X$16=4,BG70,IF($X$16=5,CC70,IF($X$16=6,BV70,IF($X$16=7,AZ70,)))))))","v":0},{"$f":"IF($X$16=1,AH70,IF($X$16=2,AP70,IF($X$16=3,BO70,IF($X$16=4,BH70,IF($X$16=5,CD70,IF($X$16=6,BW70,IF($X$16=7,BA70,)))))))","v":0},{"$f":"IF($X$16=1,AI70,IF($X$16=2,AQ70,IF($X$16=3,BP70,IF($X$16=4,BI70,IF($X$16=5,CE70,IF($X$16=6,BX70,IF($X$16=7,BB70,)))))))","v":0},{"$f":"IF($X$16=1,AJ70,IF($X$16=2,AR70,IF($X$16=3,BQ70,IF($X$16=4,BJ70,IF($X$16=5,CF70,IF($X$16=6,BY70,IF($X$16=7,BC70,)))))))","v":0},{"$f":"IF($X$16=1,AK70,IF($X$16=2,AS70,IF($X$16=3,BR70,IF($X$16=4,BK70,IF($X$16=5,CG70,IF($X$16=6,BZ70,IF($X$16=7,BD70,)))))))","v":0}]
[null,{"$f":"IF($S$7=1,NL!A70,IF(cal!$S$7=2,EN!A70,IF(cal!$S$7=3,DE!A70,IF(cal!$S$7=4,FR!A70,IF(cal!$S$7=5,NR!A70,IF(cal!$S$7=6,SP!A70,IF(cal!$S$7=7,SW!A70,IF(cal!$S$7=8,TS!A70,IF(cal!$S$7=9,ExtraTaal1!A70,IF(cal!$S$7=10,ExtraTaal2!A70,IF(cal!$S$7=11,ExtraTaal3!A70,)))))))))))","v":"**Sound power according to ISO 3741:2010"}]
[null,{"$f":"IF($S$7=1,NL!A71,IF(cal!$S$7=2,EN!A71,IF(cal!$S$7=3,DE!A71,IF(cal!$S$7=4,FR!A71,IF(cal!$S$7=5,NR!A71,IF(cal!$S$7=6,SP!A71,IF(cal!$S$7=7,SW!A71,IF(cal!$S$7=8,TS!A71,IF(cal!$S$7=9,ExtraTaal1!A71,IF(cal!$S$7=10,ExtraTaal2!A71,IF(cal!$S$7=11,ExtraTaal3!A71,)))))))))))","v":"***Sound pressure with an assumed room damping of 8dB(A)"}]

{"sheet":"NL","index":2,"n_rows":71,"n_cols":18,"rows_kept":71,"cut":false,"hidden":true,"merged":[[50,0,50,12],[62,0,62,12],[7,0,7,2],[7,5,7,8],[8,0,8,2],[8,5,8,8],[9,0,9,2],[9,5,9,8],[26,0,26,12],[32,0,32,12],[38,0,38,12],[44,0,44,12],[56,0,56,12],[7,11,7,12],[5,11,5,12],[6,11,6,12],[10,5,10,7],[14,0,14,12],[20,0,20,12]]}
[]
["Invulformulier"]
[]
["Randvoorwaarden"]
[]
["Temperaturen",null,null,null,null,null,null,null,null,null,null,"Geplaatste hoogte"]
["Verwarmen:",null,null,null,null,"Koelen:",null,null,null,null,null,null,null,null,null,null,"Kopieer alle data"]
[{"$f":"\"Aanvoertemp.\"","v":"Aanvoertemp."},null,null,{"$f":"cal!E9","v":75},{"$f":"IF(cal!$X$4=1,\"°C\",IF(cal!$X$4=2,\"°F\"))","v":"°C"},{"$f":"A8","v":"Aanvoertemp."},null,null,null,{"$f":"cal!K9","v":16},{"$f":"E8","v":"°C"},"Eenheidsstelsel",null,null,null,null,"SI-eenheden"]
[{"$f":"\"Retourtemp.\"","v":"Retourtemp."},null,null,{"$f":"cal!E10","v":65},{"$f":"E8","v":"°C"},{"$f":"A9","v":"Retourtemp."},null,null,null,{"$f":"cal!K10","v":18},{"$f":"E8","v":"°C"},null,null,null,null,null,"Imperiale-eenheden"]
[{"$f":"\"Ruimtetemp.\"","v":"Ruimtetemp."},null,null,{"$f":"cal!E11","v":20},{"$f":"E8","v":"°C"},{"$f":"A10","v":"Ruimtetemp."},null,null,null,{"$f":"cal!K11","v":27},{"$f":"E8","v":"°C"}]
[null,null,null,null,null,"Relatieve vochtigheid",null,null,null,{"$f":"cal!K12","v":0.5}]
[]
[]
["Snelheidsniveau:","Stuurspanning: [V]",{"$f":"CONCATENATE(\"Warmteafgifte * \",ROUND(D8,0),\"/\",ROUND(D9,0),\"/\",ROUND(D10,0),\" [\"&IF(cal!$X$4=1,\"W\",IF(cal!$X$4=2,\"Btu/h\"))&\"]\")","v":"Warmteafgifte * 75/65/20 [W]"},{"$f":"\"Waterdebiet, verwarming [\"&IF(cal!$X$4=1,\"l/h\",IF(cal!$X$4=2,\"GPM\"))&\"]\"","v":"Waterdebiet, verwarming [l/h]"},{"$f":"\"Waterzijdig drukverlies [\"&IF(cal!$X$4=1,\"kPa\",IF(cal!$X$4=2,\"inH2O\"))&\"]\"","v":"Waterzijdig drukverlies [kPa]"},{"$f":"CONCATENATE(\"Voelb. Koelcapaciteit * \",ROUND(J8,0),\"/\",,ROUND(J9,0),\"/\",,ROUND(J10,0),\" [\"&IF(cal!$X$4=1,\"W\",IF(cal!$X$4=2,\"Btu/h\"))&\"]\")","v":"Voelb. Koelcapaciteit * 16/18/27 [W]"},{"$f":"CONCATENATE(\"Tot. koelcapaciteit \",,ROUND(J8,0),\"/\",,ROUND(J9,0),\"/\",,ROUND(J10,0),\" [\"&IF(cal!$X$4=1,\"W\",IF(cal!$X$4=2,\"Btu/h\"))&\"]\")","v":"Tot. koelcapaciteit 16/18/27 [W]"},{"$f":"\"Waterdebiet, koeling [\"&IF(cal!$X$4=1,\"l/h\",IF(cal!$X$4=2,\"GPM\"))&\"]\"","v":"Waterdebiet, koeling [l/h]"},{"$f":"\"Waterzijdig drukverlies [\"&IF(cal!$X$4=1,\"kPa\",IF(cal!$X$4=2,\"inH2O\"))&\"]\"","v":"Waterzijdig drukverlies [kPa]"},"Geluidsdruk *** [dB(A)]","Geluidsvermogen ** [dB(A)]","Opgenomen elektr. vermogen [W]",{"$f":"\"Luchtdebiet [\"&IF(cal!$X$4=1,\"m³/h\",IF(cal!$X$4=2,\"CFM\"))&\"]\"","v":"Luchtdebiet [m³/h]"},{"$f":"\"Uitblaastemp. verwarming [\"&IF(cal!$X$4=1,\"°C\",IF(cal!$X$4=2,\"°F\"))&\"]\"","v":"Uitblaastemp. verwarming [°C]"},{"$f":"\"Uitblaastemp. koeling [\"&IF(cal!$X$4=1,\"°C\",IF(cal!$X$4=2,\"°F\"))&\"]\"","v":"Uitblaastemp. koeling [°C]"}]
[{"$f":"cal!$Z$1&\" \"&$R$15&\" \"&ROUND(cal!Y22,1)&IF(cal!$X$4=1,\" cm\",IF(cal!$X$4=2,\" in\"))&\" \"&$R$16&\" \"&ROUND(cal!AA22,1)&IF(cal!$X$4=1,\" cm\",IF(cal!$X$4=2,\" in\"))&\" \"&$R$17&\" \"&ROUND(cal!AC22,1)&IF(cal!$X$4=1,\" cm\",IF(cal!$X$4=2,\" in\"))&\" (Type 1)\"","v":"Freedom hoogte 20 cm breedte 19 cm lengte 74 cm (Type 1)"},null,null,null,null,null,null,null,null,null,null,null,null,null,null,null,"Temp.","hoogte"]
[null,null,null,null,null,null,null,null,null,null,null,null,null,null,null,null,"verw.!","breedte"]
[null,null,null,null,null,null,null,null,null,null,null,null,null,null,null,null,"koelen!","lengte"]
[]
[]
[]
[{"$f":"cal!$Z$1&\" \"&$R$15&\" \"&ROUND(cal!Y28,1)&IF(cal!$X$4=1,\" cm\",IF(cal!$X$4=2,\" in\"))&\" \"&$R$16&\" \"&ROUND(cal!AA28,1)&IF(cal!$X$4=1,\" cm\",IF(cal!$X$4=2,\" in\"))&\" \"&$R$17&\" \"&ROUND(cal!AC28,1)&IF(cal!$X$4=1,\" cm\",IF(cal!$X$4=2,\" in\"))&\" (Type 2)\"","v":"Freedom hoogte 20 cm breedte 19 cm lengte 110 cm (Type 2)"}]
[]
[]
[]
[]
[]
[{"$f":"cal!$Z$1&\" \"&$R$15&\" \"&ROUND(cal!Y34,1)&IF(cal!$X$4=1,\" cm\",IF(cal!$X$4=2,\" in\"))&\" \"&$R$16&\" \"&ROUND(cal!AA34,1)&IF(cal!$X$4=1,\" cm\",IF(cal!$X$4=2,\" in\"))&\" \"&$R$17&\" \"&ROUND(cal!AC34,1)&IF(cal!$X$4=1,\" cm\",IF(cal!$X$4=2,\" in\"))&\" (Type 3)\"","v":"Freedom hoogte 20 cm breedte 19 cm lengte 145 cm (Type 3)"}]
[]
[]
[]
[]
[]
[{"$f":"cal!$Z$1&\" \"&$R$15&\" \"&ROUND(cal!Y40,1)&IF(cal!$X$4=1,\" cm\",IF(cal!$X$4=2,\" in\"))&\" \"&$R$16&\" \"&ROUND(cal!AA40,1)&IF(cal!$X$4=1,\" cm\",IF(cal!$X$4=2,\" in\"))&\" \"&$R$17&\" \"&ROUND(cal!AC40,1)&IF(cal!$X$4=1,\" cm\",IF(cal!$X$4=2,\" in\"))&\" (Type 4)\"","v":"Freedom hoogte 20 cm breedte 19 cm lengte 181 cm (Type 4)"}]
[]
[]
[]
[]
[]
[{"$f":"cal!$Z$1&\" \"&$R$15&\" \"&ROUND(cal!Y46,1)&IF(cal!$X$4=1,\" cm\",IF(cal!$X$4=2,\" in\"))&\" \"&$R$16&\" \"&ROUND(cal!AA46,1)&IF(cal!$X$4=1,\" cm\",IF(cal!$X$4=2,\" in\"))&\" \"&$R$17&\" \"&ROUND(cal!AC46,1)&IF(cal!$X$4=1,\" cm\",IF(cal!$X$4=2,\" in\"))&\" (Type 5)\"","v":"Freedom hoogte 0 cm breedte 0 cm lengte 0 cm (Type 5)"}]
[]
[]
[]
[]
[]
[{"$f":"cal!$Z$1&\" \"&$R$15&\" \"&ROUND(cal!Y52,1)&IF(cal!$X$4=1,\" cm\",IF(cal!$X$4=2,\" in\"))&\" \"&$R$16&\" \"&ROUND(cal!AA52,1)&IF(cal!$X$4=1,\" cm\",IF(cal!$X$4=2,\" in\"))&\" \"&$R$17&\" \"&ROUND(cal!AC52,1)&IF(cal!$X$4=1,\" cm\",IF(cal!$X$4=2,\" in\"))&\" (Type 6)\"","v":"Freedom hoogte 0 cm breedte 0 cm lengte 0 cm (Type 6)"}]
[]
[]
[]
[]
[]
[{"$f":"cal!$Z$1&\" \"&$R$15&\" \"&ROUND(cal!Y58,1)&IF(cal!$X$4=1,\" cm\",IF(cal!$X$4=2,\" in\"))&\" \"&$R$16&\" \"&ROUND(cal!AA58,1)&IF(cal!$X$4=1,\" cm\",IF(cal!$X$4=2,\" in\"))&\" \"&$R$17&\" \"&ROUND(cal!AC58,1)&IF(cal!$X$4=1,\" cm\",IF(cal!$X$4=2,\" in\"))&\" (Type 7)\"","v":"Freedom hoogte 0 cm breedte 0 cm lengte 0 cm (Type 7)"}]
[]
[]
[]
[]
[]
[{"$f":"cal!$Z$1&\" \"&$R$15&\" \"&ROUND(cal!Y64,1)&IF(cal!$X$4=1,\" cm\",IF(cal!$X$4=2,\" in\"))&\" \"&$R$16&\" \"&ROUND(cal!AA64,1)&IF(cal!$X$4=1,\" cm\",IF(cal!$X$4=2,\" in\"))&\" \"&$R$17&\" \"&ROUND(cal!AC64,1)&IF(cal!$X$4=1,\" cm\",IF(cal!$X$4=2,\" in\"))&\" (Type 8)\"","v":"Freedom hoogte 0 cm breedte 0 cm lengte 0 cm (Type 8)"}]
[]
[]
[]
[]
[]
[{"$f":"cal!$Z$1&\" \"&$R$15&\" \"&ROUND(cal!Y70,1)&IF(cal!$X$4=1,\" cm\",IF(cal!$X$4=2,\" in\"))&\" \"&$R$16&\" \"&ROUND(cal!AA70,1)&IF(cal!$X$4=1,\" cm\",IF(cal!$X$4=2,\" in\"))&\" \"&$R$17&\" \"&ROUND(cal!AC70,1)&IF(cal!$X$4=1,\" cm\",IF(cal!$X$4=2,\" in\"))&\" (Type 9)\"","v":"Freedom hoogte 0 cm breedte 0 cm lengte 0 cm (Type 9)"}]
[]
[]
[]
[]
[]
["*Waardes gemeten volgens EN 16430",null,null,null,null,null,null,null,null,null,null,null,{"$f":"cal!N70","v":"v2022-08-26"}]
["**Geluidsvermogen gemeten volgens ISO 3741:2010"]
["***Geluidsdruk bij een aangenomen ruimtedemping van 8 dB(A)"]

{"sheet":"EN","index":3,"n_rows":71,"n_cols":18,"rows_kept":71,"cut":false,"hidden":true,"merged":[[38,0,38,12],[44,0,44,12],[50,0,50,12],[62,0,62,12],[14,0,14,12],[20,0,20,12],[26,0,26,12],[32,0,32,12],[56,0,56,12],[7,11,7,12],[5,11,5,12],[6,11,6,12],[10,5,10,7],[7,0,7,2],[7,5,7,8],[8,0,8,2],[8,5,8,8],[9,0,9,2],[9,5,9,8]]}
[]
["Formulary"]
[]
["Conditions"]
[]
["Temperatures",null,null,null,null,null,null,null,null,null,null,"Altitude"]
["Heating:",null,null,null,null,"Cooling:",null,null,null,null,null,null,null,null,null,null,"Copy all data"]
[{"$f":"\"Inlet temp.\"","v":"Inlet temp."},null,null,{"$f":"cal!E9","v":75},{"$f":"IF(cal!$X$4=1,\"°C\",IF(cal!$X$4=2,\"°F\"))","v":"°C"},{"$f":"A8","v":"Inlet temp."},null,null,null,{"$f":"cal!K9","v":16},{"$f":"E8","v":"°C"},"Unit conversion",null,null,null,null,"SI-units"]
[{"$f":"\"Return temp.\"","v":"Return temp."},null,null,{"$f":"cal!E10","v":65},{"$f":"E8","v":"°C"},{"$f":"A9","v":"Return temp."},null,null,null,{"$f":"cal!K10","v":18},{"$f":"E8","v":"°C"},null,null,null,null,null,"Imperial-units"]
[{"$f":"\"Room temp.\"","v":"Room temp."},null,null,{"$f":"cal!E11","v":20},{"$f":"E8","v":"°C"},{"$f":"A10","v":"Room temp."},null,null,null,{"$f":"cal!K11","v":27},{"$f":"E8","v":"°C"}]
[null,null,null,null,null,"Relative humidity",null,null,null,{"$f":"cal!K12","v":0.5}]
[]
[]
["Speed level:","Control voltage [V]",{"$f":"CONCATENATE(\"Heat output * \",ROUND(D8,0),\"/\",ROUND(D9,0),\"/\",ROUND(D10,0),\" [\"&IF(cal!$X$4=1,\"W\",IF(cal!$X$4=2,\"Btu/h\"))&\"]\")","v":"Heat output * 75/65/20 [W]"},{"$f":"\"Water flowrate, heating [\"&IF(cal!$X$4=1,\"l/h\",IF(cal!$X$4=2,\"GPM\"))&\"]\"","v":"Water flowrate, heating [l/h]"},{"$f":"\"Watersided pressure loss [\"&IF(cal!$X$4=1,\"kPa\",IF(cal!$X$4=2,\"inH2O\"))&\"]\"","v":"Watersided pressure loss [kPa]"},{"$f":"CONCATENATE(\"Sens. cooling capacity * \",ROUND(J8,0),\"/\",ROUND(J9,0),\"/\",ROUND(J10,0),\" [\"&IF(cal!$X$4=1,\"W\",IF(cal!$X$4=2,\"Btu/h\"))&\"]\")","v":"Sens. cooling capacity * 16/18/27 [W]"},{"$f":"CONCATENATE(\"Tot. cooling capacity \",ROUND(J8,0),\"/\",ROUND(J9,0),\"/\",ROUND(J10,0),\" [\"&IF(cal!$X$4=1,\"W\",IF(cal!$X$4=2,\"Btu/h\"))&\"]\")","v":"Tot. cooling capacity 16/18/27 [W]"},{"$f":"\"Water flowrate, cooling [\"&IF(cal!$X$4=1,\"l/h\",IF(cal!$X$4=2,\"GPM\"))&\"]\"","v":"Water flowrate, cooling [l/h]"},{"$f":"\"Watersided pressure loss [\"&IF(cal!$X$4=1,\"kPa\",IF(cal!$X$4=2,\"inH2O\"))&\"]\"","v":"Watersided pressure loss [kPa]"},"Sound pressure *** [dB(A)]","Sound power ** [dB(A)]","Electrical power [W]",{"$f":"\"Air flowrate [\"&IF(cal!$X$4=1,\"m³/h\",IF(cal!$X$4=2,\"CFM\"))&\"]\"","v":"Air flowrate [m³/h]"},{"$f":"\"Air exhaust temp. heating [\"&IF(cal!$X$4=1,\"°C\",IF(cal!$X$4=2,\"°F\"))&\"]\"","v":"Air exhaust temp. heating [°C]"},{"$f":"\"Air exhaust temp. cooling [\"&IF(cal!$X$4=1,\"°C\",IF(cal!$X$4=2,\"°F\"))&\"]\"","v":"Air exhaust temp. cooling [°C]"}]
[{"$f":"cal!$Z$1&\" \"&$R$15&\" \"&ROUND(cal!Y22,1)&IF(cal!$X$4=1,\" cm\",IF(cal!$X$4=2,\" in\"))&\" \"&$R$16&\" \"&ROUND(cal!AA22,1)&IF(cal!$X$4=1,\" cm\",IF(cal!$X$4=2,\" in\"))&\" \"&$R$17&\" \"&ROUND(cal!AC22,1)&IF(cal!$X$4=1,\" cm\",IF(cal!$X$4=2,\" in\"))&\" (Type 1)\"","v":"Freedom height 20 cm width 19 cm length 74 cm (Type 1)"},null,null,null,null,null,null,null,null,null,null,null,null,null,null,null,"Temp.","height"]
[null,null,null,null,null,null,null,null,null,null,null,null,null,null,null,null,"heating!","width"]
[null,null,null,null,null,null,null,null,null,null,null,null,null,null,null,null,"cooling!","length"]
[]
[]
[]
[{"$f":"cal!$Z$1&\" \"&$R$15&\" \"&ROUND(cal!Y28,1)&IF(cal!$X$4=1,\" cm\",IF(cal!$X$4=2,\" in\"))&\" \"&$R$16&\" \"&ROUND(cal!AA28,1)&IF(cal!$X$4=1,\" cm\",IF(cal!$X$4=2,\" in\"))&\" \"&$R$17&\" \"&ROUND(cal!AC28,1)&IF(cal!$X$4=1,\" cm\",IF(cal!$X$4=2,\" in\"))&\" (Type 2)\"","v":"Freedom height 20 cm width 19 cm length 110 cm (Type 2)"}]
[]
[]
[]
[]
[]
[{"$f":"cal!$Z$1&\" \"&$R$15&\" \"&ROUND(cal!Y34,1)&IF(cal!$X$4=1,\" cm\",IF(cal!$X$4=2,\" in\"))&\" \"&$R$16&\" \"&ROUND(cal!AA34,1)&IF(cal!$X$4=1,\" cm\",IF(cal!$X$4=2,\" in\"))&\" \"&$R$17&\" \"&ROUND(cal!AC34,1)&IF(cal!$X$4=1,\" cm\",IF(cal!$X$4=2,\" in\"))&\" (Type 3)\"","v":"Freedom height 20 cm width 19 cm length 145 cm (Type 3)"}]
[]
[]
[]
[]
[]
[{"$f":"cal!$Z$1&\" \"&$R$15&\" \"&ROUND(cal!Y40,1)&IF(cal!$X$4=1,\" cm\",IF(cal!$X$4=2,\" in\"))&\" \"&$R$16&\" \"&ROUND(cal!AA40,1)&IF(cal!$X$4=1,\" cm\",IF(cal!$X$4=2,\" in\"))&\" \"&$R$17&\" \"&ROUND(cal!AC40,1)&IF(cal!$X$4=1,\" cm\",IF(cal!$X$4=2,\" in\"))&\" (Type 4)\"","v":"Freedom height 20 cm width 19 cm length 181 cm (Type 4)"}]
[]
[]
[]
[]
[]
[{"$f":"cal!$Z$1&\" \"&$R$15&\" \"&ROUND(cal!Y46,1)&IF(cal!$X$4=1,\" cm\",IF(cal!$X$4=2,\" in\"))&\" \"&$R$16&\" \"&ROUND(cal!AA46,1)&IF(cal!$X$4=1,\" cm\",IF(cal!$X$4=2,\" in\"))&\" \"&$R$17&\" \"&ROUND(cal!AC46,1)&IF(cal!$X$4=1,\" cm\",IF(cal!$X$4=2,\" in\"))&\" (Type 5)\"","v":"Freedom height 0 cm width 0 cm length 0 cm (Type 5)"}]
[]
[]
[]
[]
[]
[{"$f":"cal!$Z$1&\" \"&$R$15&\" \"&ROUND(cal!Y52,1)&IF(cal!$X$4=1,\" cm\",IF(cal!$X$4=2,\" in\"))&\" \"&$R$16&\" \"&ROUND(cal!AA52,1)&IF(cal!$X$4=1,\" cm\",IF(cal!$X$4=2,\" in\"))&\" \"&$R$17&\" \"&ROUND(cal!AC52,1)&IF(cal!$X$4=1,\" cm\",IF(cal!$X$4=2,\" in\"))&\" (Type 6)\"","v":"Freedom height 0 cm width 0 cm length 0 cm (Type 6)"}]
[]
[]
[]
[]
[]
[{"$f":"cal!$Z$1&\" \"&$R$15&\" \"&ROUND(cal!Y58,1)&IF(cal!$X$4=1,\" cm\",IF(cal!$X$4=2,\" in\"))&\" \"&$R$16&\" \"&ROUND(cal!AA58,1)&IF(cal!$X$4=1,\" cm\",IF(cal!$X$4=2,\" in\"))&\" \"&$R$17&\" \"&ROUND(cal!AC58,1)&IF(cal!$X$4=1,\" cm\",IF(cal!$X$4=2,\" in\"))&\" (Type 7)\"","v":"Freedom height 0 cm width 0 cm length 0 cm (Type 7)"}]
[]
[]
[]
[]
[]
[{"$f":"cal!$Z$1&\" \"&$R$15&\" \"&ROUND(cal!Y64,1)&IF(cal!$X$4=1,\" cm\",IF(cal!$X$4=2,\" in\"))&\" \"&$R$16&\" \"&ROUND(cal!AA64,1)&IF(cal!$X$4=1,\" cm\",IF(cal!$X$4=2,\" in\"))&\" \"&$R$17&\" \"&ROUND(cal!AC64,1)&IF(cal!$X$4=1,\" cm\",IF(cal!$X$4=2,\" in\"))&\" (Type 8)\"","v":"Freedom height 0 cm width 0 cm length 0 cm (Type 8)"}]
[]
[]
[]
[]
[]
[{"$f":"cal!$Z$1&\" \"&$R$15&\" \"&ROUND(cal!Y70,1)&IF(cal!$X$4=1,\" cm\",IF(cal!$X$4=2,\" in\"))&\" \"&$R$16&\" \"&ROUND(cal!AA70,1)&IF(cal!$X$4=1,\" cm\",IF(cal!$X$4=2,\" in\"))&\" \"&$R$17&\" \"&ROUND(cal!AC70,1)&IF(cal!$X$4=1,\" cm\",IF(cal!$X$4=2,\" in\"))&\" (Type 9)\"","v":"Freedom height 0 cm width 0 cm length 0 cm (Type 9)"}]
[]
[]
[]
[]
[]
["*Values according to EN 16430",null,null,null,null,null,null,null,null,null,null,null,{"$f":"cal!N70","v":"v2022-08-26"}]
["**Sound power according to ISO 3741:2010"]
["***Sound pressure with an assumed room damping of 8dB(A)"]

{"sheet":"DE","index":4,"n_rows":71,"n_cols":18,"rows_kept":71,"cut":false,"hidden":true,"merged":[[38,0,38,12],[44,0,44,12],[50,0,50,12],[62,0,62,12],[14,0,14,12],[20,0,20,12],[26,0,26,12],[32,0,32,12],[56,0,56,12],[7,11,7,12],[5,11,5,12],[6,11,6,12],[10,5,10,7],[7,0,7,2],[7,5,7,8],[8,0,8,2],[8,5,8,8],[9,0,9,2],[9,5,9,8]]}
[]
["Eingabefelder"]
[]
["Auslegungsrandbedingungen"]
[]
["Temperaturen",null,null,null,null,null,null,null,null,null,null,"Platzierte Höhe"]
["Heizen:",null,null,null,null,"Kühlen:",null,null,null,null,null,null,null,null,null,null,"Kopieren Sie alle daten"]
[{"$f":"\"Vorlauftemp.\"","v":"Vorlauftemp."},null,null,{"$f":"cal!E9","v":75},{"$f":"IF(cal!$X$4=1,\"°C\",IF(cal!$X$4=2,\"°F\"))","v":"°C"},{"$f":"A8","v":"Vorlauftemp."},null,null,null,{"$f":"cal!K9","v":16},{"$f":"E8","v":"°C"},"Einheiten",null,null,null,null,"SI-einheiten"]
[{"$f":"\"Rücklauftemp.\"","v":"Rücklauftemp."},null,null,{"$f":"cal!E10","v":65},{"$f":"E8","v":"°C"},{"$f":"A9","v":"Rücklauftemp."},null,null,null,{"$f":"cal!K10","v":18},{"$f":"E8","v":"°C"},null,null,null,null,null,"Imperiale-einheiten"]
[{"$f":"\"Raumtemp.\"","v":"Raumtemp."},null,null,{"$f":"cal!E11","v":20},{"$f":"E8","v":"°C"},{"$f":"A10","v":"Raumtemp."},null,null,null,{"$f":"cal!K11","v":27},{"$f":"E8","v":"°C"}]
[null,null,null,null,null,"Relative Luftfeuchtigkeit",null,null,null,{"$f":"cal!K12","v":0.5}]
[]
[]
["Drehzahlstufe:","Regelspannung: [V]",{"$f":"CONCATENATE(\"Wärmeleistung * \",ROUND(D8,0),\"/\",ROUND(D9,0),\"/\",ROUND(D10,0),\" [\"&IF(cal!$X$4=1,\"W\",IF(cal!$X$4=2,\"Btu/h\"))&\"]\")","v":"Wärmeleistung * 75/65/20 [W]"},{"$f":"\"Heizmittelstrom [\"&IF(cal!$X$4=1,\"l/h\",IF(cal!$X$4=2,\"GPM\"))&\"]\"","v":"Heizmittelstrom [l/h]"},{"$f":"\"zug. wassers. Druckverlust [\"&IF(cal!$X$4=1,\"kPa\",IF(cal!$X$4=2,\"inH2O\"))&\"]\"","v":"zug. wassers. Druckverlust [kPa]"},{"$f":"CONCATENATE(\"Sens. Kälteleistung * \",ROUND(J8,0),\"/\",ROUND(J9,0),\"/\",ROUND(J10,0),\" [\"&IF(cal!$X$4=1,\"W\",IF(cal!$X$4=2,\"Btu/h\"))&\"]\")","v":"Sens. Kälteleistung * 16/18/27 [W]"},{"$f":"CONCATENATE(\"Tot. Kälteleistung \",ROUND(J8,0),\"/\",ROUND(J9,0),\"/\",ROUND(J10,0),\" [\"&IF(cal!$X$4=1,\"W\",IF(cal!$X$4=2,\"Btu/h\"))&\"]\")","v":"Tot. Kälteleistung 16/18/27 [W]"},{"$f":"\"Kühlmittelstrom [\"&IF(cal!$X$4=1,\"l/h\",IF(cal!$X$4=2,\"GPM\"))&\"]\"","v":"Kühlmittelstrom [l/h]"},{"$f":"\"zug. wassers. Druckverlust [\"&IF(cal!$X$4=1,\"kPa\",IF(cal!$X$4=2,\"inH2O\"))&\"]\"","v":"zug. wassers. Druckverlust [kPa]"},"Schalldruckpegel *** [dB(A)]","Schallleistungspegel ** [dB(A)]","Leistungsaufnahme [W]",{"$f":"\"Luftvolumenstrom [\"&IF(cal!$X$4=1,\"m³/h\",IF(cal!$X$4=2,\"CFM\"))&\"]\"","v":"Luftvolumenstrom [m³/h]"},{"$f":"\"Luftaustrittstemp. Heizung [\"&IF(cal!$X$4=1,\"°C\",IF(cal!$X$4=2,\"°F\"))&\"]\"","v":"Luftaustrittstemp. Heizung [°C]"},{"$f":"\"Luftaustrittstemp. kühlung [\"&IF(cal!$X$4=1,\"°C\",IF(cal!$X$4=2,\"°F\"))&\"]\"","v":"Luftaustrittstemp. kühlung [°C]"}]
[{"$f":"cal!$Z$1&\" \"&$R$15&\" \"&ROUND(cal!Y22,1)&IF(cal!$X$4=1,\" cm\",IF(cal!$X$4=2,\" in\"))&\" \"&$R$16&\" \"&ROUND(cal!AA22,1)&IF(cal!$X$4=1,\" cm\",IF(cal!$X$4=2,\" in\"))&\" \"&$R$17&\" \"&ROUND(cal!AC22,1)&IF(cal!$X$4=1,\" cm\",IF(cal!$X$4=2,\" in\"))&\" (Type 1)\"","v":"Freedom höhe 20 cm breite 19 cm länge 74 cm (Type 1)"},null,null,null,null,null,null,null,null,null,null,null,null,null,null,null,"Temp.","höhe"]
[null,null,null,null,null,null,null,null,null,null,null,null,null,null,null,null,"heizen!","breite"]
[null,null,null,null,null,null,null,null,null,null,null,null,null,null,null,null,"kühlen!","länge"]
[]
[]
[]
[{"$f":"cal!$Z$1&\" \"&$R$15&\" \"&ROUND(cal!Y28,1)&IF(cal!$X$4=1,\" cm\",IF(cal!$X$4=2,\" in\"))&\" \"&$R$16&\" \"&ROUND(cal!AA28,1)&IF(cal!$X$4=1,\" cm\",IF(cal!$X$4=2,\" in\"))&\" \"&$R$17&\" \"&ROUND(cal!AC28,1)&IF(cal!$X$4=1,\" cm\",IF(cal!$X$4=2,\" in\"))&\" (Type 2)\"","v":"Freedom höhe 20 cm breite 19 cm länge 110 cm (Type 2)"}]
[]
[]
[]
[]
[]
[{"$f":"cal!$Z$1&\" \"&$R$15&\" \"&ROUND(cal!Y34,1)&IF(cal!$X$4=1,\" cm\",IF(cal!$X$4=2,\" in\"))&\" \"&$R$16&\" \"&ROUND(cal!AA34,1)&IF(cal!$X$4=1,\" cm\",IF(cal!$X$4=2,\" in\"))&\" \"&$R$17&\" \"&ROUND(cal!AC34,1)&IF(cal!$X$4=1,\" cm\",IF(cal!$X$4=2,\" in\"))&\" (Type 3)\"","v":"Freedom höhe 20 cm breite 19 cm länge 145 cm (Type 3)"}]
[]
[]
[]
[]
[]
[{"$f":"cal!$Z$1&\" \"&$R$15&\" \"&ROUND(cal!Y40,1)&IF(cal!$X$4=1,\" cm\",IF(cal!$X$4=2,\" in\"))&\" \"&$R$16&\" \"&ROUND(cal!AA40,1)&IF(cal!$X$4=1,\" cm\",IF(cal!$X$4=2,\" in\"))&\" \"&$R$17&\" \"&ROUND(cal!AC40,1)&IF(cal!$X$4=1,\" cm\",IF(cal!$X$4=2,\" in\"))&\" (Type 4)\"","v":"Freedom höhe 20 cm breite 19 cm länge 181 cm (Type 4)"}]
[]
[]
[]
[]
[]
[{"$f":"cal!$Z$1&\" \"&$R$15&\" \"&ROUND(cal!Y46,1)&IF(cal!$X$4=1,\" cm\",IF(cal!$X$4=2,\" in\"))&\" \"&$R$16&\" \"&ROUND(cal!AA46,1)&IF(cal!$X$4=1,\" cm\",IF(cal!$X$4=2,\" in\"))&\" \"&$R$17&\" \"&ROUND(cal!AC46,1)&IF(cal!$X$4=1,\" cm\",IF(cal!$X$4=2,\" in\"))&\" (Type 5)\"","v":"Freedom höhe 0 cm breite 0 cm länge 0 cm (Type 5)"}]
[]
[]
[]
[]
[]
[{"$f":"cal!$Z$1&\" \"&$R$15&\" \"&ROUND(cal!Y52,1)&IF(cal!$X$4=1,\" cm\",IF(cal!$X$4=2,\" in\"))&\" \"&$R$16&\" \"&ROUND(cal!AA52,1)&IF(cal!$X$4=1,\" cm\",IF(cal!$X$4=2,\" in\"))&\" \"&$R$17&\" \"&ROUND(cal!AC52,1)&IF(cal!$X$4=1,\" cm\",IF(cal!$X$4=2,\" in\"))&\" (Type 6)\"","v":"Freedom höhe 0 cm breite 0 cm länge 0 cm (Type 6)"}]
[]
[]
[]
[]
[]
[{"$f":"cal!$Z$1&\" \"&$R$15&\" \"&ROUND(cal!Y58,1)&IF(cal!$X$4=1,\" cm\",IF(cal!$X$4=2,\" in\"))&\" \"&$R$16&\" \"&ROUND(cal!AA58,1)&IF(cal!$X$4=1,\" cm\",IF(cal!$X$4=2,\" in\"))&\" \"&$R$17&\" \"&ROUND(cal!AC58,1)&IF(cal!$X$4=1,\" cm\",IF(cal!$X$4=2,\" in\"))&\" (Type 7)\"","v":"Freedom höhe 0 cm breite 0 cm länge 0 cm (Type 7)"}]
[]
[]
[]
[]
[]
[{"$f":"cal!$Z$1&\" \"&$R$15&\" \"&ROUND(cal!Y64,1)&IF(cal!$X$4=1,\" cm\",IF(cal!$X$4=2,\" in\"))&\" \"&$R$16&\" \"&ROUND(cal!AA64,1)&IF(cal!$X$4=1,\" cm\",IF(cal!$X$4=2,\" in\"))&\" \"&$R$17&\" \"&ROUND(cal!AC64,1)&IF(cal!$X$4=1,\" cm\",IF(cal!$X$4=2,\" in\"))&\" (Type 8)\"","v":"Freedom höhe 0 cm breite 0 cm länge 0 cm (Type 8)"}]
[]
[]
[]
[]
[]
[{"$f":"cal!$Z$1&\" \"&$R$15&\" \"&ROUND(cal!Y70,1)&IF(cal!$X$4=1,\" cm\",IF(cal!$X$4=2,\" in\"))&\" \"&$R$16&\" \"&ROUND(cal!AA70,1)&IF(cal!$X$4=1,\" cm\",IF(cal!$X$4=2,\" in\"))&\" \"&$R$17&\" \"&ROUND(cal!AC70,1)&IF(cal!$X$4=1,\" cm\",IF(cal!$X$4=2,\" in\"))&\" (Type 9)\"","v":"Freedom höhe 0 cm breite 0 cm länge 0 cm (Type 9)"}]
[]
[]
[]
[]
[]
["*Leistungsangaben nach EN 16430",null,null,null,null,null,null,null,null,null,null,null,{"$f":"cal!N70","v":"v2022-08-26"}]
["**Schallleistungspegel nach ISO 3741:2010"]
["***Schalldruckpegel bei angenommener Raumdämpfung von 8dB(A)"]

{"sheet":"FR","index":5,"n_rows":71,"n_cols":18,"rows_kept":71,"cut":false,"hidden":true,"merged":[[38,0,38,12],[44,0,44,12],[50,0,50,12],[62,0,62,12],[14,0,14,12],[20,0,20,12],[26,0,26,12],[32,0,32,12],[56,0,56,12],[7,11,7,12],[5,11,5,12],[6,11,6,12],[10,5,10,7],[7,0,7,2],[7,5,7,8],[8,0,8,2],[8,5,8,8],[9,0,9,2],[9,5,9,8]]}
[]
["Formulaire"]
[]
["Conditions"]
[]
["Températures",null,null,null,null,null,null,null,null,null,null,"Hauteur placée"]
["Chauffer:",null,null,null,null,"Refroidir:",null,null,null,null,null,null,null,null,null,null,"Copier toutes des données"]
[{"$f":"\"Temp. entrée\"","v":"Temp. entrée"},null,null,{"$f":"cal!E9","v":75},{"$f":"IF(cal!$X$4=1,\"°C\",IF(cal!$X$4=2,\"°F\"))","v":"°C"},{"$f":"A8","v":"Temp. entrée"},null,null,null,{"$f":"cal!K9","v":16},{"$f":"E8","v":"°C"},"Système unitaire",null,null,null,null,"Unités-SI"]
[{"$f":"\"Temp. retour\"","v":"Temp. retour"},null,null,{"$f":"cal!E10","v":65},{"$f":"E8","v":"°C"},{"$f":"A9","v":"Temp. retour"},null,null,null,{"$f":"cal!K10","v":18},{"$f":"E8","v":"°C"},null,null,null,null,null,"Unités-Impériales"]
[{"$f":"\"Temp. ambiante\"","v":"Temp. ambiante"},null,null,{"$f":"cal!E11","v":20},{"$f":"E8","v":"°C"},{"$f":"A10","v":"Temp. ambiante"},null,null,null,{"$f":"cal!K11","v":27},{"$f":"E8","v":"°C"}]
[null,null,null,null,null,"Humidité relative",null,null,null,{"$f":"cal!K12","v":0.5}]
[]
[]
["Niveau de vitesse","Voltage [V]",{"$f":"CONCATENATE(\"Puissance de cha. * \",ROUND(D8,0),\"/\",ROUND(D9,0),\"/\",ROUND(D10,0),\" [\"&IF(cal!$X$4=1,\"W\",IF(cal!$X$4=2,\"Btu/h\"))&\"]\")","v":"Puissance de cha. * 75/65/20 [W]"},{"$f":"\"Débit d'eau, chauffer [\"&IF(cal!$X$4=1,\"l/h\",IF(cal!$X$4=2,\"GPM\"))&\"]\"","v":"Débit d'eau, chauffer [l/h]"},{"$f":"\"Perte de charge [\"&IF(cal!$X$4=1,\"kPa\",IF(cal!$X$4=2,\"inH2O\"))&\"]\"","v":"Perte de charge [kPa]"},{"$f":"CONCATENATE(\"Puissance sens. de refr. * \",ROUND(J8,0),\"/\",ROUND(J9,0),\"/\",ROUND(J10,0),\" [\"&IF(cal!$X$4=1,\"W\",IF(cal!$X$4=2,\"Btu/h\"))&\"]\")","v":"Puissance sens. de refr. * 16/18/27 [W]"},{"$f":"CONCATENATE(\"Puissance tot. de refr. \",ROUND(J8,0),\"/\",ROUND(J9,0),\"/\",ROUND(J10,0),\" [\"&IF(cal!$X$4=1,\"W\",IF(cal!$X$4=2,\"Btu/h\"))&\"]\")","v":"Puissance tot. de refr. 16/18/27 [W]"},{"$f":"\"Débit d'eau, refroidir [\"&IF(cal!$X$4=1,\"l/h\",IF(cal!$X$4=2,\"GPM\"))&\"]\"","v":"Débit d'eau, refroidir [l/h]"},{"$f":"\"Perte de charge [\"&IF(cal!$X$4=1,\"kPa\",IF(cal!$X$4=2,\"inH2O\"))&\"]\"","v":"Perte de charge [kPa]"},"Pression sonore *** [dB(A)]","Puissance sonore ** [dB(A)]","Puissance absorbée [W]",{"$f":"\"Débit d'air [\"&IF(cal!$X$4=1,\"m³/h\",IF(cal!$X$4=2,\"CFM\"))&\"]\"","v":"Débit d'air [m³/h]"},{"$f":"\"Temp. de la sortie d'air cha. [\"&IF(cal!$X$4=1,\"°C\",IF(cal!$X$4=2,\"°F\"))&\"]\"","v":"Temp. de la sortie d'air cha. [°C]"},{"$f":"\"Temp. de la sortie d'air refr. [\"&IF(cal!$X$4=1,\"°C\",IF(cal!$X$4=2,\"°F\"))&\"]\"","v":"Temp. de la sortie d'air refr. [°C]"}]
[{"$f":"cal!$Z$1&\" \"&$R$15&\" \"&ROUND(cal!Y22,1)&IF(cal!$X$4=1,\" cm\",IF(cal!$X$4=2,\" in\"))&\" \"&$R$16&\" \"&ROUND(cal!AA22,1)&IF(cal!$X$4=1,\" cm\",IF(cal!$X$4=2,\" in\"))&\" \"&$R$17&\" \"&ROUND(cal!AC22,1)&IF(cal!$X$4=1,\" cm\",IF(cal!$X$4=2,\" in\"))&\" (Type 1)\"","v":"Freedom hauteur 20 cm largeur 19 cm longueur 74 cm (Type 1)"},null,null,null,null,null,null,null,null,null,null,null,null,null,null,null,"Temp.","hauteur"]
[null,null,null,null,null,null,null,null,null,null,null,null,null,null,null,null,"chauf.!","largeur"]
[null,null,null,null,null,null,null,null,null,null,null,null,null,null,null,null,"refr.!","longueur"]
[]
[]
[]
[{"$f":"cal!$Z$1&\" \"&$R$15&\" \"&ROUND(cal!Y28,1)&IF(cal!$X$4=1,\" cm\",IF(cal!$X$4=2,\" in\"))&\" \"&$R$16&\" \"&ROUND(cal!AA28,1)&IF(cal!$X$4=1,\" cm\",IF(cal!$X$4=2,\" in\"))&\" \"&$R$17&\" \"&ROUND(cal!AC28,1)&IF(cal!$X$4=1,\" cm\",IF(cal!$X$4=2,\" in\"))&\" (Type 2)\"","v":"Freedom hauteur 20 cm largeur 19 cm longueur 110 cm (Type 2)"}]
[]
[]
[]
[]
[]
[{"$f":"cal!$Z$1&\" \"&$R$15&\" \"&ROUND(cal!Y34,1)&IF(cal!$X$4=1,\" cm\",IF(cal!$X$4=2,\" in\"))&\" \"&$R$16&\" \"&ROUND(cal!AA34,1)&IF(cal!$X$4=1,\" cm\",IF(cal!$X$4=2,\" in\"))&\" \"&$R$17&\" \"&ROUND(cal!AC34,1)&IF(cal!$X$4=1,\" cm\",IF(cal!$X$4=2,\" in\"))&\" (Type 3)\"","v":"Freedom hauteur 20 cm largeur 19 cm longueur 145 cm (Type 3)"}]
[]
[]
[]
[]
[]
[{"$f":"cal!$Z$1&\" \"&$R$15&\" \"&ROUND(cal!Y40,1)&IF(cal!$X$4=1,\" cm\",IF(cal!$X$4=2,\" in\"))&\" \"&$R$16&\" \"&ROUND(cal!AA40,1)&IF(cal!$X$4=1,\" cm\",IF(cal!$X$4=2,\" in\"))&\" \"&$R$17&\" \"&ROUND(cal!AC40,1)&IF(cal!$X$4=1,\" cm\",IF(cal!$X$4=2,\" in\"))&\" (Type 4)\"","v":"Freedom hauteur 20 cm largeur 19 cm longueur 181 cm (Type 4)"}]
[]
[]
[]
[]
[]
[{"$f":"cal!$Z$1&\" \"&$R$15&\" \"&ROUND(cal!Y46,1)&IF(cal!$X$4=1,\" cm\",IF(cal!$X$4=2,\" in\"))&\" \"&$R$16&\" \"&ROUND(cal!AA46,1)&IF(cal!$X$4=1,\" cm\",IF(cal!$X$4=2,\" in\"))&\" \"&$R$17&\" \"&ROUND(cal!AC46,1)&IF(cal!$X$4=1,\" cm\",IF(cal!$X$4=2,\" in\"))&\" (Type 5)\"","v":"Freedom hauteur 0 cm largeur 0 cm longueur 0 cm (Type 5)"}]
[]
[]
[]
[]
[]
[{"$f":"cal!$Z$1&\" \"&$R$15&\" \"&ROUND(cal!Y52,1)&IF(cal!$X$4=1,\" cm\",IF(cal!$X$4=2,\" in\"))&\" \"&$R$16&\" \"&ROUND(cal!AA52,1)&IF(cal!$X$4=1,\" cm\",IF(cal!$X$4=2,\" in\"))&\" \"&$R$17&\" \"&ROUND(cal!AC52,1)&IF(cal!$X$4=1,\" cm\",IF(cal!$X$4=2,\" in\"))&\" (Type 6)\"","v":"Freedom hauteur 0 cm largeur 0 cm longueur 0 cm (Type 6)"}]
[]
[]
[]
[]
[]
[{"$f":"cal!$Z$1&\" \"&$R$15&\" \"&ROUND(cal!Y58,1)&IF(cal!$X$4=1,\" cm\",IF(cal!$X$4=2,\" in\"))&\" \"&$R$16&\" \"&ROUND(cal!AA58,1)&IF(cal!$X$4=1,\" cm\",IF(cal!$X$4=2,\" in\"))&\" \"&$R$17&\" \"&ROUND(cal!AC58,1)&IF(cal!$X$4=1,\" cm\",IF(cal!$X$4=2,\" in\"))&\" (Type 7)\"","v":"Freedom hauteur 0 cm largeur 0 cm longueur 0 cm (Type 7)"}]
[]
[]
[]
[]
[]
[{"$f":"cal!$Z$1&\" \"&$R$15&\" \"&ROUND(cal!Y64,1)&IF(cal!$X$4=1,\" cm\",IF(cal!$X$4=2,\" in\"))&\" \"&$R$16&\" \"&ROUND(cal!AA64,1)&IF(cal!$X$4=1,\" cm\",IF(cal!$X$4=2,\" in\"))&\" \"&$R$17&\" \"&ROUND(cal!AC64,1)&IF(cal!$X$4=1,\" cm\",IF(cal!$X$4=2,\" in\"))&\" (Type 8)\"","v":"Freedom hauteur 0 cm largeur 0 cm longueur 0 cm (Type 8)"}]
[]
[]
[]
[]
[]
[{"$f":"cal!$Z$1&\" \"&$R$15&\" \"&ROUND(cal!Y70,1)&IF(cal!$X$4=1,\" cm\",IF(cal!$X$4=2,\" in\"))&\" \"&$R$16&\" \"&ROUND(cal!AA70,1)&IF(cal!$X$4=1,\" cm\",IF(cal!$X$4=2,\" in\"))&\" \"&$R$17&\" \"&ROUND(cal!AC70,1)&IF(cal!$X$4=1,\" cm\",IF(cal!$X$4=2,\" in\"))&\" (Type 9)\"","v":"Freedom hauteur 0 cm largeur 0 cm longueur 0 cm (Type 9)"}]
[]
[]
[]
[]
[]
["*Testé selon EN 16430",null,null,null,null,null,null,null,null,null,null,null,{"$f":"cal!N70","v":"v2022-08-26"}]
["**Puissance sonore testé selon ISO 3741:2010"]
["***Pression sonore avec une atténuation ambiante du 8dB(A)"]

{"sheet":"NR","index":6,"n_rows":71,"n_cols":18,"rows_kept":71,"cut":false,"hidden":true,"merged":[[50,0,50,12],[56,0,56,12],[62,0,62,12],[2,6,2,9],[3,6,3,9],[14,0,14,12],[20,0,20,12],[26,0,26,12],[32,0,32,12],[38,0,38,12],[44,0,44,12],[7,0,7,2],[7,5,7,8],[8,0,8,2],[8,5,8,8],[9,0,9,2],[7,11,7,12],[5,11,5,12],[6,11,6,12],[10,5,10,7],[9,5,9,8]]}
[]
["Modell"]
[]
["Conditions"]
[]
["Temperaturer",null,null,null,null,null,null,null,null,null,null,"Plassert høyde"]
["Varme:",null,null,null,null,"Kjøling:",null,null,null,null,null,null,null,null,null,null,"Kopier alle data"]
["Tur vanntemp.",0,0,{"$f":"cal!E9","v":75},{"$f":"IF(cal!$X$4=1,\"°C\",IF(cal!$X$4=2,\"°F\"))","v":"°C"},{"$f":"A8","v":"Tur vanntemp."},null,null,null,{"$f":"cal!K9","v":16},{"$f":"E8","v":"°C"},"Enhetssystem",null,null,null,null,"SI-enheter"]
["Retur vanntemp.",0,0,{"$f":"cal!E10","v":65},{"$f":"E8","v":"°C"},{"$f":"A9","v":"Retur vanntemp."},null,null,null,{"$f":"cal!K10","v":18},{"$f":"E8","v":"°C"},null,null,null,null,null,"Imperiale-enheter"]
["Rom temp.",0,0,{"$f":"cal!E11","v":20},{"$f":"E8","v":"°C"},{"$f":"A10","v":"Rom temp."},null,null,null,{"$f":"cal!K11","v":27},{"$f":"E8","v":"°C"}]
[null,null,null,null,null,"Relativ fuktighet",null,null,null,{"$f":"cal!K12","v":0.5}]
[]
[]
["Hastighet:","Styresignal[V]",{"$f":"CONCATENATE(\"Varme effekt * \",ROUND(D8,0),\"/\",ROUND(D9,0),\"/\",ROUND(D10,0),\" [\"&IF(cal!$X$4=1,\"W\",IF(cal!$X$4=2,\"Btu/h\"))&\"]\")","v":"Varme effekt * 75/65/20 [W]"},{"$f":"\"Vannmengde, varme [\"&IF(cal!$X$4=1,\"l/h\",IF(cal!$X$4=2,\"GPM\"))&\"]\"","v":"Vannmengde, varme [l/h]"},{"$f":"\"Trykktap [\"&IF(cal!$X$4=1,\"kPa\",IF(cal!$X$4=2,\"ftH2O\"))&\"]\"","v":"Trykktap [kPa]"},{"$f":"CONCATENATE(\"Sens. Kjøling effekt * \",ROUND(J8,0),\"/\",ROUND(J9,0),\"/\",ROUND(J10,0),\" [\"&IF(cal!$X$4=1,\"W\",IF(cal!$X$4=2,\"Btu/h\"))&\"]\")","v":"Sens. Kjøling effekt * 16/18/27 [W]"},{"$f":"CONCATENATE(\"Tot. Kjøle effekt * \",ROUND(J8,0),\"/\",ROUND(J9,0),\"/\",ROUND(J10,0),\" [\"&IF(cal!$X$4=1,\"W\",IF(cal!$X$4=2,\"Btu/h\"))&\"]\")","v":"Tot. Kjøle effekt * 16/18/27 [W]"},{"$f":"\"Vannmengde, kjøling [\"&IF(cal!$X$4=1,\"l/h\",IF(cal!$X$4=2,\"GPM\"))&\"]\"","v":"Vannmengde, kjøling [l/h]"},{"$f":"E14","v":"Trykktap [kPa]"},"Lydtrykk *** [dB(A)]","Lydeffekt ** [dB(A)]","Elektrisk effekt [W]",{"$f":"\"Luftmengde [\"&IF(cal!$X$4=1,\"m³/h\",IF(cal!$X$4=2,\"CFM\"))&\"]\"","v":"Luftmengde [m³/h]"},{"$f":"\"Utluft temperatur, Varme [\"&IF(cal!$X$4=1,\"°C\",IF(cal!$X$4=2,\"°F\"))&\"]\"","v":"Utluft temperatur, Varme [°C]"},{"$f":"\"Utluft temperatur, Kjøling [\"&IF(cal!$X$4=1,\"°C\",IF(cal!$X$4=2,\"°F\"))&\"]\"","v":"Utluft temperatur, Kjøling [°C]"}]
[{"$f":"cal!$Z$1&\" \"&$R$15&\" \"&ROUND(cal!Y22,1)&IF(cal!$X$4=1,\" cm\",IF(cal!$X$4=2,\" in\"))&\" \"&$R$16&\" \"&ROUND(cal!AA22,1)&IF(cal!$X$4=1,\" cm\",IF(cal!$X$4=2,\" in\"))&\" \"&$R$17&\" \"&ROUND(cal!AC22,1)&IF(cal!$X$4=1,\" cm\",IF(cal!$X$4=2,\" in\"))&\" (Type 1)\"","v":"Freedom høyde 20 cm bredde 19 cm lengde 74 cm (Type 1)"},null,null,null,null,null,null,null,null,null,null,null,null,null,null,null,"Temp.","høyde"]
[null,null,null,null,null,null,null,null,null,null,null,null,null,null,null,null,"varme!","bredde"]
[null,null,null,null,null,null,null,null,null,null,null,null,null,null,null,null,"kjøling!","lengde"]
[]
[]
[]
[{"$f":"cal!$Z$1&\" \"&$R$15&\" \"&ROUND(cal!Y28,1)&IF(cal!$X$4=1,\" cm\",IF(cal!$X$4=2,\" in\"))&\" \"&$R$16&\" \"&ROUND(cal!AA28,1)&IF(cal!$X$4=1,\" cm\",IF(cal!$X$4=2,\" in\"))&\" \"&$R$17&\" \"&ROUND(cal!AC28,1)&IF(cal!$X$4=1,\" cm\",IF(cal!$X$4=2,\" in\"))&\" (Type 2)\"","v":"Freedom høyde 20 cm bredde 19 cm lengde 110 cm (Type 2)"}]
[]
[]
[]
[]
[]
[{"$f":"cal!$Z$1&\" \"&$R$15&\" \"&ROUND(cal!Y34,1)&IF(cal!$X$4=1,\" cm\",IF(cal!$X$4=2,\" in\"))&\" \"&$R$16&\" \"&ROUND(cal!AA34,1)&IF(cal!$X$4=1,\" cm\",IF(cal!$X$4=2,\" in\"))&\" \"&$R$17&\" \"&ROUND(cal!AC34,1)&IF(cal!$X$4=1,\" cm\",IF(cal!$X$4=2,\" in\"))&\" (Type 3)\"","v":"Freedom høyde 20 cm bredde 19 cm lengde 145 cm (Type 3)"}]
[]
[]
[]
[]
[]
[{"$f":"cal!$Z$1&\" \"&$R$15&\" \"&ROUND(cal!Y40,1)&IF(cal!$X$4=1,\" cm\",IF(cal!$X$4=2,\" in\"))&\" \"&$R$16&\" \"&ROUND(cal!AA40,1)&IF(cal!$X$4=1,\" cm\",IF(cal!$X$4=2,\" in\"))&\" \"&$R$17&\" \"&ROUND(cal!AC40,1)&IF(cal!$X$4=1,\" cm\",IF(cal!$X$4=2,\" in\"))&\" (Type 4)\"","v":"Freedom høyde 20 cm bredde 19 cm lengde 181 cm (Type 4)"}]
[]
[]
[]
[]
[]
[{"$f":"cal!$Z$1&\" \"&$R$15&\" \"&ROUND(cal!Y46,1)&IF(cal!$X$4=1,\" cm\",IF(cal!$X$4=2,\" in\"))&\" \"&$R$16&\" \"&ROUND(cal!AA46,1)&IF(cal!$X$4=1,\" cm\",IF(cal!$X$4=2,\" in\"))&\" \"&$R$17&\" \"&ROUND(cal!AC46,1)&IF(cal!$X$4=1,\" cm\",IF(cal!$X$4=2,\" in\"))&\" (Type 5)\"","v":"Freedom høyde 0 cm bredde 0 cm lengde 0 cm (Type 5)"}]
[]
[]
[]
[]
[]
[{"$f":"cal!$Z$1&\" \"&$R$15&\" \"&ROUND(cal!Y52,1)&IF(cal!$X$4=1,\" cm\",IF(cal!$X$4=2,\" in\"))&\" \"&$R$16&\" \"&ROUND(cal!AA52,1)&IF(cal!$X$4=1,\" cm\",IF(cal!$X$4=2,\" in\"))&\" \"&$R$17&\" \"&ROUND(cal!AC52,1)&IF(cal!$X$4=1,\" cm\",IF(cal!$X$4=2,\" in\"))&\" (Type 6)\"","v":"Freedom høyde 0 cm bredde 0 cm lengde 0 cm (Type 6)"}]
[]
[]
[]
[]
[]
[{"$f":"cal!$Z$1&\" \"&$R$15&\" \"&ROUND(cal!Y58,1)&IF(cal!$X$4=1,\" cm\",IF(cal!$X$4=2,\" in\"))&\" \"&$R$16&\" \"&ROUND(cal!AA58,1)&IF(cal!$X$4=1,\" cm\",IF(cal!$X$4=2,\" in\"))&\" \"&$R$17&\" \"&ROUND(cal!AC58,1)&IF(cal!$X$4=1,\" cm\",IF(cal!$X$4=2,\" in\"))&\" (Type 7)\"","v":"Freedom høyde 0 cm bredde 0 cm lengde 0 cm (Type 7)"}]
[]
[]
[]
[]
[]
[{"$f":"cal!$Z$1&\" \"&$R$15&\" \"&ROUND(cal!Y64,1)&IF(cal!$X$4=1,\" cm\",IF(cal!$X$4=2,\" in\"))&\" \"&$R$16&\" \"&ROUND(cal!AA64,1)&IF(cal!$X$4=1,\" cm\",IF(cal!$X$4=2,\" in\"))&\" \"&$R$17&\" \"&ROUND(cal!AC64,1)&IF(cal!$X$4=1,\" cm\",IF(cal!$X$4=2,\" in\"))&\" (Type 8)\"","v":"Freedom høyde 0 cm bredde 0 cm lengde 0 cm (Type 8)"}]
[]
[]
[]
[]
[]
[{"$f":"cal!$Z$1&\" \"&$R$15&\" \"&ROUND(cal!Y70,1)&IF(cal!$X$4=1,\" cm\",IF(cal!$X$4=2,\" in\"))&\" \"&$R$16&\" \"&ROUND(cal!AA70,1)&IF(cal!$X$4=1,\" cm\",IF(cal!$X$4=2,\" in\"))&\" \"&$R$17&\" \"&ROUND(cal!AC70,1)&IF(cal!$X$4=1,\" cm\",IF(cal!$X$4=2,\" in\"))&\" (Type 9)\"","v":"Freedom høyde 0 cm bredde 0 cm lengde 0 cm (Type 9)"}]
[]
[]
[]
[]
[]
["*Testé selon EN 16430",null,null,null,null,null,null,null,null,null,null,null,{"$f":"cal!N70","v":"v2022-08-26"}]
["**Puissance sonore testé selon ISO 3741:2010"]
["***Pression sonore avec une atténuation ambiante du 8dB(A)"]

{"sheet":"SP","index":7,"n_rows":71,"n_cols":18,"rows_kept":71,"cut":false,"hidden":true,"merged":[[14,0,14,12],[20,0,20,12],[26,0,26,12],[32,0,32,12],[2,6,2,9],[3,6,3,9],[7,0,7,2],[7,5,7,8],[7,11,7,12],[8,0,8,2],[8,5,8,8],[5,11,5,12],[6,11,6,12],[10,5,10,7],[9,0,9,2],[9,5,9,8],[38,0,38,12],[44,0,44,12],[50,0,50,12],[56,0,56,12],[62,0,62,12]]}
[]
["Model"]
[]
["Conditions"]
[]
["Temperaturas",null,null,null,null,null,null,null,null,null,null,"Altitud"]
["Calefacción:",null,null,null,null,"Enfriamiento:",null,null,null,null,null,null,null,null,null,null,"Copiar todos los datos"]
["Agua impulsión",0,0,{"$f":"cal!E9","v":75},{"$f":"IF(cal!$X$4=1,\"°C\",IF(cal!$X$4=2,\"°F\"))","v":"°C"},{"$f":"A8","v":"Agua impulsión"},null,null,null,{"$f":"cal!K9","v":16},{"$f":"E8","v":"°C"},"Convers. de unidades",null,null,null,null,"Unidades-SI"]
["Agua retorno",0,0,{"$f":"cal!E10","v":65},{"$f":"E8","v":"°C"},{"$f":"A9","v":"Agua retorno"},null,null,null,{"$f":"cal!K10","v":18},{"$f":"E8","v":"°C"},null,null,null,null,null,"Unidades-Imperial"]
["Ambiente (bulbo seco)",0,0,{"$f":"cal!E11","v":20},{"$f":"E8","v":"°C"},{"$f":"A10","v":"Ambiente (bulbo seco)"},null,null,null,{"$f":"cal!K11","v":27},{"$f":"E8","v":"°C"}]
[null,null,null,null,null,"Humedad relativa",null,null,null,{"$f":"cal!K12","v":0.5}]
[]
[]
["Nivel de velocidad:"," Voltaje control [V]",{"$f":"CONCATENATE(\"Emisión calefacción * \",ROUND(D8,0),\"/\",ROUND(D9,0),\"/\",ROUND(D10,0),\" [\"&IF(cal!$X$4=1,\"W\",IF(cal!$X$4=2,\"Btu/h\"))&\"]\")","v":"Emisión calefacción * 75/65/20 [W]"},{"$f":"\"Caudal de agua, calefacción [\"&IF(cal!$X$4=1,\"l/h\",IF(cal!$X$4=2,\"GPM\"))&\"]\"","v":"Caudal de agua, calefacción [l/h]"},{"$f":"\"Pérdida de carga del agua [\"&IF(cal!$X$4=1,\"kPa\",IF(cal!$X$4=2,\"ftH2O\"))&\"]\"","v":"Pérdida de carga del agua [kPa]"},{"$f":"CONCATENATE(\"Emisión sensible Frío * \",ROUND(J8,0),\"/\",ROUND(J9,0),\"/\",ROUND(J10,0),\" [\"&IF(cal!$X$4=1,\"W\",IF(cal!$X$4=2,\"Btu/h\"))&\"]\")","v":"Emisión sensible Frío * 16/18/27 [W]"},{"$f":"CONCATENATE(\"Emisión total Frío * \",ROUND(J8,0),\"/\",ROUND(J9,0),\"/\",ROUND(J10,0),\" [\"&IF(cal!$X$4=1,\"W\",IF(cal!$X$4=2,\"Btu/h\"))&\"]\")","v":"Emisión total Frío * 16/18/27 [W]"},{"$f":"\"Caudal de agua, calefacción [\"&IF(cal!$X$4=1,\"l/h\",IF(cal!$X$4=2,\"GPM\"))&\"]\"","v":"Caudal de agua, calefacción [l/h]"},{"$f":"E14","v":"Pérdida de carga del agua [kPa]"},"Presión sonora *** [dB(A)]","Potencia sonora ** [dB(A)]","Potencia eléctrica absorbida [W]",{"$f":"\"Caudal de aire [\"&IF(cal!$X$4=1,\"m³/h\",IF(cal!$X$4=2,\"CFM\"))&\"]\"","v":"Caudal de aire [m³/h]"},{"$f":"\"Temperatura salida de aire calefacción [\"&IF(cal!$X$4=1,\"°C\",IF(cal!$X$4=2,\"°F\"))&\"]\"","v":"Temperatura salida de aire calefacción [°C]"},{"$f":"\"Temperatura salida de aire refrigeración [\"&IF(cal!$X$4=1,\"°C\",IF(cal!$X$4=2,\"°F\"))&\"]\"","v":"Temperatura salida de aire refrigeración [°C]"}]
[{"$f":"cal!$Z$1&\" \"&$R$15&\" \"&ROUND(cal!Y22,1)&IF(cal!$X$4=1,\" cm\",IF(cal!$X$4=2,\" in\"))&\" \"&$R$16&\" \"&ROUND(cal!AA22,1)&IF(cal!$X$4=1,\" cm\",IF(cal!$X$4=2,\" in\"))&\" \"&$R$17&\" \"&ROUND(cal!AC22,1)&IF(cal!$X$4=1,\" cm\",IF(cal!$X$4=2,\" in\"))&\" (Type 1)\"","v":"Freedom altura 20 cm ancho 19 cm longitud 74 cm (Type 1)"},null,null,null,null,null,null,null,null,null,null,null,null,null,null,null,"Temp.","altura"]
[null,null,null,null,null,null,null,null,null,null,null,null,null,null,null,null,"calefac.","ancho"]
[null,null,null,null,null,null,null,null,null,null,null,null,null,null,null,null,"enfria.","longitud"]
[]
[]
[]
[{"$f":"cal!$Z$1&\" \"&$R$15&\" \"&ROUND(cal!Y28,1)&IF(cal!$X$4=1,\" cm\",IF(cal!$X$4=2,\" in\"))&\" \"&$R$16&\" \"&ROUND(cal!AA28,1)&IF(cal!$X$4=1,\" cm\",IF(cal!$X$4=2,\" in\"))&\" \"&$R$17&\" \"&ROUND(cal!AC28,1)&IF(cal!$X$4=1,\" cm\",IF(cal!$X$4=2,\" in\"))&\" (Type 2)\"","v":"Freedom altura 20 cm ancho 19 cm longitud 110 cm (Type 2)"}]
[]
[]
[]
[]
[]
[{"$f":"cal!$Z$1&\" \"&$R$15&\" \"&ROUND(cal!Y34,1)&IF(cal!$X$4=1,\" cm\",IF(cal!$X$4=2,\" in\"))&\" \"&$R$16&\" \"&ROUND(cal!AA34,1)&IF(cal!$X$4=1,\" cm\",IF(cal!$X$4=2,\" in\"))&\" \"&$R$17&\" \"&ROUND(cal!AC34,1)&IF(cal!$X$4=1,\" cm\",IF(cal!$X$4=2,\" in\"))&\" (Type 3)\"","v":"Freedom altura 20 cm ancho 19 cm longitud 145 cm (Type 3)"}]
[]
[]
[]
[]
[]
[{"$f":"cal!$Z$1&\" \"&$R$15&\" \"&ROUND(cal!Y40,1)&IF(cal!$X$4=1,\" cm\",IF(cal!$X$4=2,\" in\"))&\" \"&$R$16&\" \"&ROUND(cal!AA40,1)&IF(cal!$X$4=1,\" cm\",IF(cal!$X$4=2,\" in\"))&\" \"&$R$17&\" \"&ROUND(cal!AC40,1)&IF(cal!$X$4=1,\" cm\",IF(cal!$X$4=2,\" in\"))&\" (Type 4)\"","v":"Freedom altura 20 cm ancho 19 cm longitud 181 cm (Type 4)"}]
[]
[]
[]
[]
[]
[{"$f":"cal!$Z$1&\" \"&$R$15&\" \"&ROUND(cal!Y46,1)&IF(cal!$X$4=1,\" cm\",IF(cal!$X$4=2,\" in\"))&\" \"&$R$16&\" \"&ROUND(cal!AA46,1)&IF(cal!$X$4=1,\" cm\",IF(cal!$X$4=2,\" in\"))&\" \"&$R$17&\" \"&ROUND(cal!AC46,1)&IF(cal!$X$4=1,\" cm\",IF(cal!$X$4=2,\" in\"))&\" (Type 5)\"","v":"Freedom altura 0 cm ancho 0 cm longitud 0 cm (Type 5)"}]
[]
[]
[]
[]
[]
[{"$f":"cal!$Z$1&\" \"&$R$15&\" \"&ROUND(cal!Y52,1)&IF(cal!$X$4=1,\" cm\",IF(cal!$X$4=2,\" in\"))&\" \"&$R$16&\" \"&ROUND(cal!AA52,1)&IF(cal!$X$4=1,\" cm\",IF(cal!$X$4=2,\" in\"))&\" \"&$R$17&\" \"&ROUND(cal!AC52,1)&IF(cal!$X$4=1,\" cm\",IF(cal!$X$4=2,\" in\"))&\" (Type 6)\"","v":"Freedom altura 0 cm ancho 0 cm longitud 0 cm (Type 6)"}]
[]
[]
[]
[]
[]
[{"$f":"cal!$Z$1&\" \"&$R$15&\" \"&ROUND(cal!Y58,1)&IF(cal!$X$4=1,\" cm\",IF(cal!$X$4=2,\" in\"))&\" \"&$R$16&\" \"&ROUND(cal!AA58,1)&IF(cal!$X$4=1,\" cm\",IF(cal!$X$4=2,\" in\"))&\" \"&$R$17&\" \"&ROUND(cal!AC58,1)&IF(cal!$X$4=1,\" cm\",IF(cal!$X$4=2,\" in\"))&\" (Type 7)\"","v":"Freedom altura 0 cm ancho 0 cm longitud 0 cm (Type 7)"}]
[]
[]
[]
[]
[]
[{"$f":"cal!$Z$1&\" \"&$R$15&\" \"&ROUND(cal!Y64,1)&IF(cal!$X$4=1,\" cm\",IF(cal!$X$4=2,\" in\"))&\" \"&$R$16&\" \"&ROUND(cal!AA64,1)&IF(cal!$X$4=1,\" cm\",IF(cal!$X$4=2,\" in\"))&\" \"&$R$17&\" \"&ROUND(cal!AC64,1)&IF(cal!$X$4=1,\" cm\",IF(cal!$X$4=2,\" in\"))&\" (Type 8)\"","v":"Freedom altura 0 cm ancho 0 cm longitud 0 cm (Type 8)"}]
[]
[]
[]
[]
[]
[{"$f":"cal!$Z$1&\" \"&$R$15&\" \"&ROUND(cal!Y70,1)&IF(cal!$X$4=1,\" cm\",IF(cal!$X$4=2,\" in\"))&\" \"&$R$16&\" \"&ROUND(cal!AA70,1)&IF(cal!$X$4=1,\" cm\",IF(cal!$X$4=2,\" in\"))&\" \"&$R$17&\" \"&ROUND(cal!AC70,1)&IF(cal!$X$4=1,\" cm\",IF(cal!$X$4=2,\" in\"))&\" (Type 9)\"","v":"Freedom altura 0 cm ancho 0 cm longitud 0 cm (Type 9)"}]
[]
[]
[]
[]
[]
["*La potencia de enfriamiento se calcula según la norma EN 16430 con ventiladores de todas las alturas.",null,null,null,null,null,null,null,null,null,null,null,{"$f":"cal!N70","v":"v2022-08-26"}]
["**Potencia sonora según ISO 3741: 2010."]
["***Nivel de presión acústica con una amortiguación ambiental supuesta de 8 dB (A)."]

{"sheet":"SW","index":8,"n_rows":71,"n_cols":18,"rows_kept":71,"cut":false,"hidden":true,"merged":[[5,11,5,12],[6,11,6,12],[7,5,7,8],[7,11,7,12],[8,5,8,8],[62,0,62,12],[9,5,9,8],[14,0,14,12],[20,0,20,12],[26,0,26,12],[10,5,10,8],[32,0,32,12],[38,0,38,12],[44,0,44,12],[50,0,50,12],[56,0,56,12]]}
[]
["Formulary"]
[]
["Conditions"]
[]
["Temperaturer",null,null,null,null,null,null,null,null,null,null,"Höjd över havet"]
["Värme:",null,null,null,null,"Kyla:",null,null,null,null,null,null,null,null,null,null,"Kopiera all data"]
["Tillopp",null,null,{"$f":"cal!E9","v":75},{"$f":"IF(cal!$X$4=1,\"°C\",IF(cal!$X$4=2,\"°F\"))","v":"°C"},{"$f":"A8","v":"Tillopp"},null,null,null,{"$f":"cal!K9","v":16},{"$f":"E8","v":"°C"},"Enhetssystem",null,null,null,null,"SI-enheter"]
["Retur",null,null,{"$f":"cal!E10","v":65},{"$f":"E8","v":"°C"},{"$f":"A9","v":"Retur"},null,null,null,{"$f":"cal!K10","v":18},{"$f":"E8","v":"°C"},null,null,null,null,null,"Imperiella-enheter"]
["Rum (torr)",null,null,{"$f":"cal!E11","v":20},{"$f":"E8","v":"°C"},{"$f":"A10","v":"Rum (torr)"},null,null,null,{"$f":"cal!K11","v":27},{"$f":"E8","v":"°C"}]
[null,null,null,null,null,"rel. Fuktighet",null,null,null,{"$f":"cal!K12","v":0.5}]
[]
[]
["Fläkthastighet","Spänning, Fläkt [V]",{"$f":"CONCATENATE(\"Värme effekt * \",ROUND(D8,0),\"/\",ROUND(D9,0),\"/\",ROUND(D10,0),\" [\"&IF(cal!$X$4=1,\"W\",IF(cal!$X$4=2,\"Btu/h\"))&\"]\")","v":"Värme effekt * 75/65/20 [W]"},{"$f":"\"Vattenflöde, värme [\"&IF(cal!$X$4=1,\"l/h\",IF(cal!$X$4=2,\"GPM\"))&\"]\"","v":"Vattenflöde, värme [l/h]"},{"$f":"\"Tryckfall, vatten [\"&IF(cal!$X$4=1,\"kPa\",IF(cal!$X$4=2,\"inH2O\"))&\"]\"","v":"Tryckfall, vatten [kPa]"},{"$f":"CONCATENATE(\"Märkbar kylkapacitet * \",ROUND(J8,0),\"/\",ROUND(J9,0),\"/\",ROUND(J10,0),\" [\"&IF(cal!$X$4=1,\"W\",IF(cal!$X$4=2,\"Btu/h\"))&\"]\")","v":"Märkbar kylkapacitet * 16/18/27 [W]"},{"$f":"CONCATENATE(\"Total kylkapacitet \",ROUND(J8,0),\"/\",ROUND(J9,0),\"/\",ROUND(J10,0),\" [\"&IF(cal!$X$4=1,\"W\",IF(cal!$X$4=2,\"Btu/h\"))&\"]\")","v":"Total kylkapacitet 16/18/27 [W]"},{"$f":"\"Vattenflöde, kyla [\"&IF(cal!$X$4=1,\"l/h\",IF(cal!$X$4=2,\"GPM\"))&\"]\"","v":"Vattenflöde, kyla [l/h]"},{"$f":"E14","v":"Tryckfall, vatten [kPa]"},"Ljudtryck *** [dB(A)]","Ljudeffekt ** [dB(A)]","Effektförbrukning [W]",{"$f":"\"Luftflöde [\"&IF(cal!$X$4=1,\"m³/h\",IF(cal!$X$4=2,\"CFM\"))&\"]\"","v":"Luftflöde [m³/h]"},{"$f":"\"Air exhaust temp. heating [\"&IF(cal!$X$4=1,\"°C\",IF(cal!$X$4=2,\"°F\"))&\"]\"","v":"Air exhaust temp. heating [°C]"},{"$f":"\"Air exhaust temp. cooling [\"&IF(cal!$X$4=1,\"°C\",IF(cal!$X$4=2,\"°F\"))&\"]\"","v":"Air exhaust temp. cooling [°C]"}]
[{"$f":"cal!$Z$1&\" \"&$R$15&\" \"&ROUND(cal!Y22,1)&IF(cal!$X$4=1,\" cm\",IF(cal!$X$4=2,\" in\"))&\" \"&$R$16&\" \"&ROUND(cal!AA22,1)&IF(cal!$X$4=1,\" cm\",IF(cal!$X$4=2,\" in\"))&\" \"&$R$17&\" \"&ROUND(cal!AC22,1)&IF(cal!$X$4=1,\" cm\",IF(cal!$X$4=2,\" in\"))&\" (Typ 1)\"","v":"Freedom höjd 20 cm djup 19 cm längd 74 cm (Typ 1)"},null,null,null,null,null,null,null,null,null,null,null,null,null,null,null,"Temp.","höjd"]
[null,null,null,null,null,null,null,null,null,null,null,null,null,null,null,null,"värme!","djup"]
[null,null,null,null,null,null,null,null,null,null,null,null,null,null,null,null,"kyla!","längd"]
[]
[]
[]
[{"$f":"cal!$Z$1&\" \"&$R$15&\" \"&ROUND(cal!Y28,1)&IF(cal!$X$4=1,\" cm\",IF(cal!$X$4=2,\" in\"))&\" \"&$R$16&\" \"&ROUND(cal!AA28,1)&IF(cal!$X$4=1,\" cm\",IF(cal!$X$4=2,\" in\"))&\" \"&$R$17&\" \"&ROUND(cal!AC28,1)&IF(cal!$X$4=1,\" cm\",IF(cal!$X$4=2,\" in\"))&\" (Typ 2)\"","v":"Freedom höjd 20 cm djup 19 cm längd 110 cm (Typ 2)"}]
[]
[]
[]
[]
[]
[{"$f":"cal!$Z$1&\" \"&$R$15&\" \"&ROUND(cal!Y34,1)&IF(cal!$X$4=1,\" cm\",IF(cal!$X$4=2,\" in\"))&\" \"&$R$16&\" \"&ROUND(cal!AA34,1)&IF(cal!$X$4=1,\" cm\",IF(cal!$X$4=2,\" in\"))&\" \"&$R$17&\" \"&ROUND(cal!AC34,1)&IF(cal!$X$4=1,\" cm\",IF(cal!$X$4=2,\" in\"))&\" (Typ 3)\"","v":"Freedom höjd 20 cm djup 19 cm längd 145 cm (Typ 3)"}]
[]
[]
[]
[]
[]
[{"$f":"cal!$Z$1&\" \"&$R$15&\" \"&ROUND(cal!Y40,1)&IF(cal!$X$4=1,\" cm\",IF(cal!$X$4=2,\" in\"))&\" \"&$R$16&\" \"&ROUND(cal!AA40,1)&IF(cal!$X$4=1,\" cm\",IF(cal!$X$4=2,\" in\"))&\" \"&$R$17&\" \"&ROUND(cal!AC40,1)&IF(cal!$X$4=1,\" cm\",IF(cal!$X$4=2,\" in\"))&\" (Typ 4)\"","v":"Freedom höjd 20 cm djup 19 cm längd 181 cm (Typ 4)"}]
[]
[]
[]
[]
[]
[{"$f":"cal!$Z$1&\" \"&$R$15&\" \"&ROUND(cal!Y46,1)&IF(cal!$X$4=1,\" cm\",IF(cal!$X$4=2,\" in\"))&\" \"&$R$16&\" \"&ROUND(cal!AA46,1)&IF(cal!$X$4=1,\" cm\",IF(cal!$X$4=2,\" in\"))&\" \"&$R$17&\" \"&ROUND(cal!AC46,1)&IF(cal!$X$4=1,\" cm\",IF(cal!$X$4=2,\" in\"))&\" (Typ 5)\"","v":"Freedom höjd 0 cm djup 0 cm längd 0 cm (Typ 5)"}]
[]
[]
[]
[]
[]
[{"$f":"cal!$Z$1&\" \"&$R$15&\" \"&ROUND(cal!Y52,1)&IF(cal!$X$4=1,\" cm\",IF(cal!$X$4=2,\" in\"))&\" \"&$R$16&\" \"&ROUND(cal!AA52,1)&IF(cal!$X$4=1,\" cm\",IF(cal!$X$4=2,\" in\"))&\" \"&$R$17&\" \"&ROUND(cal!AC52,1)&IF(cal!$X$4=1,\" cm\",IF(cal!$X$4=2,\" in\"))&\" (Typ 6)\"","v":"Freedom höjd 0 cm djup 0 cm längd 0 cm (Typ 6)"}]
[]
[]
[]
[]
[]
[{"$f":"cal!$Z$1&\" \"&$R$15&\" \"&ROUND(cal!Y58,1)&IF(cal!$X$4=1,\" cm\",IF(cal!$X$4=2,\" in\"))&\" \"&$R$16&\" \"&ROUND(cal!AA58,1)&IF(cal!$X$4=1,\" cm\",IF(cal!$X$4=2,\" in\"))&\" \"&$R$17&\" \"&ROUND(cal!AC58,1)&IF(cal!$X$4=1,\" cm\",IF(cal!$X$4=2,\" in\"))&\" (Typ 7)\"","v":"Freedom höjd 0 cm djup 0 cm längd 0 cm (Typ 7)"}]
[]
[]
[]
[]
[]
[{"$f":"cal!$Z$1&\" \"&$R$15&\" \"&ROUND(cal!Y64,1)&IF(cal!$X$4=1,\" cm\",IF(cal!$X$4=2,\" in\"))&\" \"&$R$16&\" \"&ROUND(cal!AA64,1)&IF(cal!$X$4=1,\" cm\",IF(cal!$X$4=2,\" in\"))&\" \"&$R$17&\" \"&ROUND(cal!AC64,1)&IF(cal!$X$4=1,\" cm\",IF(cal!$X$4=2,\" in\"))&\" (Typ 8)\"","v":"Freedom höjd 0 cm djup 0 cm längd 0 cm (Typ 8)"}]
[]
[]
[]
[]
[]
[{"$f":"cal!$Z$1&\" \"&$R$15&\" \"&ROUND(cal!Y70,1)&IF(cal!$X$4=1,\" cm\",IF(cal!$X$4=2,\" in\"))&\" \"&$R$16&\" \"&ROUND(cal!AA70,1)&IF(cal!$X$4=1,\" cm\",IF(cal!$X$4=2,\" in\"))&\" \"&$R$17&\" \"&ROUND(cal!AC70,1)&IF(cal!$X$4=1,\" cm\",IF(cal!$X$4=2,\" in\"))&\" (Typ 9)\"","v":"Freedom höjd 0 cm djup 0 cm längd 0 cm (Typ 9)"}]
[]
[]
[]
[]
[]
["*Värden enligt EN16430",null,null,null,null,null,null,null,null,null,null,null,{"$f":"cal!N70","v":"v2022-08-26"}]
["**Ljudeffekt enligt ISO 3741: 2010"]
["***Ljudtryck med en antagen rumsdämpning på 8dB (A),"]

{"sheet":"TS","index":9,"n_rows":71,"n_cols":18,"rows_kept":71,"cut":false,"hidden":true,"merged":[[8,0,8,2],[8,5,8,8],[5,11,5,12],[6,11,6,12],[7,0,7,2],[7,5,7,8],[7,11,7,12],[62,0,62,12],[9,0,9,2],[9,5,9,8],[10,5,10,7],[14,0,14,12],[20,0,20,12],[26,0,26,12],[32,0,32,12],[38,0,38,12],[44,0,44,12],[50,0,50,12],[56,0,56,12]]}
[]
["Formulary"]
[]
["Conditions"]
[]
["Teploty",null,null,null,null,null,null,null,null,null,null,"Výška umístění"]
["Topení:",null,null,null,null,"Chlazení:",null,null,null,null,null,null,null,null,null,null,"Kopírovat všechna data"]
["Voda na přívodu",null,null,{"$f":"cal!E9","v":75},{"$f":"IF(cal!$X$4=1,\"°C\",IF(cal!$X$4=2,\"°F\"))","v":"°C"},{"$f":"A8","v":"Voda na přívodu"},null,null,null,{"$f":"cal!K9","v":16},{"$f":"E8","v":"°C"},"Převod jednotek",null,null,null,null,"Mezinárodní (Sl)"]
["Voda na zpátečce",null,null,{"$f":"cal!E10","v":65},{"$f":"E8","v":"°C"},{"$f":"A9","v":"Voda na zpátečce"},null,null,null,{"$f":"cal!K10","v":18},{"$f":"E8","v":"°C"},null,null,null,null,null,"Imperiální"]
["\"Suchá\" Teplota vzduchu",null,null,{"$f":"cal!E11","v":20},{"$f":"E8","v":"°C"},{"$f":"A10","v":"\"Suchá\" Teplota vzduchu"},null,null,null,{"$f":"cal!K11","v":27},{"$f":"E8","v":"°C"}]
[null,null,null,null,null,"Relativní vlhkost",null,null,null,{"$f":"cal!K12","v":0.5}]
[]
[]
["Rychlost","Ovládací napětí [V]",{"$f":"CONCATENATE(\"Výkon Topení * \",ROUND(D8,0),\"/\",ROUND(D9,0),\"/\",ROUND(D10,0),\" [\"&IF(cal!$X$4=1,\"W\",IF(cal!$X$4=2,\"Btu/h\"))&\"]\")","v":"Výkon Topení * 75/65/20 [W]"},{"$f":"\"Průtok vody, topení [\"&IF(cal!$X$4=1,\"l/h\",IF(cal!$X$4=2,\"GPM\"))&\"]\"","v":"Průtok vody, topení [l/h]"},{"$f":"\"Tlaková ztráta [\"&IF(cal!$X$4=1,\"kPa\",IF(cal!$X$4=2,\"inH2O\"))&\"]\"","v":"Tlaková ztráta [kPa]"},{"$f":"CONCATENATE(\"Výkon chlazení Znatelný * \",ROUND(J8,0),\"/\",ROUND(J9,0),\"/\",ROUND(J10,0),\" [\"&IF(cal!$X$4=1,\"W\",IF(cal!$X$4=2,\"Btu/h\"))&\"]\")","v":"Výkon chlazení Znatelný * 16/18/27 [W]"},{"$f":"CONCATENATE(\"Výkon chlazení Celkový \",ROUND(J8,0),\"/\",ROUND(J9,0),\"/\",ROUND(J10,0),\" [\"&IF(cal!$X$4=1,\"W\",IF(cal!$X$4=2,\"Btu/h\"))&\"]\")","v":"Výkon chlazení Celkový 16/18/27 [W]"},{"$f":"\"Průtok vody,chlazení [\"&IF(cal!$X$4=1,\"l/h\",IF(cal!$X$4=2,\"GPM\"))&\"]\"","v":"Průtok vody,chlazení [l/h]"},{"$f":"E14","v":"Tlaková ztráta [kPa]"},"Akustický tlak *** [dB(A)]","Akustický výkon ** [dB(A)]","Elektrický výkon [W]",{"$f":"\"Průtok vzduchu [\"&IF(cal!$X$4=1,\"m³/h\",IF(cal!$X$4=2,\"CFM\"))&\"]\"","v":"Průtok vzduchu [m³/h]"},{"$f":"\"Air exhaust temp. heating [\"&IF(cal!$X$4=1,\"°C\",IF(cal!$X$4=2,\"°F\"))&\"]\"","v":"Air exhaust temp. heating [°C]"},{"$f":"\"Air exhaust temp. cooling [\"&IF(cal!$X$4=1,\"°C\",IF(cal!$X$4=2,\"°F\"))&\"]\"","v":"Air exhaust temp. cooling [°C]"}]
[{"$f":"cal!$Z$1&\", \"&$R$15&\" \"&ROUND(cal!Y22,1)&IF(cal!$X$4=1,\" cm\",IF(cal!$X$4=2,\" in\"))&\", \"&$R$16&\" \"&ROUND(cal!AA22,1)&IF(cal!$X$4=1,\" cm\",IF(cal!$X$4=2,\" in\"))&\", \"&$R$17&\" \"&ROUND(cal!AC22,1)&IF(cal!$X$4=1,\" cm\",IF(cal!$X$4=2,\" in\"))&\" (Typ 1)\"","v":"Freedom, Výška 20 cm, Šířka 19 cm, Délka 74 cm (Typ 1)"},null,null,null,null,null,null,null,null,null,null,null,null,null,null,null,"Teploty","Výška"]
[null,null,null,null,null,null,null,null,null,null,null,null,null,null,null,null,"topení!","Šířka"]
[null,null,null,null,null,null,null,null,null,null,null,null,null,null,null,null,"chlazení!","Délka"]
[]
[]
[]
[{"$f":"cal!$Z$1&\" \"&$R$15&\" \"&ROUND(cal!Y28,1)&IF(cal!$X$4=1,\" cm\",IF(cal!$X$4=2,\" in\"))&\" \"&$R$16&\" \"&ROUND(cal!AA28,1)&IF(cal!$X$4=1,\" cm\",IF(cal!$X$4=2,\" in\"))&\" \"&$R$17&\" \"&ROUND(cal!AC28,1)&IF(cal!$X$4=1,\" cm\",IF(cal!$X$4=2,\" in\"))&\" (Typ 2)\"","v":"Freedom Výška 20 cm Šířka 19 cm Délka 110 cm (Typ 2)"}]
[]
[]
[]
[]
[]
[{"$f":"cal!$Z$1&\" \"&$R$15&\" \"&ROUND(cal!Y34,1)&IF(cal!$X$4=1,\" cm\",IF(cal!$X$4=2,\" in\"))&\" \"&$R$16&\" \"&ROUND(cal!AA34,1)&IF(cal!$X$4=1,\" cm\",IF(cal!$X$4=2,\" in\"))&\" \"&$R$17&\" \"&ROUND(cal!AC34,1)&IF(cal!$X$4=1,\" cm\",IF(cal!$X$4=2,\" in\"))&\" (Type 3)\"","v":"Freedom Výška 20 cm Šířka 19 cm Délka 145 cm (Type 3)"}]
[]
[]
[]
[]
[]
[{"$f":"cal!$Z$1&\" \"&$R$15&\" \"&ROUND(cal!Y40,1)&IF(cal!$X$4=1,\" cm\",IF(cal!$X$4=2,\" in\"))&\" \"&$R$16&\" \"&ROUND(cal!AA40,1)&IF(cal!$X$4=1,\" cm\",IF(cal!$X$4=2,\" in\"))&\" \"&$R$17&\" \"&ROUND(cal!AC40,1)&IF(cal!$X$4=1,\" cm\",IF(cal!$X$4=2,\" in\"))&\" (Typ 4)\"","v":"Freedom Výška 20 cm Šířka 19 cm Délka 181 cm (Typ 4)"}]
[]
[]
[]
[]
[]
[{"$f":"cal!$Z$1&\" \"&$R$15&\" \"&ROUND(cal!Y46,1)&IF(cal!$X$4=1,\" cm\",IF(cal!$X$4=2,\" in\"))&\" \"&$R$16&\" \"&ROUND(cal!AA46,1)&IF(cal!$X$4=1,\" cm\",IF(cal!$X$4=2,\" in\"))&\" \"&$R$17&\" \"&ROUND(cal!AC46,1)&IF(cal!$X$4=1,\" cm\",IF(cal!$X$4=2,\" in\"))&\" (Typ 5)\"","v":"Freedom Výška 0 cm Šířka 0 cm Délka 0 cm (Typ 5)"}]
[]
[]
[]
[]
[]
[{"$f":"cal!$Z$1&\" \"&$R$15&\" \"&ROUND(cal!Y52,1)&IF(cal!$X$4=1,\" cm\",IF(cal!$X$4=2,\" in\"))&\" \"&$R$16&\" \"&ROUND(cal!AA52,1)&IF(cal!$X$4=1,\" cm\",IF(cal!$X$4=2,\" in\"))&\" \"&$R$17&\" \"&ROUND(cal!AC52,1)&IF(cal!$X$4=1,\" cm\",IF(cal!$X$4=2,\" in\"))&\" (Typ 6)\"","v":"Freedom Výška 0 cm Šířka 0 cm Délka 0 cm (Typ 6)"}]
[]
[]
[]
[]
[]
[{"$f":"cal!$Z$1&\" \"&$R$15&\" \"&ROUND(cal!Y58,1)&IF(cal!$X$4=1,\" cm\",IF(cal!$X$4=2,\" in\"))&\" \"&$R$16&\" \"&ROUND(cal!AA58,1)&IF(cal!$X$4=1,\" cm\",IF(cal!$X$4=2,\" in\"))&\" \"&$R$17&\" \"&ROUND(cal!AC58,1)&IF(cal!$X$4=1,\" cm\",IF(cal!$X$4=2,\" in\"))&\" (Typ 7)\"","v":"Freedom Výška 0 cm Šířka 0 cm Délka 0 cm (Typ 7)"}]
[]
[]
[]
[]
[]
[{"$f":"cal!$Z$1&\" \"&$R$15&\" \"&ROUND(cal!Y64,1)&IF(cal!$X$4=1,\" cm\",IF(cal!$X$4=2,\" in\"))&\" \"&$R$16&\" \"&ROUND(cal!AA64,1)&IF(cal!$X$4=1,\" cm\",IF(cal!$X$4=2,\" in\"))&\" \"&$R$17&\" \"&ROUND(cal!AC64,1)&IF(cal!$X$4=1,\" cm\",IF(cal!$X$4=2,\" in\"))&\" (Typ 8)\"","v":"Freedom Výška 0 cm Šířka 0 cm Délka 0 cm (Typ 8)"}]
[]
[]
[]
[]
[]
[{"$f":"cal!$Z$1&\" \"&$R$15&\" \"&ROUND(cal!Y70,1)&IF(cal!$X$4=1,\" cm\",IF(cal!$X$4=2,\" in\"))&\" \"&$R$16&\" \"&ROUND(cal!AA70,1)&IF(cal!$X$4=1,\" cm\",IF(cal!$X$4=2,\" in\"))&\" \"&$R$17&\" \"&ROUND(cal!AC70,1)&IF(cal!$X$4=1,\" cm\",IF(cal!$X$4=2,\" in\"))&\" (Typ 9)\"","v":"Freedom Výška 0 cm Šířka 0 cm Délka 0 cm (Typ 9)"}]
[]
[]
[]
[]
[]
["*Hodnoty podle EN16430",null,null,null,null,null,null,null,null,null,null,null,{"$f":"cal!N70","v":"v2022-08-26"}]
["**Akustický tlak podle ISO 3741:2010"]
["***Akustický výkon s předpokládaným útlumem místnosti 8 dB (A)."]

{"sheet":"ExtraTaal1","index":10,"n_rows":71,"n_cols":18,"rows_kept":71,"cut":false,"hidden":true,"merged":[[8,0,8,2],[8,5,8,8],[5,11,5,12],[6,11,6,12],[7,0,7,2],[7,5,7,8],[7,11,7,12],[62,0,62,12],[9,0,9,2],[9,5,9,8],[10,5,10,7],[14,0,14,12],[20,0,20,12],[26,0,26,12],[32,0,32,12],[38,0,38,12],[44,0,44,12],[50,0,50,12],[56,0,56,12]]}
[]
["Formulary"]
[]
["Conditions"]
[]
["Temperatures",null,null,null,null,null,null,null,null,null,null,"Altitude"]
["Heating:",null,null,null,null,"Cooling:",null,null,null,null,null,null,null,null,null,null,"Copy all data"]
[{"$f":"\"Inlet temp.\"","v":"Inlet temp."},null,null,{"$f":"cal!E9","v":75},{"$f":"IF(cal!$X$4=1,\"°C\",IF(cal!$X$4=2,\"°F\"))","v":"°C"},{"$f":"A8","v":"Inlet temp."},null,null,null,{"$f":"cal!K9","v":16},{"$f":"E8","v":"°C"},"Unit conversion",null,null,null,null,"SI-units"]
[{"$f":"\"Return temp.\"","v":"Return temp."},null,null,{"$f":"cal!E10","v":65},{"$f":"E8","v":"°C"},{"$f":"A9","v":"Return temp."},null,null,null,{"$f":"cal!K10","v":18},{"$f":"E8","v":"°C"},null,null,null,null,null,"Imperial-units"]
[{"$f":"\"Room temp.\"","v":"Room temp."},null,null,{"$f":"cal!E11","v":20},{"$f":"E8","v":"°C"},{"$f":"A10","v":"Room temp."},null,null,null,{"$f":"cal!K11","v":27},{"$f":"E8","v":"°C"}]
[null,null,null,null,null,"Relative humidity",null,null,null,{"$f":"cal!K12","v":0.5}]
[]
[]
["Speed level:","Control voltage [V]",{"$f":"CONCATENATE(\"Heat output * \",ROUND(D8,0),\"/\",ROUND(D9,0),\"/\",ROUND(D10,0),\" [\"&IF(cal!$X$4=1,\"W\",IF(cal!$X$4=2,\"Btu/h\"))&\"]\")","v":"Heat output * 75/65/20 [W]"},{"$f":"\"Water flowrate, heating [\"&IF(cal!$X$4=1,\"l/h\",IF(cal!$X$4=2,\"GPM\"))&\"]\"","v":"Water flowrate, heating [l/h]"},{"$f":"\"Watersided pressure loss [\"&IF(cal!$X$4=1,\"kPa\",IF(cal!$X$4=2,\"inH2O\"))&\"]\"","v":"Watersided pressure loss [kPa]"},{"$f":"CONCATENATE(\"Sens. cooling capacity * \",ROUND(J8,0),\"/\",ROUND(J9,0),\"/\",ROUND(J10,0),\" [\"&IF(cal!$X$4=1,\"W\",IF(cal!$X$4=2,\"Btu/h\"))&\"]\")","v":"Sens. cooling capacity * 16/18/27 [W]"},{"$f":"CONCATENATE(\"Tot. cooling capacity \",ROUND(J8,0),\"/\",ROUND(J9,0),\"/\",ROUND(J10,0),\" [\"&IF(cal!$X$4=1,\"W\",IF(cal!$X$4=2,\"Btu/h\"))&\"]\")","v":"Tot. cooling capacity 16/18/27 [W]"},{"$f":"\"Water flowrate, cooling [\"&IF(cal!$X$4=1,\"l/h\",IF(cal!$X$4=2,\"GPM\"))&\"]\"","v":"Water flowrate, cooling [l/h]"},{"$f":"\"Watersided pressure loss [\"&IF(cal!$X$4=1,\"kPa\",IF(cal!$X$4=2,\"inH2O\"))&\"]\"","v":"Watersided pressure loss [kPa]"},"Sound pressure *** [dB(A)]","Sound power ** [dB(A)]","Electrical power [W]",{"$f":"\"Air flowrate [\"&IF(cal!$X$4=1,\"m³/h\",IF(cal!$X$4=2,\"CFM\"))&\"]\"","v":"Air flowrate [m³/h]"},{"$f":"\"Air exhaust temp. heating [\"&IF(cal!$X$4=1,\"°C\",IF(cal!$X$4=2,\"°F\"))&\"]\"","v":"Air exhaust temp. heating [°C]"},{"$f":"\"Air exhaust temp. cooling [\"&IF(cal!$X$4=1,\"°C\",IF(cal!$X$4=2,\"°F\"))&\"]\"","v":"Air exhaust temp. cooling [°C]"}]
[{"$f":"cal!$Z$1&\" \"&$R$15&\" \"&ROUND(cal!Y22,1)&IF(cal!$X$4=1,\" cm\",IF(cal!$X$4=2,\" in\"))&\" \"&$R$16&\" \"&ROUND(cal!AA22,1)&IF(cal!$X$4=1,\" cm\",IF(cal!$X$4=2,\" in\"))&\" \"&$R$17&\" \"&ROUND(cal!AC22,1)&IF(cal!$X$4=1,\" cm\",IF(cal!$X$4=2,\" in\"))&\" (Type 1)\"","v":"Freedom height 20 cm width 19 cm length 74 cm (Type 1)"},null,null,null,null,null,null,null,null,null,null,null,null,null,null,null,"Temp.","height"]
[null,null,null,null,null,null,null,null,null,null,null,null,null,null,null,null,"heating!","width"]
[null,null,null,null,null,null,null,null,null,null,null,null,null,null,null,null,"cooling!","length"]
[]
[]
[]
[{"$f":"cal!$Z$1&\" \"&$R$15&\" \"&ROUND(cal!Y28,1)&IF(cal!$X$4=1,\" cm\",IF(cal!$X$4=2,\" in\"))&\" \"&$R$16&\" \"&ROUND(cal!AA28,1)&IF(cal!$X$4=1,\" cm\",IF(cal!$X$4=2,\" in\"))&\" \"&$R$17&\" \"&ROUND(cal!AC28,1)&IF(cal!$X$4=1,\" cm\",IF(cal!$X$4=2,\" in\"))&\" (Type 2)\"","v":"Freedom height 20 cm width 19 cm length 110 cm (Type 2)"}]
[]
[]
[]
[]
[]
[{"$f":"cal!$Z$1&\" \"&$R$15&\" \"&ROUND(cal!Y34,1)&IF(cal!$X$4=1,\" cm\",IF(cal!$X$4=2,\" in\"))&\" \"&$R$16&\" \"&ROUND(cal!AA34,1)&IF(cal!$X$4=1,\" cm\",IF(cal!$X$4=2,\" in\"))&\" \"&$R$17&\" \"&ROUND(cal!AC34,1)&IF(cal!$X$4=1,\" cm\",IF(cal!$X$4=2,\" in\"))&\" (Type 3)\"","v":"Freedom height 20 cm width 19 cm length 145 cm (Type 3)"}]
[]
[]
[]
[]
[]
[{"$f":"cal!$Z$1&\" \"&$R$15&\" \"&ROUND(cal!Y40,1)&IF(cal!$X$4=1,\" cm\",IF(cal!$X$4=2,\" in\"))&\" \"&$R$16&\" \"&ROUND(cal!AA40,1)&IF(cal!$X$4=1,\" cm\",IF(cal!$X$4=2,\" in\"))&\" \"&$R$17&\" \"&ROUND(cal!AC40,1)&IF(cal!$X$4=1,\" cm\",IF(cal!$X$4=2,\" in\"))&\" (Type 4)\"","v":"Freedom height 20 cm width 19 cm length 181 cm (Type 4)"}]
[]
[]
[]
[]
[]
[{"$f":"cal!$Z$1&\" \"&$R$15&\" \"&ROUND(cal!Y46,1)&IF(cal!$X$4=1,\" cm\",IF(cal!$X$4=2,\" in\"))&\" \"&$R$16&\" \"&ROUND(cal!AA46,1)&IF(cal!$X$4=1,\" cm\",IF(cal!$X$4=2,\" in\"))&\" \"&$R$17&\" \"&ROUND(cal!AC46,1)&IF(cal!$X$4=1,\" cm\",IF(cal!$X$4=2,\" in\"))&\" (Type 5)\"","v":"Freedom height 0 cm width 0 cm length 0 cm (Type 5)"}]
[]
[]
[]
[]
[]
[{"$f":"cal!$Z$1&\" \"&$R$15&\" \"&ROUND(cal!Y52,1)&IF(cal!$X$4=1,\" cm\",IF(cal!$X$4=2,\" in\"))&\" \"&$R$16&\" \"&ROUND(cal!AA52,1)&IF(cal!$X$4=1,\" cm\",IF(cal!$X$4=2,\" in\"))&\" \"&$R$17&\" \"&ROUND(cal!AC52,1)&IF(cal!$X$4=1,\" cm\",IF(cal!$X$4=2,\" in\"))&\" (Type 6)\"","v":"Freedom height 0 cm width 0 cm length 0 cm (Type 6)"}]
[]
[]
[]
[]
[]
[{"$f":"cal!$Z$1&\" \"&$R$15&\" \"&ROUND(cal!Y58,1)&IF(cal!$X$4=1,\" cm\",IF(cal!$X$4=2,\" in\"))&\" \"&$R$16&\" \"&ROUND(cal!AA58,1)&IF(cal!$X$4=1,\" cm\",IF(cal!$X$4=2,\" in\"))&\" \"&$R$17&\" \"&ROUND(cal!AC58,1)&IF(cal!$X$4=1,\" cm\",IF(cal!$X$4=2,\" in\"))&\" (Type 7)\"","v":"Freedom height 0 cm width 0 cm length 0 cm (Type 7)"}]
[]
[]
[]
[]
[]
[{"$f":"cal!$Z$1&\" \"&$R$15&\" \"&ROUND(cal!Y64,1)&IF(cal!$X$4=1,\" cm\",IF(cal!$X$4=2,\" in\"))&\" \"&$R$16&\" \"&ROUND(cal!AA64,1)&IF(cal!$X$4=1,\" cm\",IF(cal!$X$4=2,\" in\"))&\" \"&$R$17&\" \"&ROUND(cal!AC64,1)&IF(cal!$X$4=1,\" cm\",IF(cal!$X$4=2,\" in\"))&\" (Type 8)\"","v":"Freedom height 0 cm width 0 cm length 0 cm (Type 8)"}]
[]
[]
[]
[]
[]
[{"$f":"cal!$Z$1&\" \"&$R$15&\" \"&ROUND(cal!Y70,1)&IF(cal!$X$4=1,\" cm\",IF(cal!$X$4=2,\" in\"))&\" \"&$R$16&\" \"&ROUND(cal!AA70,1)&IF(cal!$X$4=1,\" cm\",IF(cal!$X$4=2,\" in\"))&\" \"&$R$17&\" \"&ROUND(cal!AC70,1)&IF(cal!$X$4=1,\" cm\",IF(cal!$X$4=2,\" in\"))&\" (Type 9)\"","v":"Freedom height 0 cm width 0 cm length 0 cm (Type 9)"}]
[]
[]
[]
[]
[]
["*Values according to EN 16430",null,null,null,null,null,null,null,null,null,null,null,{"$f":"cal!N70","v":"v2022-08-26"}]
["**Sound power according to ISO 3741:2010"]
["***Sound pressure with an assumed room damping of 8dB(A)"]

{"sheet":"ExtraTaal2","index":11,"n_rows":71,"n_cols":18,"rows_kept":71,"cut":false,"hidden":true,"merged":[[8,0,8,2],[8,5,8,8],[5,11,5,12],[6,11,6,12],[7,0,7,2],[7,5,7,8],[7,11,7,12],[62,0,62,12],[9,0,9,2],[9,5,9,8],[10,5,10,7],[14,0,14,12],[20,0,20,12],[26,0,26,12],[32,0,32,12],[38,0,38,12],[44,0,44,12],[50,0,50,12],[56,0,56,12]]}
[]
["Formulary"]
[]
["Conditions"]
[]
["Temperatures",null,null,null,null,null,null,null,null,null,null,"Altitude"]
["Heating:",null,null,null,null,"Cooling:",null,null,null,null,null,null,null,null,null,null,"Copy all data"]
[{"$f":"\"Inlet temp.\"","v":"Inlet temp."},null,null,{"$f":"cal!E9","v":75},{"$f":"IF(cal!$X$4=1,\"°C\",IF(cal!$X$4=2,\"°F\"))","v":"°C"},{"$f":"A8","v":"Inlet temp."},null,null,null,{"$f":"cal!K9","v":16},{"$f":"E8","v":"°C"},"Unit conversion",null,null,null,null,"SI-units"]
[{"$f":"\"Return temp.\"","v":"Return temp."},null,null,{"$f":"cal!E10","v":65},{"$f":"E8","v":"°C"},{"$f":"A9","v":"Return temp."},null,null,null,{"$f":"cal!K10","v":18},{"$f":"E8","v":"°C"},null,null,null,null,null,"Imperial-units"]
[{"$f":"\"Room temp.\"","v":"Room temp."},null,null,{"$f":"cal!E11","v":20},{"$f":"E8","v":"°C"},{"$f":"A10","v":"Room temp."},null,null,null,{"$f":"cal!K11","v":27},{"$f":"E8","v":"°C"}]
[null,null,null,null,null,"Relative humidity",null,null,null,{"$f":"cal!K12","v":0.5}]
[]
[]
["Speed level:","Control voltage [V]",{"$f":"CONCATENATE(\"Heat output * \",ROUND(D8,0),\"/\",ROUND(D9,0),\"/\",ROUND(D10,0),\" [\"&IF(cal!$X$4=1,\"W\",IF(cal!$X$4=2,\"Btu/h\"))&\"]\")","v":"Heat output * 75/65/20 [W]"},{"$f":"\"Water flowrate, heating [\"&IF(cal!$X$4=1,\"l/h\",IF(cal!$X$4=2,\"GPM\"))&\"]\"","v":"Water flowrate, heating [l/h]"},{"$f":"\"Watersided pressure loss [\"&IF(cal!$X$4=1,\"kPa\",IF(cal!$X$4=2,\"inH2O\"))&\"]\"","v":"Watersided pressure loss [kPa]"},{"$f":"CONCATENATE(\"Sens. cooling capacity * \",ROUND(J8,0),\"/\",ROUND(J9,0),\"/\",ROUND(J10,0),\" [\"&IF(cal!$X$4=1,\"W\",IF(cal!$X$4=2,\"Btu/h\"))&\"]\")","v":"Sens. cooling capacity * 16/18/27 [W]"},{"$f":"CONCATENATE(\"Tot. cooling capacity \",ROUND(J8,0),\"/\",ROUND(J9,0),\"/\",ROUND(J10,0),\" [\"&IF(cal!$X$4=1,\"W\",IF(cal!$X$4=2,\"Btu/h\"))&\"]\")","v":"Tot. cooling capacity 16/18/27 [W]"},{"$f":"\"Water flowrate, cooling [\"&IF(cal!$X$4=1,\"l/h\",IF(cal!$X$4=2,\"GPM\"))&\"]\"","v":"Water flowrate, cooling [l/h]"},{"$f":"\"Watersided pressure loss [\"&IF(cal!$X$4=1,\"kPa\",IF(cal!$X$4=2,\"inH2O\"))&\"]\"","v":"Watersided pressure loss [kPa]"},"Sound pressure *** [dB(A)]","Sound power ** [dB(A)]","Electrical power [W]",{"$f":"\"Air flowrate [\"&IF(cal!$X$4=1,\"m³/h\",IF(cal!$X$4=2,\"CFM\"))&\"]\"","v":"Air flowrate [m³/h]"},{"$f":"\"Air exhaust temp. heating [\"&IF(cal!$X$4=1,\"°C\",IF(cal!$X$4=2,\"°F\"))&\"]\"","v":"Air exhaust temp. heating [°C]"},{"$f":"\"Air exhaust temp. cooling [\"&IF(cal!$X$4=1,\"°C\",IF(cal!$X$4=2,\"°F\"))&\"]\"","v":"Air exhaust temp. cooling [°C]"}]
[{"$f":"cal!$Z$1&\" \"&$R$15&\" \"&ROUND(cal!Y22,1)&IF(cal!$X$4=1,\" cm\",IF(cal!$X$4=2,\" in\"))&\" \"&$R$16&\" \"&ROUND(cal!AA22,1)&IF(cal!$X$4=1,\" cm\",IF(cal!$X$4=2,\" in\"))&\" \"&$R$17&\" \"&ROUND(cal!AC22,1)&IF(cal!$X$4=1,\" cm\",IF(cal!$X$4=2,\" in\"))&\" (Type 1)\"","v":"Freedom height 20 cm width 19 cm length 74 cm (Type 1)"},null,null,null,null,null,null,null,null,null,null,null,null,null,null,null,"Temp.","height"]
[null,null,null,null,null,null,null,null,null,null,null,null,null,null,null,null,"heating!","width"]
[null,null,null,null,null,null,null,null,null,null,null,null,null,null,null,null,"cooling!","length"]
[]
[]
[]
[{"$f":"cal!$Z$1&\" \"&$R$15&\" \"&ROUND(cal!Y28,1)&IF(cal!$X$4=1,\" cm\",IF(cal!$X$4=2,\" in\"))&\" \"&$R$16&\" \"&ROUND(cal!AA28,1)&IF(cal!$X$4=1,\" cm\",IF(cal!$X$4=2,\" in\"))&\" \"&$R$17&\" \"&ROUND(cal!AC28,1)&IF(cal!$X$4=1,\" cm\",IF(cal!$X$4=2,\" in\"))&\" (Type 2)\"","v":"Freedom height 20 cm width 19 cm length 110 cm (Type 2)"}]
[]
[]
[]
[]
[]
[{"$f":"cal!$Z$1&\" \"&$R$15&\" \"&ROUND(cal!Y34,1)&IF(cal!$X$4=1,\" cm\",IF(cal!$X$4=2,\" in\"))&\" \"&$R$16&\" \"&ROUND(cal!AA34,1)&IF(cal!$X$4=1,\" cm\",IF(cal!$X$4=2,\" in\"))&\" \"&$R$17&\" \"&ROUND(cal!AC34,1)&IF(cal!$X$4=1,\" cm\",IF(cal!$X$4=2,\" in\"))&\" (Type 3)\"","v":"Freedom height 20 cm width 19 cm length 145 cm (Type 3)"}]
[]
[]
[]
[]
[]
[{"$f":"cal!$Z$1&\" \"&$R$15&\" \"&ROUND(cal!Y40,1)&IF(cal!$X$4=1,\" cm\",IF(cal!$X$4=2,\" in\"))&\" \"&$R$16&\" \"&ROUND(cal!AA40,1)&IF(cal!$X$4=1,\" cm\",IF(cal!$X$4=2,\" in\"))&\" \"&$R$17&\" \"&ROUND(cal!AC40,1)&IF(cal!$X$4=1,\" cm\",IF(cal!$X$4=2,\" in\"))&\" (Type 4)\"","v":"Freedom height 20 cm width 19 cm length 181 cm (Type 4)"}]
[]
[]
[]
[]
[]
[{"$f":"cal!$Z$1&\" \"&$R$15&\" \"&ROUND(cal!Y46,1)&IF(cal!$X$4=1,\" cm\",IF(cal!$X$4=2,\" in\"))&\" \"&$R$16&\" \"&ROUND(cal!AA46,1)&IF(cal!$X$4=1,\" cm\",IF(cal!$X$4=2,\" in\"))&\" \"&$R$17&\" \"&ROUND(cal!AC46,1)&IF(cal!$X$4=1,\" cm\",IF(cal!$X$4=2,\" in\"))&\" (Type 5)\"","v":"Freedom height 0 cm width 0 cm length 0 cm (Type 5)"}]
[]
[]
[]
[]
[]
[{"$f":"cal!$Z$1&\" \"&$R$15&\" \"&ROUND(cal!Y52,1)&IF(cal!$X$4=1,\" cm\",IF(cal!$X$4=2,\" in\"))&\" \"&$R$16&\" \"&ROUND(cal!AA52,1)&IF(cal!$X$4=1,\" cm\",IF(cal!$X$4=2,\" in\"))&\" \"&$R$17&\" \"&ROUND(cal!AC52,1)&IF(cal!$X$4=1,\" cm\",IF(cal!$X$4=2,\" in\"))&\" (Type 6)\"","v":"Freedom height 0 cm width 0 cm length 0 cm (Type 6)"}]
[]
[]
[]
[]
[]
[{"$f":"cal!$Z$1&\" \"&$R$15&\" \"&ROUND(cal!Y58,1)&IF(cal!$X$4=1,\" cm\",IF(cal!$X$4=2,\" in\"))&\" \"&$R$16&\" \"&ROUND(cal!AA58,1)&IF(cal!$X$4=1,\" cm\",IF(cal!$X$4=2,\" in\"))&\" \"&$R$17&\" \"&ROUND(cal!AC58,1)&IF(cal!$X$4=1,\" cm\",IF(cal!$X$4=2,\" in\"))&\" (Type 7)\"","v":"Freedom height 0 cm width 0 cm length 0 cm (Type 7)"}]
[]
[]
[]
[]
[]
[{"$f":"cal!$Z$1&\" \"&$R$15&\" \"&ROUND(cal!Y64,1)&IF(cal!$X$4=1,\" cm\",IF(cal!$X$4=2,\" in\"))&\" \"&$R$16&\" \"&ROUND(cal!AA64,1)&IF(cal!$X$4=1,\" cm\",IF(cal!$X$4=2,\" in\"))&\" \"&$R$17&\" \"&ROUND(cal!AC64,1)&IF(cal!$X$4=1,\" cm\",IF(cal!$X$4=2,\" in\"))&\" (Type 8)\"","v":"Freedom height 0 cm width 0 cm length 0 cm (Type 8)"}]
[]
[]
[]
[]
[]
[{"$f":"cal!$Z$1&\" \"&$R$15&\" \"&ROUND(cal!Y70,1)&IF(cal!$X$4=1,\" cm\",IF(cal!$X$4=2,\" in\"))&\" \"&$R$16&\" \"&ROUND(cal!AA70,1)&IF(cal!$X$4=1,\" cm\",IF(cal!$X$4=2,\" in\"))&\" \"&$R$17&\" \"&ROUND(cal!AC70,1)&IF(cal!$X$4=1,\" cm\",IF(cal!$X$4=2,\" in\"))&\" (Type 9)\"","v":"Freedom height 0 cm width 0 cm length 0 cm (Type 9)"}]
[]
[]
[]
[]
[]
["*Values according to EN 16430",null,null,null,null,null,null,null,null,null,null,null,{"$f":"cal!N70","v":"v2022-08-26"}]
["**Sound power according to ISO 3741:2010"]
["***Sound pressure with an assumed room damping of 8dB(A)"]

{"sheet":"ExtraTaal3","index":12,"n_rows":71,"n_cols":18,"rows_kept":71,"cut":false,"hidden":true,"merged":[[8,0,8,2],[8,5,8,8],[5,11,5,12],[6,11,6,12],[7,0,7,2],[7,5,7,8],[7,11,7,12],[62,0,62,12],[9,0,9,2],[9,5,9,8],[10,5,10,7],[14,0,14,12],[20,0,20,12],[26,0,26,12],[32,0,32,12],[38,0,38,12],[44,0,44,12],[50,0,50,12],[56,0,56,12]]}
[]
["Formulary"]
[]
["Conditions"]
[]
["Temperatures",null,null,null,null,null,null,null,null,null,null,"Altitude"]
["Heating:",null,null,null,null,"Cooling:",null,null,null,null,null,null,null,null,null,null,"Copy all data"]
[{"$f":"\"Inlet temp.\"","v":"Inlet temp."},null,null,{"$f":"cal!E9","v":75},{"$f":"IF(cal!$X$4=1,\"°C\",IF(cal!$X$4=2,\"°F\"))","v":"°C"},{"$f":"A8","v":"Inlet temp."},null,null,null,{"$f":"cal!K9","v":16},{"$f":"E8","v":"°C"},"Unit conversion",null,null,null,null,"SI-units"]
[{"$f":"\"Return temp.\"","v":"Return temp."},null,null,{"$f":"cal!E10","v":65},{"$f":"E8","v":"°C"},{"$f":"A9","v":"Return temp."},null,null,null,{"$f":"cal!K10","v":18},{"$f":"E8","v":"°C"},null,null,null,null,null,"Imperial-units"]
[{"$f":"\"Room temp.\"","v":"Room temp."},null,null,{"$f":"cal!E11","v":20},{"$f":"E8","v":"°C"},{"$f":"A10","v":"Room temp."},null,null,null,{"$f":"cal!K11","v":27},{"$f":"E8","v":"°C"}]
[null,null,null,null,null,"Relative humidity",null,null,null,{"$f":"cal!K12","v":0.5}]
[]
[]
["Speed level:","Control voltage [V]",{"$f":"CONCATENATE(\"Heat output * \",ROUND(D8,0),\"/\",ROUND(D9,0),\"/\",ROUND(D10,0),\" [\"&IF(cal!$X$4=1,\"W\",IF(cal!$X$4=2,\"Btu/h\"))&\"]\")","v":"Heat output * 75/65/20 [W]"},{"$f":"\"Water flowrate, heating [\"&IF(cal!$X$4=1,\"l/h\",IF(cal!$X$4=2,\"GPM\"))&\"]\"","v":"Water flowrate, heating [l/h]"},{"$f":"\"Watersided pressure loss [\"&IF(cal!$X$4=1,\"kPa\",IF(cal!$X$4=2,\"inH2O\"))&\"]\"","v":"Watersided pressure loss [kPa]"},{"$f":"CONCATENATE(\"Sens. cooling capacity * \",ROUND(J8,0),\"/\",ROUND(J9,0),\"/\",ROUND(J10,0),\" [\"&IF(cal!$X$4=1,\"W\",IF(cal!$X$4=2,\"Btu/h\"))&\"]\")","v":"Sens. cooling capacity * 16/18/27 [W]"},{"$f":"CONCATENATE(\"Tot. cooling capacity \",ROUND(J8,0),\"/\",ROUND(J9,0),\"/\",ROUND(J10,0),\" [\"&IF(cal!$X$4=1,\"W\",IF(cal!$X$4=2,\"Btu/h\"))&\"]\")","v":"Tot. cooling capacity 16/18/27 [W]"},{"$f":"\"Water flowrate, cooling [\"&IF(cal!$X$4=1,\"l/h\",IF(cal!$X$4=2,\"GPM\"))&\"]\"","v":"Water flowrate, cooling [l/h]"},{"$f":"\"Watersided pressure loss [\"&IF(cal!$X$4=1,\"kPa\",IF(cal!$X$4=2,\"inH2O\"))&\"]\"","v":"Watersided pressure loss [kPa]"},"Sound pressure *** [dB(A)]","Sound power ** [dB(A)]","Electrical power [W]",{"$f":"\"Air flowrate [\"&IF(cal!$X$4=1,\"m³/h\",IF(cal!$X$4=2,\"CFM\"))&\"]\"","v":"Air flowrate [m³/h]"},{"$f":"\"Air exhaust temp. heating [\"&IF(cal!$X$4=1,\"°C\",IF(cal!$X$4=2,\"°F\"))&\"]\"","v":"Air exhaust temp. heating [°C]"},{"$f":"\"Air exhaust temp. cooling [\"&IF(cal!$X$4=1,\"°C\",IF(cal!$X$4=2,\"°F\"))&\"]\"","v":"Air exhaust temp. cooling [°C]"}]
[{"$f":"cal!$Z$1&\" \"&$R$15&\" \"&ROUND(cal!Y22,1)&IF(cal!$X$4=1,\" cm\",IF(cal!$X$4=2,\" in\"))&\" \"&$R$16&\" \"&ROUND(cal!AA22,1)&IF(cal!$X$4=1,\" cm\",IF(cal!$X$4=2,\" in\"))&\" \"&$R$17&\" \"&ROUND(cal!AC22,1)&IF(cal!$X$4=1,\" cm\",IF(cal!$X$4=2,\" in\"))&\" (Type 1)\"","v":"Freedom height 20 cm width 19 cm length 74 cm (Type 1)"},null,null,null,null,null,null,null,null,null,null,null,null,null,null,null,"Temp.","height"]
[null,null,null,null,null,null,null,null,null,null,null,null,null,null,null,null,"heating!","width"]
[null,null,null,null,null,null,null,null,null,null,null,null,null,null,null,null,"cooling!","length"]
[]
[]
[]
[{"$f":"cal!$Z$1&\" \"&$R$15&\" \"&ROUND(cal!Y28,1)&IF(cal!$X$4=1,\" cm\",IF(cal!$X$4=2,\" in\"))&\" \"&$R$16&\" \"&ROUND(cal!AA28,1)&IF(cal!$X$4=1,\" cm\",IF(cal!$X$4=2,\" in\"))&\" \"&$R$17&\" \"&ROUND(cal!AC28,1)&IF(cal!$X$4=1,\" cm\",IF(cal!$X$4=2,\" in\"))&\" (Type 2)\"","v":"Freedom height 20 cm width 19 cm length 110 cm (Type 2)"}]
[]
[]
[]
[]
[]
[{"$f":"cal!$Z$1&\" \"&$R$15&\" \"&ROUND(cal!Y34,1)&IF(cal!$X$4=1,\" cm\",IF(cal!$X$4=2,\" in\"))&\" \"&$R$16&\" \"&ROUND(cal!AA34,1)&IF(cal!$X$4=1,\" cm\",IF(cal!$X$4=2,\" in\"))&\" \"&$R$17&\" \"&ROUND(cal!AC34,1)&IF(cal!$X$4=1,\" cm\",IF(cal!$X$4=2,\" in\"))&\" (Type 3)\"","v":"Freedom height 20 cm width 19 cm length 145 cm (Type 3)"}]
[]
[]
[]
[]
[]
[{"$f":"cal!$Z$1&\" \"&$R$15&\" \"&ROUND(cal!Y40,1)&IF(cal!$X$4=1,\" cm\",IF(cal!$X$4=2,\" in\"))&\" \"&$R$16&\" \"&ROUND(cal!AA40,1)&IF(cal!$X$4=1,\" cm\",IF(cal!$X$4=2,\" in\"))&\" \"&$R$17&\" \"&ROUND(cal!AC40,1)&IF(cal!$X$4=1,\" cm\",IF(cal!$X$4=2,\" in\"))&\" (Type 4)\"","v":"Freedom height 20 cm width 19 cm length 181 cm (Type 4)"}]
[]
[]
[]
[]
[]
[{"$f":"cal!$Z$1&\" \"&$R$15&\" \"&ROUND(cal!Y46,1)&IF(cal!$X$4=1,\" cm\",IF(cal!$X$4=2,\" in\"))&\" \"&$R$16&\" \"&ROUND(cal!AA46,1)&IF(cal!$X$4=1,\" cm\",IF(cal!$X$4=2,\" in\"))&\" \"&$R$17&\" \"&ROUND(cal!AC46,1)&IF(cal!$X$4=1,\" cm\",IF(cal!$X$4=2,\" in\"))&\" (Type 5)\"","v":"Freedom height 0 cm width 0 cm length 0 cm (Type 5)"}]
[]
[]
[]
[]
[]
[{"$f":"cal!$Z$1&\" \"&$R$15&\" \"&ROUND(cal!Y52,1)&IF(cal!$X$4=1,\" cm\",IF(cal!$X$4=2,\" in\"))&\" \"&$R$16&\" \"&ROUND(cal!AA52,1)&IF(cal!$X$4=1,\" cm\",IF(cal!$X$4=2,\" in\"))&\" \"&$R$17&\" \"&ROUND(cal!AC52,1)&IF(cal!$X$4=1,\" cm\",IF(cal!$X$4=2,\" in\"))&\" (Type 6)\"","v":"Freedom height 0 cm width 0 cm length 0 cm (Type 6)"}]
[]
[]
[]
[]
[]
[{"$f":"cal!$Z$1&\" \"&$R$15&\" \"&ROUND(cal!Y58,1)&IF(cal!$X$4=1,\" cm\",IF(cal!$X$4=2,\" in\"))&\" \"&$R$16&\" \"&ROUND(cal!AA58,1)&IF(cal!$X$4=1,\" cm\",IF(cal!$X$4=2,\" in\"))&\" \"&$R$17&\" \"&ROUND(cal!AC58,1)&IF(cal!$X$4=1,\" cm\",IF(cal!$X$4=2,\" in\"))&\" (Type 7)\"","v":"Freedom height 0 cm width 0 cm length 0 cm (Type 7)"}]
[]
[]
[]
[]
[]
[{"$f":"cal!$Z$1&\" \"&$R$15&\" \"&ROUND(cal!Y64,1)&IF(cal!$X$4=1,\" cm\",IF(cal!$X$4=2,\" in\"))&\" \"&$R$16&\" \"&ROUND(cal!AA64,1)&IF(cal!$X$4=1,\" cm\",IF(cal!$X$4=2,\" in\"))&\" \"&$R$17&\" \"&ROUND(cal!AC64,1)&IF(cal!$X$4=1,\" cm\",IF(cal!$X$4=2,\" in\"))&\" (Type 8)\"","v":"Freedom height 0 cm width 0 cm length 0 cm (Type 8)"}]
[]
[]
[]
[]
[]
[{"$f":"cal!$Z$1&\" \"&$R$15&\" \"&ROUND(cal!Y70,1)&IF(cal!$X$4=1,\" cm\",IF(cal!$X$4=2,\" in\"))&\" \"&$R$16&\" \"&ROUND(cal!AA70,1)&IF(cal!$X$4=1,\" cm\",IF(cal!$X$4=2,\" in\"))&\" \"&$R$17&\" \"&ROUND(cal!AC70,1)&IF(cal!$X$4=1,\" cm\",IF(cal!$X$4=2,\" in\"))&\" (Type 9)\"","v":"Freedom height 0 cm width 0 cm length 0 cm (Type 9)"}]
[]
[]
[]
[]
[]
["*Values according to EN 16430",null,null,null,null,null,null,null,null,null,null,null,{"$f":"cal!N70","v":"v2022-08-26"}]
["**Sound power according to ISO 3741:2010"]
["***Sound pressure with an assumed room damping of 8dB(A)"]